Build Spring Cloud Data Flow

Build: #3478 failed Changes by Janne Valkealahti

Build result summary

Details

Completed
Duration
4 minutes
Labels
None
Agent
bamboo-23.af.pivotal.io
Revision
a2986830f505355f1ed049633a6712f7c78cc73d a2986830f505355f1ed049633a6712f7c78cc73d
Total tests
744
Fixed in
#3481 (Manual run by Janne Valkealahti)

Tests

Responsible

Code commits

Author Commit Message Commit date
Janne Valkealahti Janne Valkealahti a2986830f505355f1ed049633a6712f7c78cc73d a2986830f505355f1ed049633a6712f7c78cc73d Change to deployer, skipper and ui snapshots
Janne Valkealahti Janne Valkealahti c909d922ab2c9e3668ba6f7bcc3baa8e78789f9c c909d922ab2c9e3668ba6f7bcc3baa8e78789f9c Change to spring-cloud-build RC2

Tests

New test failures 311
Status Test View job Duration
Collapse Failed TabOnTapCompletionProviderTests testAppNamesAfterStreamName History
Build and install SCDF < 1 sec
java.lang.IllegalStateException: Failed to load ApplicationContext
Caused by: org.springframework.beans.factory.UnsatisfiedDependencyException: Error creating bean with name 'taskService' defined in org.springframework.cloud.dataflow.server.configuration.TestDependencies: Unsatisfied dependency expressed through method 'taskService' parameter 0; nested exception is org.springframework.beans.factory.NoSuchBeanDefinitionException: No qualifying bean of type 'org.springframework.cloud.dataflow.server.job.LauncherRepository' available: expected at least 1 bean which qualifies as autowire candidate. Dependency annotations: {}
Caused by: org.springframework.beans.factory.NoSuchBeanDefinitionException: No qualifying bean of type 'org.springframework.cloud.dataflow.server.job.LauncherRepository' available: expected at least 1 bean which qualifies as autowire candidate. Dependency annotations: {}
Collapse Failed TabOnTapCompletionProviderTests testAppNamesAfterStreamNameWithDotAfterStreamName History
Build and install SCDF < 1 sec
java.lang.IllegalStateException: Failed to load ApplicationContext
Caused by: org.springframework.beans.factory.UnsatisfiedDependencyException: Error creating bean with name 'taskService' defined in org.springframework.cloud.dataflow.server.configuration.TestDependencies: Unsatisfied dependency expressed through method 'taskService' parameter 0; nested exception is org.springframework.beans.factory.NoSuchBeanDefinitionException: No qualifying bean of type 'org.springframework.cloud.dataflow.server.job.LauncherRepository' available: expected at least 1 bean which qualifies as autowire candidate. Dependency annotations: {}
Caused by: org.springframework.beans.factory.NoSuchBeanDefinitionException: No qualifying bean of type 'org.springframework.cloud.dataflow.server.job.LauncherRepository' available: expected at least 1 bean which qualifies as autowire candidate. Dependency annotations: {}
Collapse Failed TabOnTapCompletionProviderTests testStreamNameAfterColon History
Build and install SCDF < 1 sec
java.lang.IllegalStateException: Failed to load ApplicationContext
Caused by: org.springframework.beans.factory.UnsatisfiedDependencyException: Error creating bean with name 'taskService' defined in org.springframework.cloud.dataflow.server.configuration.TestDependencies: Unsatisfied dependency expressed through method 'taskService' parameter 0; nested exception is org.springframework.beans.factory.NoSuchBeanDefinitionException: No qualifying bean of type 'org.springframework.cloud.dataflow.server.job.LauncherRepository' available: expected at least 1 bean which qualifies as autowire candidate. Dependency annotations: {}
Caused by: org.springframework.beans.factory.NoSuchBeanDefinitionException: No qualifying bean of type 'org.springframework.cloud.dataflow.server.job.LauncherRepository' available: expected at least 1 bean which qualifies as autowire candidate. Dependency annotations: {}
Collapse Failed DataFlowServerConfigurationTests testNoServer History
Build and install SCDF < 1 sec
org.springframework.beans.factory.UnsatisfiedDependencyException: Error creating bean with name 'taskService' defined in org.springframework.cloud.dataflow.server.config.features.TaskConfiguration: Unsatisfied dependency expressed through method 'taskService' parameter 0; nested exception is org.springframework.beans.factory.NoSuchBeanDefinitionException: No qualifying bean of type 'org.springframework.cloud.dataflow.server.job.LauncherRepository' available: expected at least 1 bean which qualifies as autowire candidate. Dependency annotations: {}
	at org.springframework.cloud.dataflow.server.config.DataFlowServerConfigurationTests.testNoServer(DataFlowServerConfigurationTests.java:145)
Caused by: org.springframework.beans.factory.NoSuchBeanDefinitionException: No qualifying bean of type 'org.springframework.cloud.dataflow.server.job.LauncherRepository' available: expected at least 1 bean which qualifies as autowire candidate. Dependency annotations: {}
	at org.springframework.cloud.dataflow.server.config.DataFlowServerConfigurationTests.testNoServer(DataFlowServerConfigurationTests.java:145)
Collapse Failed DataFlowServerConfigurationTests testSkipperConfig History
Build and install SCDF < 1 sec
org.springframework.beans.factory.UnsatisfiedDependencyException: Error creating bean with name 'taskService' defined in org.springframework.cloud.dataflow.server.config.features.TaskConfiguration: Unsatisfied dependency expressed through method 'taskService' parameter 0; nested exception is org.springframework.beans.factory.NoSuchBeanDefinitionException: No qualifying bean of type 'org.springframework.cloud.dataflow.server.job.LauncherRepository' available: expected at least 1 bean which qualifies as autowire candidate. Dependency annotations: {}
	at org.springframework.cloud.dataflow.server.config.DataFlowServerConfigurationTests.testSkipperConfig(DataFlowServerConfigurationTests.java:152)
Caused by: org.springframework.beans.factory.NoSuchBeanDefinitionException: No qualifying bean of type 'org.springframework.cloud.dataflow.server.job.LauncherRepository' available: expected at least 1 bean which qualifies as autowire candidate. Dependency annotations: {}
	at org.springframework.cloud.dataflow.server.config.DataFlowServerConfigurationTests.testSkipperConfig(DataFlowServerConfigurationTests.java:152)
Collapse Failed DefaultEnvironmentPostProcessorTests testOverridingDefaultsWithAConfigFile History
Build and install SCDF 2 secs
org.springframework.beans.factory.UnsatisfiedDependencyException: Error creating bean with name 'taskService' defined in class path resource [org/springframework/cloud/dataflow/server/config/features/TaskConfiguration.class]: Unsatisfied dependency expressed through method 'taskService' parameter 0; nested exception is org.springframework.beans.factory.NoSuchBeanDefinitionException: No qualifying bean of type 'org.springframework.cloud.dataflow.server.job.LauncherRepository' available: expected at least 1 bean which qualifies as autowire candidate. Dependency annotations: {}
	at org.springframework.cloud.dataflow.server.config.DefaultEnvironmentPostProcessorTests.testOverridingDefaultsWithAConfigFile(DefaultEnvironmentPostProcessorTests.java:65)
Caused by: org.springframework.beans.factory.NoSuchBeanDefinitionException: No qualifying bean of type 'org.springframework.cloud.dataflow.server.job.LauncherRepository' available: expected at least 1 bean which qualifies as autowire candidate. Dependency annotations: {}
	at org.springframework.cloud.dataflow.server.config.DefaultEnvironmentPostProcessorTests.testOverridingDefaultsWithAConfigFile(DefaultEnvironmentPostProcessorTests.java:65)
Collapse Failed DefaultEnvironmentPostProcessorTests testDefaultsBeingContributedByServerModule History
Build and install SCDF 1 sec
org.springframework.beans.factory.UnsatisfiedDependencyException: Error creating bean with name 'taskService' defined in class path resource [org/springframework/cloud/dataflow/server/config/features/TaskConfiguration.class]: Unsatisfied dependency expressed through method 'taskService' parameter 0; nested exception is org.springframework.beans.factory.NoSuchBeanDefinitionException: No qualifying bean of type 'org.springframework.cloud.dataflow.server.job.LauncherRepository' available: expected at least 1 bean which qualifies as autowire candidate. Dependency annotations: {}
	at org.springframework.cloud.dataflow.server.config.DefaultEnvironmentPostProcessorTests.testDefaultsBeingContributedByServerModule(DefaultEnvironmentPostProcessorTests.java:55)
Caused by: org.springframework.beans.factory.NoSuchBeanDefinitionException: No qualifying bean of type 'org.springframework.cloud.dataflow.server.job.LauncherRepository' available: expected at least 1 bean which qualifies as autowire candidate. Dependency annotations: {}
	at org.springframework.cloud.dataflow.server.config.DefaultEnvironmentPostProcessorTests.testDefaultsBeingContributedByServerModule(DefaultEnvironmentPostProcessorTests.java:55)
Collapse Failed LocalPlatformTests multipleLocalPlatformAccounts History
Build and install SCDF 5 secs
org.springframework.beans.factory.UnsatisfiedDependencyException: Error creating bean with name 'taskService' defined in class path resource [org/springframework/cloud/dataflow/server/config/features/TaskConfiguration.class]: Unsatisfied dependency expressed through method 'taskService' parameter 0; nested exception is org.springframework.beans.factory.NoSuchBeanDefinitionException: No qualifying bean of type 'org.springframework.cloud.dataflow.server.job.LauncherRepository' available: expected at least 1 bean which qualifies as autowire candidate. Dependency annotations: {}
	at org.springframework.cloud.dataflow.server.config.LocalPlatformTests.multipleLocalPlatformAccounts(LocalPlatformTests.java:64)
Caused by: org.springframework.beans.factory.NoSuchBeanDefinitionException: No qualifying bean of type 'org.springframework.cloud.dataflow.server.job.LauncherRepository' available: expected at least 1 bean which qualifies as autowire candidate. Dependency annotations: {}
	at org.springframework.cloud.dataflow.server.config.LocalPlatformTests.multipleLocalPlatformAccounts(LocalPlatformTests.java:64)
Collapse Failed LocalPlatformTests defaultLocalPlatform History
Build and install SCDF 1 sec
org.springframework.beans.factory.UnsatisfiedDependencyException: Error creating bean with name 'taskService' defined in class path resource [org/springframework/cloud/dataflow/server/config/features/TaskConfiguration.class]: Unsatisfied dependency expressed through method 'taskService' parameter 0; nested exception is org.springframework.beans.factory.NoSuchBeanDefinitionException: No qualifying bean of type 'org.springframework.cloud.dataflow.server.job.LauncherRepository' available: expected at least 1 bean which qualifies as autowire candidate. Dependency annotations: {}
	at org.springframework.cloud.dataflow.server.config.LocalPlatformTests.defaultLocalPlatform(LocalPlatformTests.java:45)
Caused by: org.springframework.beans.factory.NoSuchBeanDefinitionException: No qualifying bean of type 'org.springframework.cloud.dataflow.server.job.LauncherRepository' available: expected at least 1 bean which qualifies as autowire candidate. Dependency annotations: {}
	at org.springframework.cloud.dataflow.server.config.LocalPlatformTests.defaultLocalPlatform(LocalPlatformTests.java:45)
Collapse Failed AboutControllerTests testListApplications History
Build and install SCDF < 1 sec
java.lang.IllegalStateException: Failed to load ApplicationContext
Caused by: org.springframework.beans.factory.UnsatisfiedDependencyException: Error creating bean with name 'taskService' defined in org.springframework.cloud.dataflow.server.configuration.TestDependencies: Unsatisfied dependency expressed through method 'taskService' parameter 0; nested exception is org.springframework.beans.factory.NoSuchBeanDefinitionException: No qualifying bean of type 'org.springframework.cloud.dataflow.server.job.LauncherRepository' available: expected at least 1 bean which qualifies as autowire candidate. Dependency annotations: {}
Caused by: org.springframework.beans.factory.NoSuchBeanDefinitionException: No qualifying bean of type 'org.springframework.cloud.dataflow.server.job.LauncherRepository' available: expected at least 1 bean which qualifies as autowire candidate. Dependency annotations: {}
Collapse Failed AboutControllerTests$AboutTests testAboutWithMissingSkipper History
Build and install SCDF < 1 sec
java.lang.IllegalStateException: Failed to load ApplicationContext
Caused by: org.springframework.beans.factory.UnsatisfiedDependencyException: Error creating bean with name 'taskService' defined in org.springframework.cloud.dataflow.server.configuration.TestDependencies: Unsatisfied dependency expressed through method 'taskService' parameter 0; nested exception is org.springframework.beans.factory.NoSuchBeanDefinitionException: No qualifying bean of type 'org.springframework.cloud.dataflow.server.job.LauncherRepository' available: expected at least 1 bean which qualifies as autowire candidate. Dependency annotations: {}
Caused by: org.springframework.beans.factory.NoSuchBeanDefinitionException: No qualifying bean of type 'org.springframework.cloud.dataflow.server.job.LauncherRepository' available: expected at least 1 bean which qualifies as autowire candidate. Dependency annotations: {}
Collapse Failed AboutControllerTests$AboutTests testAbout History
Build and install SCDF < 1 sec
java.lang.IllegalStateException: Failed to load ApplicationContext
Caused by: org.springframework.beans.factory.UnsatisfiedDependencyException: Error creating bean with name 'taskService' defined in org.springframework.cloud.dataflow.server.configuration.TestDependencies: Unsatisfied dependency expressed through method 'taskService' parameter 0; nested exception is org.springframework.beans.factory.NoSuchBeanDefinitionException: No qualifying bean of type 'org.springframework.cloud.dataflow.server.job.LauncherRepository' available: expected at least 1 bean which qualifies as autowire candidate. Dependency annotations: {}
Caused by: org.springframework.beans.factory.NoSuchBeanDefinitionException: No qualifying bean of type 'org.springframework.cloud.dataflow.server.job.LauncherRepository' available: expected at least 1 bean which qualifies as autowire candidate. Dependency annotations: {}
Collapse Failed AboutControllerTests$ChecksumDisabledTests testChecksumDisabled History
Build and install SCDF < 1 sec
java.lang.IllegalStateException: Failed to load ApplicationContext
Caused by: org.springframework.beans.factory.UnsatisfiedDependencyException: Error creating bean with name 'taskService' defined in org.springframework.cloud.dataflow.server.configuration.TestDependencies: Unsatisfied dependency expressed through method 'taskService' parameter 0; nested exception is org.springframework.beans.factory.NoSuchBeanDefinitionException: No qualifying bean of type 'org.springframework.cloud.dataflow.server.job.LauncherRepository' available: expected at least 1 bean which qualifies as autowire candidate. Dependency annotations: {}
Caused by: org.springframework.beans.factory.NoSuchBeanDefinitionException: No qualifying bean of type 'org.springframework.cloud.dataflow.server.job.LauncherRepository' available: expected at least 1 bean which qualifies as autowire candidate. Dependency annotations: {}
Collapse Failed AboutControllerTests$ChecksumNoDefaultTests testChecksumNoDefaults History
Build and install SCDF < 1 sec
java.lang.IllegalStateException: Failed to load ApplicationContext
Caused by: org.springframework.beans.factory.UnsatisfiedDependencyException: Error creating bean with name 'taskService' defined in org.springframework.cloud.dataflow.server.configuration.TestDependencies: Unsatisfied dependency expressed through method 'taskService' parameter 0; nested exception is org.springframework.beans.factory.NoSuchBeanDefinitionException: No qualifying bean of type 'org.springframework.cloud.dataflow.server.job.LauncherRepository' available: expected at least 1 bean which qualifies as autowire candidate. Dependency annotations: {}
Caused by: org.springframework.beans.factory.NoSuchBeanDefinitionException: No qualifying bean of type 'org.springframework.cloud.dataflow.server.job.LauncherRepository' available: expected at least 1 bean which qualifies as autowire candidate. Dependency annotations: {}
Collapse Failed AboutControllerTests$GAUrlTests testGA History
Build and install SCDF < 1 sec
java.lang.IllegalStateException: Failed to load ApplicationContext
Caused by: org.springframework.beans.factory.UnsatisfiedDependencyException: Error creating bean with name 'taskService' defined in org.springframework.cloud.dataflow.server.configuration.TestDependencies: Unsatisfied dependency expressed through method 'taskService' parameter 0; nested exception is org.springframework.beans.factory.NoSuchBeanDefinitionException: No qualifying bean of type 'org.springframework.cloud.dataflow.server.job.LauncherRepository' available: expected at least 1 bean which qualifies as autowire candidate. Dependency annotations: {}
Caused by: org.springframework.beans.factory.NoSuchBeanDefinitionException: No qualifying bean of type 'org.springframework.cloud.dataflow.server.job.LauncherRepository' available: expected at least 1 bean which qualifies as autowire candidate. Dependency annotations: {}
Collapse Failed AboutControllerTests$MilestoneUrlTests testMilestone History
Build and install SCDF < 1 sec
java.lang.IllegalStateException: Failed to load ApplicationContext
Caused by: org.springframework.beans.factory.UnsatisfiedDependencyException: Error creating bean with name 'taskService' defined in org.springframework.cloud.dataflow.server.configuration.TestDependencies: Unsatisfied dependency expressed through method 'taskService' parameter 0; nested exception is org.springframework.beans.factory.NoSuchBeanDefinitionException: No qualifying bean of type 'org.springframework.cloud.dataflow.server.job.LauncherRepository' available: expected at least 1 bean which qualifies as autowire candidate. Dependency annotations: {}
Caused by: org.springframework.beans.factory.NoSuchBeanDefinitionException: No qualifying bean of type 'org.springframework.cloud.dataflow.server.job.LauncherRepository' available: expected at least 1 bean which qualifies as autowire candidate. Dependency annotations: {}
Collapse Failed AboutControllerTests$RCUrlTests testRC History
Build and install SCDF < 1 sec
java.lang.IllegalStateException: Failed to load ApplicationContext
Caused by: org.springframework.beans.factory.UnsatisfiedDependencyException: Error creating bean with name 'taskService' defined in org.springframework.cloud.dataflow.server.configuration.TestDependencies: Unsatisfied dependency expressed through method 'taskService' parameter 0; nested exception is org.springframework.beans.factory.NoSuchBeanDefinitionException: No qualifying bean of type 'org.springframework.cloud.dataflow.server.job.LauncherRepository' available: expected at least 1 bean which qualifies as autowire candidate. Dependency annotations: {}
Caused by: org.springframework.beans.factory.NoSuchBeanDefinitionException: No qualifying bean of type 'org.springframework.cloud.dataflow.server.job.LauncherRepository' available: expected at least 1 bean which qualifies as autowire candidate. Dependency annotations: {}
Collapse Failed AboutControllerTests$ReleaseUrlTests testRelease History
Build and install SCDF < 1 sec
java.lang.IllegalStateException: Failed to load ApplicationContext
Caused by: org.springframework.beans.factory.UnsatisfiedDependencyException: Error creating bean with name 'taskService' defined in org.springframework.cloud.dataflow.server.configuration.TestDependencies: Unsatisfied dependency expressed through method 'taskService' parameter 0; nested exception is org.springframework.beans.factory.NoSuchBeanDefinitionException: No qualifying bean of type 'org.springframework.cloud.dataflow.server.job.LauncherRepository' available: expected at least 1 bean which qualifies as autowire candidate. Dependency annotations: {}
Caused by: org.springframework.beans.factory.NoSuchBeanDefinitionException: No qualifying bean of type 'org.springframework.cloud.dataflow.server.job.LauncherRepository' available: expected at least 1 bean which qualifies as autowire candidate. Dependency annotations: {}
Collapse Failed AppRegistryControllerTests testListApplications History
Build and install SCDF < 1 sec
java.lang.IllegalStateException: Failed to load ApplicationContext
Caused by: org.springframework.beans.factory.UnsatisfiedDependencyException: Error creating bean with name 'taskService' defined in org.springframework.cloud.dataflow.server.configuration.TestDependencies: Unsatisfied dependency expressed through method 'taskService' parameter 0; nested exception is org.springframework.beans.factory.NoSuchBeanDefinitionException: No qualifying bean of type 'org.springframework.cloud.dataflow.server.job.LauncherRepository' available: expected at least 1 bean which qualifies as autowire candidate. Dependency annotations: {}
Caused by: org.springframework.beans.factory.NoSuchBeanDefinitionException: No qualifying bean of type 'org.springframework.cloud.dataflow.server.job.LauncherRepository' available: expected at least 1 bean which qualifies as autowire candidate. Dependency annotations: {}
Collapse Failed AppRegistryControllerTests testRegisterInvalidAppUri History
Build and install SCDF < 1 sec
java.lang.IllegalStateException: Failed to load ApplicationContext
Caused by: org.springframework.beans.factory.UnsatisfiedDependencyException: Error creating bean with name 'taskService' defined in org.springframework.cloud.dataflow.server.configuration.TestDependencies: Unsatisfied dependency expressed through method 'taskService' parameter 0; nested exception is org.springframework.beans.factory.NoSuchBeanDefinitionException: No qualifying bean of type 'org.springframework.cloud.dataflow.server.job.LauncherRepository' available: expected at least 1 bean which qualifies as autowire candidate. Dependency annotations: {}
Caused by: org.springframework.beans.factory.NoSuchBeanDefinitionException: No qualifying bean of type 'org.springframework.cloud.dataflow.server.job.LauncherRepository' available: expected at least 1 bean which qualifies as autowire candidate. Dependency annotations: {}
Collapse Failed AppRegistryControllerTests testVersionWithMismatchBaseUri History
Build and install SCDF < 1 sec
java.lang.IllegalStateException: Failed to load ApplicationContext
Caused by: org.springframework.beans.factory.UnsatisfiedDependencyException: Error creating bean with name 'taskService' defined in org.springframework.cloud.dataflow.server.configuration.TestDependencies: Unsatisfied dependency expressed through method 'taskService' parameter 0; nested exception is org.springframework.beans.factory.NoSuchBeanDefinitionException: No qualifying bean of type 'org.springframework.cloud.dataflow.server.job.LauncherRepository' available: expected at least 1 bean which qualifies as autowire candidate. Dependency annotations: {}
Caused by: org.springframework.beans.factory.NoSuchBeanDefinitionException: No qualifying bean of type 'org.springframework.cloud.dataflow.server.job.LauncherRepository' available: expected at least 1 bean which qualifies as autowire candidate. Dependency annotations: {}
Collapse Failed AppRegistryControllerTests testListApplicationsBySearch History
Build and install SCDF < 1 sec
java.lang.IllegalStateException: Failed to load ApplicationContext
Caused by: org.springframework.beans.factory.UnsatisfiedDependencyException: Error creating bean with name 'taskService' defined in org.springframework.cloud.dataflow.server.configuration.TestDependencies: Unsatisfied dependency expressed through method 'taskService' parameter 0; nested exception is org.springframework.beans.factory.NoSuchBeanDefinitionException: No qualifying bean of type 'org.springframework.cloud.dataflow.server.job.LauncherRepository' available: expected at least 1 bean which qualifies as autowire candidate. Dependency annotations: {}
Caused by: org.springframework.beans.factory.NoSuchBeanDefinitionException: No qualifying bean of type 'org.springframework.cloud.dataflow.server.job.LauncherRepository' available: expected at least 1 bean which qualifies as autowire candidate. Dependency annotations: {}
Collapse Failed AppRegistryControllerTests testUnregisterApplicationNotFound History
Build and install SCDF < 1 sec
java.lang.IllegalStateException: Failed to load ApplicationContext
Caused by: org.springframework.beans.factory.UnsatisfiedDependencyException: Error creating bean with name 'taskService' defined in org.springframework.cloud.dataflow.server.configuration.TestDependencies: Unsatisfied dependency expressed through method 'taskService' parameter 0; nested exception is org.springframework.beans.factory.NoSuchBeanDefinitionException: No qualifying bean of type 'org.springframework.cloud.dataflow.server.job.LauncherRepository' available: expected at least 1 bean which qualifies as autowire candidate. Dependency annotations: {}
Caused by: org.springframework.beans.factory.NoSuchBeanDefinitionException: No qualifying bean of type 'org.springframework.cloud.dataflow.server.job.LauncherRepository' available: expected at least 1 bean which qualifies as autowire candidate. Dependency annotations: {}
Collapse Failed AppRegistryControllerTests testUnregisterAllApplications History
Build and install SCDF < 1 sec
java.lang.IllegalStateException: Failed to load ApplicationContext
Caused by: org.springframework.beans.factory.UnsatisfiedDependencyException: Error creating bean with name 'taskService' defined in org.springframework.cloud.dataflow.server.configuration.TestDependencies: Unsatisfied dependency expressed through method 'taskService' parameter 0; nested exception is org.springframework.beans.factory.NoSuchBeanDefinitionException: No qualifying bean of type 'org.springframework.cloud.dataflow.server.job.LauncherRepository' available: expected at least 1 bean which qualifies as autowire candidate. Dependency annotations: {}
Caused by: org.springframework.beans.factory.NoSuchBeanDefinitionException: No qualifying bean of type 'org.springframework.cloud.dataflow.server.job.LauncherRepository' available: expected at least 1 bean which qualifies as autowire candidate. Dependency annotations: {}
Collapse Failed AppRegistryControllerTests testUnregisterApplication History
Build and install SCDF < 1 sec
java.lang.IllegalStateException: Failed to load ApplicationContext
Caused by: org.springframework.beans.factory.UnsatisfiedDependencyException: Error creating bean with name 'taskService' defined in org.springframework.cloud.dataflow.server.configuration.TestDependencies: Unsatisfied dependency expressed through method 'taskService' parameter 0; nested exception is org.springframework.beans.factory.NoSuchBeanDefinitionException: No qualifying bean of type 'org.springframework.cloud.dataflow.server.job.LauncherRepository' available: expected at least 1 bean which qualifies as autowire candidate. Dependency annotations: {}
Caused by: org.springframework.beans.factory.NoSuchBeanDefinitionException: No qualifying bean of type 'org.springframework.cloud.dataflow.server.job.LauncherRepository' available: expected at least 1 bean which qualifies as autowire candidate. Dependency annotations: {}
Collapse Failed AppRegistryControllerTests testListApplicationsByTypeAndSearch History
Build and install SCDF < 1 sec
java.lang.IllegalStateException: Failed to load ApplicationContext
Caused by: org.springframework.beans.factory.UnsatisfiedDependencyException: Error creating bean with name 'taskService' defined in org.springframework.cloud.dataflow.server.configuration.TestDependencies: Unsatisfied dependency expressed through method 'taskService' parameter 0; nested exception is org.springframework.beans.factory.NoSuchBeanDefinitionException: No qualifying bean of type 'org.springframework.cloud.dataflow.server.job.LauncherRepository' available: expected at least 1 bean which qualifies as autowire candidate. Dependency annotations: {}
Caused by: org.springframework.beans.factory.NoSuchBeanDefinitionException: No qualifying bean of type 'org.springframework.cloud.dataflow.server.job.LauncherRepository' available: expected at least 1 bean which qualifies as autowire candidate. Dependency annotations: {}
Collapse Failed AppRegistryControllerTests testUnregisterApplicationUsedInStream History
Build and install SCDF < 1 sec
java.lang.IllegalStateException: Failed to load ApplicationContext
Caused by: org.springframework.beans.factory.UnsatisfiedDependencyException: Error creating bean with name 'taskService' defined in org.springframework.cloud.dataflow.server.configuration.TestDependencies: Unsatisfied dependency expressed through method 'taskService' parameter 0; nested exception is org.springframework.beans.factory.NoSuchBeanDefinitionException: No qualifying bean of type 'org.springframework.cloud.dataflow.server.job.LauncherRepository' available: expected at least 1 bean which qualifies as autowire candidate. Dependency annotations: {}
Caused by: org.springframework.beans.factory.NoSuchBeanDefinitionException: No qualifying bean of type 'org.springframework.cloud.dataflow.server.job.LauncherRepository' available: expected at least 1 bean which qualifies as autowire candidate. Dependency annotations: {}
Collapse Failed AppRegistryControllerTests testRegisterAllFromFile History
Build and install SCDF < 1 sec
java.lang.IllegalStateException: Failed to load ApplicationContext
Caused by: org.springframework.beans.factory.UnsatisfiedDependencyException: Error creating bean with name 'taskService' defined in org.springframework.cloud.dataflow.server.configuration.TestDependencies: Unsatisfied dependency expressed through method 'taskService' parameter 0; nested exception is org.springframework.beans.factory.NoSuchBeanDefinitionException: No qualifying bean of type 'org.springframework.cloud.dataflow.server.job.LauncherRepository' available: expected at least 1 bean which qualifies as autowire candidate. Dependency annotations: {}
Caused by: org.springframework.beans.factory.NoSuchBeanDefinitionException: No qualifying bean of type 'org.springframework.cloud.dataflow.server.job.LauncherRepository' available: expected at least 1 bean which qualifies as autowire candidate. Dependency annotations: {}
Collapse Failed AppRegistryControllerTests testVersionOverrideNonExistentApp History
Build and install SCDF < 1 sec
java.lang.IllegalStateException: Failed to load ApplicationContext
Caused by: org.springframework.beans.factory.UnsatisfiedDependencyException: Error creating bean with name 'taskService' defined in org.springframework.cloud.dataflow.server.configuration.TestDependencies: Unsatisfied dependency expressed through method 'taskService' parameter 0; nested exception is org.springframework.beans.factory.NoSuchBeanDefinitionException: No qualifying bean of type 'org.springframework.cloud.dataflow.server.job.LauncherRepository' available: expected at least 1 bean which qualifies as autowire candidate. Dependency annotations: {}
Caused by: org.springframework.beans.factory.NoSuchBeanDefinitionException: No qualifying bean of type 'org.springframework.cloud.dataflow.server.job.LauncherRepository' available: expected at least 1 bean which qualifies as autowire candidate. Dependency annotations: {}
Collapse Failed AppRegistryControllerTests testListSingleApplicationExhaustive History
Build and install SCDF < 1 sec
java.lang.IllegalStateException: Failed to load ApplicationContext
Caused by: org.springframework.beans.factory.UnsatisfiedDependencyException: Error creating bean with name 'taskService' defined in org.springframework.cloud.dataflow.server.configuration.TestDependencies: Unsatisfied dependency expressed through method 'taskService' parameter 0; nested exception is org.springframework.beans.factory.NoSuchBeanDefinitionException: No qualifying bean of type 'org.springframework.cloud.dataflow.server.job.LauncherRepository' available: expected at least 1 bean which qualifies as autowire candidate. Dependency annotations: {}
Caused by: org.springframework.beans.factory.NoSuchBeanDefinitionException: No qualifying bean of type 'org.springframework.cloud.dataflow.server.job.LauncherRepository' available: expected at least 1 bean which qualifies as autowire candidate. Dependency annotations: {}
Collapse Failed AppRegistryControllerTests testUnregisterApplicationUsedInStreamNotDeployed History
Build and install SCDF < 1 sec
java.lang.IllegalStateException: Failed to load ApplicationContext
Caused by: org.springframework.beans.factory.UnsatisfiedDependencyException: Error creating bean with name 'taskService' defined in org.springframework.cloud.dataflow.server.configuration.TestDependencies: Unsatisfied dependency expressed through method 'taskService' parameter 0; nested exception is org.springframework.beans.factory.NoSuchBeanDefinitionException: No qualifying bean of type 'org.springframework.cloud.dataflow.server.job.LauncherRepository' available: expected at least 1 bean which qualifies as autowire candidate. Dependency annotations: {}
Caused by: org.springframework.beans.factory.NoSuchBeanDefinitionException: No qualifying bean of type 'org.springframework.cloud.dataflow.server.job.LauncherRepository' available: expected at least 1 bean which qualifies as autowire candidate. Dependency annotations: {}
Collapse Failed AppRegistryControllerTests testRegisterAllWithBadApplication History
Build and install SCDF < 1 sec
java.lang.IllegalStateException: Failed to load ApplicationContext
Caused by: org.springframework.beans.factory.UnsatisfiedDependencyException: Error creating bean with name 'taskService' defined in org.springframework.cloud.dataflow.server.configuration.TestDependencies: Unsatisfied dependency expressed through method 'taskService' parameter 0; nested exception is org.springframework.beans.factory.NoSuchBeanDefinitionException: No qualifying bean of type 'org.springframework.cloud.dataflow.server.job.LauncherRepository' available: expected at least 1 bean which qualifies as autowire candidate. Dependency annotations: {}
Caused by: org.springframework.beans.factory.NoSuchBeanDefinitionException: No qualifying bean of type 'org.springframework.cloud.dataflow.server.job.LauncherRepository' available: expected at least 1 bean which qualifies as autowire candidate. Dependency annotations: {}
Collapse Failed AppRegistryControllerTests testDefaultVersion History
Build and install SCDF < 1 sec
java.lang.IllegalStateException: Failed to load ApplicationContext
Caused by: org.springframework.beans.factory.UnsatisfiedDependencyException: Error creating bean with name 'taskService' defined in org.springframework.cloud.dataflow.server.configuration.TestDependencies: Unsatisfied dependency expressed through method 'taskService' parameter 0; nested exception is org.springframework.beans.factory.NoSuchBeanDefinitionException: No qualifying bean of type 'org.springframework.cloud.dataflow.server.job.LauncherRepository' available: expected at least 1 bean which qualifies as autowire candidate. Dependency annotations: {}
Caused by: org.springframework.beans.factory.NoSuchBeanDefinitionException: No qualifying bean of type 'org.springframework.cloud.dataflow.server.job.LauncherRepository' available: expected at least 1 bean which qualifies as autowire candidate. Dependency annotations: {}
Collapse Failed AppRegistryControllerTests testRegisterAll History
Build and install SCDF < 1 sec
java.lang.IllegalStateException: Failed to load ApplicationContext
Caused by: org.springframework.beans.factory.UnsatisfiedDependencyException: Error creating bean with name 'taskService' defined in org.springframework.cloud.dataflow.server.configuration.TestDependencies: Unsatisfied dependency expressed through method 'taskService' parameter 0; nested exception is org.springframework.beans.factory.NoSuchBeanDefinitionException: No qualifying bean of type 'org.springframework.cloud.dataflow.server.job.LauncherRepository' available: expected at least 1 bean which qualifies as autowire candidate. Dependency annotations: {}
Caused by: org.springframework.beans.factory.NoSuchBeanDefinitionException: No qualifying bean of type 'org.springframework.cloud.dataflow.server.job.LauncherRepository' available: expected at least 1 bean which qualifies as autowire candidate. Dependency annotations: {}
Collapse Failed AppRegistryControllerTests testAppInfoNonExistingVersionedApp History
Build and install SCDF < 1 sec
java.lang.IllegalStateException: Failed to load ApplicationContext
Caused by: org.springframework.beans.factory.UnsatisfiedDependencyException: Error creating bean with name 'taskService' defined in org.springframework.cloud.dataflow.server.configuration.TestDependencies: Unsatisfied dependency expressed through method 'taskService' parameter 0; nested exception is org.springframework.beans.factory.NoSuchBeanDefinitionException: No qualifying bean of type 'org.springframework.cloud.dataflow.server.job.LauncherRepository' available: expected at least 1 bean which qualifies as autowire candidate. Dependency annotations: {}
Caused by: org.springframework.beans.factory.NoSuchBeanDefinitionException: No qualifying bean of type 'org.springframework.cloud.dataflow.server.job.LauncherRepository' available: expected at least 1 bean which qualifies as autowire candidate. Dependency annotations: {}
Collapse Failed AppRegistryControllerTests testRegisterApplicationTwice History
Build and install SCDF < 1 sec
java.lang.IllegalStateException: Failed to load ApplicationContext
Caused by: org.springframework.beans.factory.UnsatisfiedDependencyException: Error creating bean with name 'taskService' defined in org.springframework.cloud.dataflow.server.configuration.TestDependencies: Unsatisfied dependency expressed through method 'taskService' parameter 0; nested exception is org.springframework.beans.factory.NoSuchBeanDefinitionException: No qualifying bean of type 'org.springframework.cloud.dataflow.server.job.LauncherRepository' available: expected at least 1 bean which qualifies as autowire candidate. Dependency annotations: {}
Caused by: org.springframework.beans.factory.NoSuchBeanDefinitionException: No qualifying bean of type 'org.springframework.cloud.dataflow.server.job.LauncherRepository' available: expected at least 1 bean which qualifies as autowire candidate. Dependency annotations: {}
Collapse Failed AppRegistryControllerTests testRegisterAllWithForce History
Build and install SCDF < 1 sec
java.lang.IllegalStateException: Failed to load ApplicationContext
Caused by: org.springframework.beans.factory.UnsatisfiedDependencyException: Error creating bean with name 'taskService' defined in org.springframework.cloud.dataflow.server.configuration.TestDependencies: Unsatisfied dependency expressed through method 'taskService' parameter 0; nested exception is org.springframework.beans.factory.NoSuchBeanDefinitionException: No qualifying bean of type 'org.springframework.cloud.dataflow.server.job.LauncherRepository' available: expected at least 1 bean which qualifies as autowire candidate. Dependency annotations: {}
Caused by: org.springframework.beans.factory.NoSuchBeanDefinitionException: No qualifying bean of type 'org.springframework.cloud.dataflow.server.job.LauncherRepository' available: expected at least 1 bean which qualifies as autowire candidate. Dependency annotations: {}
Collapse Failed AppRegistryControllerTests testUnregisterAllApplicationsWhenApplicationUsedInStream History
Build and install SCDF < 1 sec
java.lang.IllegalStateException: Failed to load ApplicationContext
Caused by: org.springframework.beans.factory.UnsatisfiedDependencyException: Error creating bean with name 'taskService' defined in org.springframework.cloud.dataflow.server.configuration.TestDependencies: Unsatisfied dependency expressed through method 'taskService' parameter 0; nested exception is org.springframework.beans.factory.NoSuchBeanDefinitionException: No qualifying bean of type 'org.springframework.cloud.dataflow.server.job.LauncherRepository' available: expected at least 1 bean which qualifies as autowire candidate. Dependency annotations: {}
Caused by: org.springframework.beans.factory.NoSuchBeanDefinitionException: No qualifying bean of type 'org.springframework.cloud.dataflow.server.job.LauncherRepository' available: expected at least 1 bean which qualifies as autowire candidate. Dependency annotations: {}
Collapse Failed AppRegistryControllerTests testRegisterAllWithoutForce History
Build and install SCDF < 1 sec
java.lang.IllegalStateException: Failed to load ApplicationContext
Caused by: org.springframework.beans.factory.UnsatisfiedDependencyException: Error creating bean with name 'taskService' defined in org.springframework.cloud.dataflow.server.configuration.TestDependencies: Unsatisfied dependency expressed through method 'taskService' parameter 0; nested exception is org.springframework.beans.factory.NoSuchBeanDefinitionException: No qualifying bean of type 'org.springframework.cloud.dataflow.server.job.LauncherRepository' available: expected at least 1 bean which qualifies as autowire candidate. Dependency annotations: {}
Caused by: org.springframework.beans.factory.NoSuchBeanDefinitionException: No qualifying bean of type 'org.springframework.cloud.dataflow.server.job.LauncherRepository' available: expected at least 1 bean which qualifies as autowire candidate. Dependency annotations: {}
Collapse Failed AppRegistryControllerTests testAppInfoNonExistingApp History
Build and install SCDF < 1 sec
java.lang.IllegalStateException: Failed to load ApplicationContext
Caused by: org.springframework.beans.factory.UnsatisfiedDependencyException: Error creating bean with name 'taskService' defined in org.springframework.cloud.dataflow.server.configuration.TestDependencies: Unsatisfied dependency expressed through method 'taskService' parameter 0; nested exception is org.springframework.beans.factory.NoSuchBeanDefinitionException: No qualifying bean of type 'org.springframework.cloud.dataflow.server.job.LauncherRepository' available: expected at least 1 bean which qualifies as autowire candidate. Dependency annotations: {}
Caused by: org.springframework.beans.factory.NoSuchBeanDefinitionException: No qualifying bean of type 'org.springframework.cloud.dataflow.server.job.LauncherRepository' available: expected at least 1 bean which qualifies as autowire candidate. Dependency annotations: {}
Collapse Failed AppRegistryControllerTests testVersionOverride History
Build and install SCDF < 1 sec
java.lang.IllegalStateException: Failed to load ApplicationContext
Caused by: org.springframework.beans.factory.UnsatisfiedDependencyException: Error creating bean with name 'taskService' defined in org.springframework.cloud.dataflow.server.configuration.TestDependencies: Unsatisfied dependency expressed through method 'taskService' parameter 0; nested exception is org.springframework.beans.factory.NoSuchBeanDefinitionException: No qualifying bean of type 'org.springframework.cloud.dataflow.server.job.LauncherRepository' available: expected at least 1 bean which qualifies as autowire candidate. Dependency annotations: {}
Caused by: org.springframework.beans.factory.NoSuchBeanDefinitionException: No qualifying bean of type 'org.springframework.cloud.dataflow.server.job.LauncherRepository' available: expected at least 1 bean which qualifies as autowire candidate. Dependency annotations: {}
Collapse Failed AppRegistryControllerTests testRegisterAndListApplications History
Build and install SCDF < 1 sec
java.lang.IllegalStateException: Failed to load ApplicationContext
Caused by: org.springframework.beans.factory.UnsatisfiedDependencyException: Error creating bean with name 'taskService' defined in org.springframework.cloud.dataflow.server.configuration.TestDependencies: Unsatisfied dependency expressed through method 'taskService' parameter 0; nested exception is org.springframework.beans.factory.NoSuchBeanDefinitionException: No qualifying bean of type 'org.springframework.cloud.dataflow.server.job.LauncherRepository' available: expected at least 1 bean which qualifies as autowire candidate. Dependency annotations: {}
Caused by: org.springframework.beans.factory.NoSuchBeanDefinitionException: No qualifying bean of type 'org.springframework.cloud.dataflow.server.job.LauncherRepository' available: expected at least 1 bean which qualifies as autowire candidate. Dependency annotations: {}
Collapse Failed AppRegistryControllerTests testListSingleApplication History
Build and install SCDF < 1 sec
java.lang.IllegalStateException: Failed to load ApplicationContext
Caused by: org.springframework.beans.factory.UnsatisfiedDependencyException: Error creating bean with name 'taskService' defined in org.springframework.cloud.dataflow.server.configuration.TestDependencies: Unsatisfied dependency expressed through method 'taskService' parameter 0; nested exception is org.springframework.beans.factory.NoSuchBeanDefinitionException: No qualifying bean of type 'org.springframework.cloud.dataflow.server.job.LauncherRepository' available: expected at least 1 bean which qualifies as autowire candidate. Dependency annotations: {}
Caused by: org.springframework.beans.factory.NoSuchBeanDefinitionException: No qualifying bean of type 'org.springframework.cloud.dataflow.server.job.LauncherRepository' available: expected at least 1 bean which qualifies as autowire candidate. Dependency annotations: {}
Collapse Failed AppRegistryControllerTests testRegisterApp History
Build and install SCDF < 1 sec
java.lang.IllegalStateException: Failed to load ApplicationContext
Caused by: org.springframework.beans.factory.UnsatisfiedDependencyException: Error creating bean with name 'taskService' defined in org.springframework.cloud.dataflow.server.configuration.TestDependencies: Unsatisfied dependency expressed through method 'taskService' parameter 0; nested exception is org.springframework.beans.factory.NoSuchBeanDefinitionException: No qualifying bean of type 'org.springframework.cloud.dataflow.server.job.LauncherRepository' available: expected at least 1 bean which qualifies as autowire candidate. Dependency annotations: {}
Caused by: org.springframework.beans.factory.NoSuchBeanDefinitionException: No qualifying bean of type 'org.springframework.cloud.dataflow.server.job.LauncherRepository' available: expected at least 1 bean which qualifies as autowire candidate. Dependency annotations: {}
Collapse Failed AppRegistryControllerTests testRegisterVersionedApp History
Build and install SCDF < 1 sec
java.lang.IllegalStateException: Failed to load ApplicationContext
Caused by: org.springframework.beans.factory.UnsatisfiedDependencyException: Error creating bean with name 'taskService' defined in org.springframework.cloud.dataflow.server.configuration.TestDependencies: Unsatisfied dependency expressed through method 'taskService' parameter 0; nested exception is org.springframework.beans.factory.NoSuchBeanDefinitionException: No qualifying bean of type 'org.springframework.cloud.dataflow.server.job.LauncherRepository' available: expected at least 1 bean which qualifies as autowire candidate. Dependency annotations: {}
Caused by: org.springframework.beans.factory.NoSuchBeanDefinitionException: No qualifying bean of type 'org.springframework.cloud.dataflow.server.job.LauncherRepository' available: expected at least 1 bean which qualifies as autowire candidate. Dependency annotations: {}
Collapse Failed AppRegistryControllerTests testFindNonExistentApp History
Build and install SCDF < 1 sec
java.lang.IllegalStateException: Failed to load ApplicationContext
Caused by: org.springframework.beans.factory.UnsatisfiedDependencyException: Error creating bean with name 'taskService' defined in org.springframework.cloud.dataflow.server.configuration.TestDependencies: Unsatisfied dependency expressed through method 'taskService' parameter 0; nested exception is org.springframework.beans.factory.NoSuchBeanDefinitionException: No qualifying bean of type 'org.springframework.cloud.dataflow.server.job.LauncherRepository' available: expected at least 1 bean which qualifies as autowire candidate. Dependency annotations: {}
Caused by: org.springframework.beans.factory.NoSuchBeanDefinitionException: No qualifying bean of type 'org.springframework.cloud.dataflow.server.job.LauncherRepository' available: expected at least 1 bean which qualifies as autowire candidate. Dependency annotations: {}
Collapse Failed AppRegistryControllerTests testUnregisterUnversionedApplicationNotFound History
Build and install SCDF < 1 sec
java.lang.IllegalStateException: Failed to load ApplicationContext
Caused by: org.springframework.beans.factory.UnsatisfiedDependencyException: Error creating bean with name 'taskService' defined in org.springframework.cloud.dataflow.server.configuration.TestDependencies: Unsatisfied dependency expressed through method 'taskService' parameter 0; nested exception is org.springframework.beans.factory.NoSuchBeanDefinitionException: No qualifying bean of type 'org.springframework.cloud.dataflow.server.job.LauncherRepository' available: expected at least 1 bean which qualifies as autowire candidate. Dependency annotations: {}
Caused by: org.springframework.beans.factory.NoSuchBeanDefinitionException: No qualifying bean of type 'org.springframework.cloud.dataflow.server.job.LauncherRepository' available: expected at least 1 bean which qualifies as autowire candidate. Dependency annotations: {}
Collapse Failed AppRegistryControllerTests testListApplicationsByType History
Build and install SCDF < 1 sec
java.lang.IllegalStateException: Failed to load ApplicationContext
Caused by: org.springframework.beans.factory.UnsatisfiedDependencyException: Error creating bean with name 'taskService' defined in org.springframework.cloud.dataflow.server.configuration.TestDependencies: Unsatisfied dependency expressed through method 'taskService' parameter 0; nested exception is org.springframework.beans.factory.NoSuchBeanDefinitionException: No qualifying bean of type 'org.springframework.cloud.dataflow.server.job.LauncherRepository' available: expected at least 1 bean which qualifies as autowire candidate. Dependency annotations: {}
Caused by: org.springframework.beans.factory.NoSuchBeanDefinitionException: No qualifying bean of type 'org.springframework.cloud.dataflow.server.job.LauncherRepository' available: expected at least 1 bean which qualifies as autowire candidate. Dependency annotations: {}
Collapse Failed AppRegistryControllerTests testPagination History
Build and install SCDF < 1 sec
java.lang.IllegalStateException: Failed to load ApplicationContext
Caused by: org.springframework.beans.factory.UnsatisfiedDependencyException: Error creating bean with name 'taskService' defined in org.springframework.cloud.dataflow.server.configuration.TestDependencies: Unsatisfied dependency expressed through method 'taskService' parameter 0; nested exception is org.springframework.beans.factory.NoSuchBeanDefinitionException: No qualifying bean of type 'org.springframework.cloud.dataflow.server.job.LauncherRepository' available: expected at least 1 bean which qualifies as autowire candidate. Dependency annotations: {}
Caused by: org.springframework.beans.factory.NoSuchBeanDefinitionException: No qualifying bean of type 'org.springframework.cloud.dataflow.server.job.LauncherRepository' available: expected at least 1 bean which qualifies as autowire candidate. Dependency annotations: {}
Collapse Failed AuditRecordControllerTests testVerifyNumberOfAuditRecords History
Build and install SCDF < 1 sec
java.lang.IllegalStateException: Failed to load ApplicationContext
Caused by: org.springframework.beans.factory.UnsatisfiedDependencyException: Error creating bean with name 'taskService' defined in org.springframework.cloud.dataflow.server.configuration.TestDependencies: Unsatisfied dependency expressed through method 'taskService' parameter 0; nested exception is org.springframework.beans.factory.NoSuchBeanDefinitionException: No qualifying bean of type 'org.springframework.cloud.dataflow.server.job.LauncherRepository' available: expected at least 1 bean which qualifies as autowire candidate. Dependency annotations: {}
Caused by: org.springframework.beans.factory.NoSuchBeanDefinitionException: No qualifying bean of type 'org.springframework.cloud.dataflow.server.job.LauncherRepository' available: expected at least 1 bean which qualifies as autowire candidate. Dependency annotations: {}