Build Spring Cloud Data Flow

Build: #4103 failed Changes by Christian Tzolov

Logs

The following logs have been generated by the jobs in this plan.
  • Expand all
  • Collapse all
Job Logs
Collapse Build and install SCDF Default Stage Download or View
02-Jul-2020 19:29:25 [INFO] spring-cloud-dataflow-dependencies ................. SUCCESS [  0.032 s]
02-Jul-2020 19:29:25 [INFO] spring-cloud-dataflow-composed-task-runner ......... FAILURE [ 28.421 s]
02-Jul-2020 19:29:25 [INFO] spring-cloud-dataflow-test 2.6.0-SNAPSHOT .......... SKIPPED
02-Jul-2020 19:29:25 [INFO] ------------------------------------------------------------------------
02-Jul-2020 19:29:25 [INFO] BUILD FAILURE
02-Jul-2020 19:29:25 [INFO] ------------------------------------------------------------------------
02-Jul-2020 19:29:25 [INFO] Total time: 18:11 min
02-Jul-2020 19:29:25 [INFO] Finished at: 2020-07-02T19:29:25Z
02-Jul-2020 19:29:25 [INFO] ------------------------------------------------------------------------
02-Jul-2020 19:29:25 [ERROR] Failed to execute goal org.apache.maven.plugins:maven-surefire-plugin:2.22.1:test (default-test) on project spring-cloud-dataflow-composed-task-runner: There are test failures.
02-Jul-2020 19:29:25 [ERROR]
02-Jul-2020 19:29:25 [ERROR] Please refer to /opt/bamboo-home/xml-data/build-dir/SCD-BMASTER-JOB1/spring-cloud-dataflow-composed-task-runner/target/surefire-reports for the individual test results.
02-Jul-2020 19:29:25 [ERROR] Please refer to dump files (if any exist) [date].dump, [date]-jvmRun[N].dump and [date].dumpstream.
02-Jul-2020 19:29:25 [ERROR] -> [Help 1]
02-Jul-2020 19:29:25 [ERROR]
02-Jul-2020 19:29:25 [ERROR] To see the full stack trace of the errors, re-run Maven with the -e switch.
02-Jul-2020 19:29:25 [ERROR] Re-run Maven using the -X switch to enable full debug logging.
02-Jul-2020 19:29:25 [ERROR]
02-Jul-2020 19:29:25 [ERROR] For more information about the errors and possible solutions, please read the following articles:
02-Jul-2020 19:29:25 [ERROR] [Help 1] http://cwiki.apache.org/confluence/display/MAVEN/MojoFailureException
02-Jul-2020 19:29:25 [ERROR]
02-Jul-2020 19:29:25 [ERROR] After correcting the problems, you can resume the build with the command
02-Jul-2020 19:29:25 [ERROR]   mvn <goals> -rf :spring-cloud-dataflow-composed-task-runner
02-Jul-2020 19:29:31 Unable to publish artifact [docker-compose-logs]: the source directory /opt/bamboo-home/xml-data/build-dir/SCD-BMASTER-JOB1/spring-cloud-dataflow-server/target/dockerLogs does not exist.
02-Jul-2020 19:29:32 Unable to publish artifact [docker-compose-IT-Results]: