Build Spring Cloud Data Flow

Build: #2030 failed

Job: Build and install SCDF failed

Stages & jobs

  1. Default Stage

  2. Build Docker Images and upload

Job result summary

Completed
Duration
8 minutes
Revision
955901bdeb6afe5367348bc76a28d27b42a0b3d2 955901bdeb6afe5367348bc76a28d27b42a0b3d2
Total tests
1201
Fixed in
#2032 (Code changes detected)

Tests

  • 1,201 tests in total
  • 5 tests failed
  • 5 failures are new
  • 8 tests were quarantined / skipped
  • 2 minutes taken in total.
New test failures 5
Status Test Duration
Collapse Failed TaskExecutionsDocumentation launchTask History
< 1 sec
java.lang.AssertionError: Status expected:<201> but was:<500>
	at org.springframework.test.util.AssertionErrors.fail(AssertionErrors.java:54)
	at org.springframework.test.util.AssertionErrors.assertEquals(AssertionErrors.java:81)
	at org.springframework.test.web.servlet.result.StatusResultMatchers$10.match(StatusResultMatchers.java:665)
	at org.springframework.test.web.servlet.MockMvc$1.andExpect(MockMvc.java:171)
	at org.springframework.cloud.dataflow.server.rest.documentation.TaskExecutionsDocumentation.launchTask(TaskExecutionsDocumentation.java:69)
	at sun.reflect.NativeMethodAccessorImpl.invoke0(Native Method)
	at sun.reflect.NativeMethodAccessorImpl.invoke(NativeMethodAccessorImpl.java:62)
(33 more lines...)
Collapse Failed TaskExecutionsDocumentation launchTaskDisplayDetail History
< 1 sec
java.lang.AssertionError: Status expected:<200> but was:<404>
	at org.springframework.test.util.AssertionErrors.fail(AssertionErrors.java:54)
	at org.springframework.test.util.AssertionErrors.assertEquals(AssertionErrors.java:81)
	at org.springframework.test.web.servlet.result.StatusResultMatchers$10.match(StatusResultMatchers.java:665)
	at org.springframework.test.web.servlet.MockMvc$1.andExpect(MockMvc.java:171)
	at org.springframework.cloud.dataflow.server.rest.documentation.TaskExecutionsDocumentation.launchTaskDisplayDetail(TaskExecutionsDocumentation.java:134)
	at sun.reflect.NativeMethodAccessorImpl.invoke0(Native Method)
	at sun.reflect.NativeMethodAccessorImpl.invoke(NativeMethodAccessorImpl.java:62)
(33 more lines...)
Collapse Failed TaskExecutionsDocumentation listTaskExecutions History
< 1 sec
java.lang.AssertionError: Status expected:<201> but was:<500>
	at org.springframework.test.util.AssertionErrors.fail(AssertionErrors.java:54)
	at org.springframework.test.util.AssertionErrors.assertEquals(AssertionErrors.java:81)
	at org.springframework.test.web.servlet.result.StatusResultMatchers$10.match(StatusResultMatchers.java:665)
	at org.springframework.test.web.servlet.MockMvc$1.andExpect(MockMvc.java:171)
	at org.springframework.cloud.dataflow.server.rest.documentation.TaskExecutionsDocumentation.lambda$listTaskExecutions$0(TaskExecutionsDocumentation.java:86)
	at org.springframework.cloud.dataflow.server.rest.documentation.BaseDocumentation$ToggleableResultHandler.dontDocument(BaseDocumentation.java:158)
	at org.springframework.cloud.dataflow.server.rest.documentation.TaskExecutionsDocumentation.listTaskExecutions(TaskExecutionsDocumentation.java:81)
(35 more lines...)
Collapse Failed TaskExecutionsDocumentation listTaskExecutionsByName History
< 1 sec
org.springframework.restdocs.snippet.SnippetException: Fields with the following paths were not found in the payload: [_embedded.taskExecutionResourceList]
	at org.springframework.restdocs.payload.AbstractFieldsSnippet.validateFieldDocumentation(AbstractFieldsSnippet.java:176)
	at org.springframework.restdocs.payload.AbstractFieldsSnippet.createModel(AbstractFieldsSnippet.java:100)
	at org.springframework.restdocs.snippet.TemplatedSnippet.document(TemplatedSnippet.java:64)
	at org.springframework.restdocs.generate.RestDocumentationGenerator.handle(RestDocumentationGenerator.java:196)
	at org.springframework.restdocs.mockmvc.RestDocumentationResultHandler$1.handle(RestDocumentationResultHandler.java:100)
	at org.springframework.test.web.servlet.MockMvc$1.andDo(MockMvc.java:177)
	at org.springframework.cloud.dataflow.server.rest.documentation.TaskExecutionsDocumentation.listTaskExecutionsByName(TaskExecutionsDocumentation.java:114)
(35 more lines...)
Collapse Failed TaskExecutionsDocumentation removeTaskExecution History
< 1 sec
java.lang.AssertionError: Status expected:<200> but was:<404>
	at org.springframework.test.util.AssertionErrors.fail(AssertionErrors.java:54)
	at org.springframework.test.util.AssertionErrors.assertEquals(AssertionErrors.java:81)
	at org.springframework.test.web.servlet.result.StatusResultMatchers$10.match(StatusResultMatchers.java:665)
	at org.springframework.test.web.servlet.MockMvc$1.andExpect(MockMvc.java:171)
	at org.springframework.cloud.dataflow.server.rest.documentation.TaskExecutionsDocumentation.removeTaskExecution(TaskExecutionsDocumentation.java:146)
	at sun.reflect.NativeMethodAccessorImpl.invoke0(Native Method)
	at sun.reflect.NativeMethodAccessorImpl.invoke(NativeMethodAccessorImpl.java:62)
(33 more lines...)

Error summary

The build generated some errors. See the full build log for more details.

Java HotSpot(TM) 64-Bit Server VM warning: ignoring option MaxPermSize=1024m; support was removed in 8.0
Security framework of XStream not initialized, XStream is probably vulnerable.
Security framework of XStream not initialized, XStream is probably vulnerable.
Security framework of XStream not initialized, XStream is probably vulnerable.
Security framework of XStream not initialized, XStream is probably vulnerable.
Security framework of XStream not initialized, XStream is probably vulnerable.
Security framework of XStream not initialized, XStream is probably vulnerable.
Security framework of XStream not initialized, XStream is probably vulnerable.
Security framework of XStream not initialized, XStream is probably vulnerable.
Security framework of XStream not initialized, XStream is probably vulnerable.
Security framework of XStream not initialized, XStream is probably vulnerable.
Security framework of XStream not initialized, XStream is probably vulnerable.