Build Spring Cloud Data Flow

Build: #2453 failed

Job: Build and install SCDF failed

Stages & jobs

  1. Default Stage

  2. Build Docker Images and upload

Job result summary

Completed
Duration
7 minutes
Revision
da40c8f8c2c26a034eb24322c74f3f2fa5f39802 da40c8f8c2c26a034eb24322c74f3f2fa5f39802
Total tests
789
Fixed in
#2454 (Manual run by Mark Pollack)

Tests

  • 789 tests in total
  • 11 tests failed
  • 11 failures are new
  • 17 tests were quarantined / skipped
  • 3 minutes taken in total.
New test failures 11
Status Test Duration
Collapse Failed AppRegistryDocumentation getSingleApplication History
< 1 sec
java.lang.AssertionError: Status expected:<200> but was:<500>
	at org.springframework.cloud.dataflow.server.rest.documentation.AppRegistryDocumentation.getSingleApplication(AppRegistryDocumentation.java:109)
Collapse Failed JobExecutionsDocumentation jobRestart History
< 1 sec
java.lang.AssertionError: Status expected:<200> but was:<500>
	at org.springframework.cloud.dataflow.server.rest.documentation.JobExecutionsDocumentation.jobRestart(JobExecutionsDocumentation.java:208)
Collapse Failed RuntimeAppsDocumentation getSingleAppSingleInstance History
< 1 sec
java.lang.AssertionError: Status expected:<201> but was:<500>
	at org.springframework.cloud.dataflow.server.rest.documentation.RuntimeAppsDocumentation.setup(RuntimeAppsDocumentation.java:48)
Collapse Failed RuntimeAppsDocumentation listAllApps History
< 1 sec
java.lang.AssertionError: Status expected:<201> but was:<409>
	at org.springframework.cloud.dataflow.server.rest.documentation.RuntimeAppsDocumentation.setup(RuntimeAppsDocumentation.java:46)
Collapse Failed RuntimeAppsDocumentation listSingleAppAllInstances History
< 1 sec
java.lang.AssertionError: Status expected:<201> but was:<409>
	at org.springframework.cloud.dataflow.server.rest.documentation.RuntimeAppsDocumentation.setup(RuntimeAppsDocumentation.java:46)
Collapse Failed TaskExecutionsDocumentation launchTask History
< 1 sec
java.lang.AssertionError: Status expected:<201> but was:<500>
	at org.springframework.cloud.dataflow.server.rest.documentation.TaskExecutionsDocumentation.launchTask(TaskExecutionsDocumentation.java:69)
Collapse Failed TaskExecutionsDocumentation launchTaskDisplayDetail History
< 1 sec
java.lang.AssertionError: Status expected:<200> but was:<404>
	at org.springframework.cloud.dataflow.server.rest.documentation.TaskExecutionsDocumentation.launchTaskDisplayDetail(TaskExecutionsDocumentation.java:134)
Collapse Failed TaskExecutionsDocumentation listTaskExecutions History
< 1 sec
java.lang.AssertionError: Status expected:<201> but was:<500>
	at org.springframework.cloud.dataflow.server.rest.documentation.TaskExecutionsDocumentation.lambda$listTaskExecutions$0(TaskExecutionsDocumentation.java:86)
	at org.springframework.cloud.dataflow.server.rest.documentation.TaskExecutionsDocumentation.listTaskExecutions(TaskExecutionsDocumentation.java:81)
Collapse Failed TaskExecutionsDocumentation listTaskExecutionsByName History
< 1 sec
org.springframework.restdocs.snippet.SnippetException: Fields with the following paths were not found in the payload: [_embedded.taskExecutionResourceList]
	at org.springframework.cloud.dataflow.server.rest.documentation.TaskExecutionsDocumentation.listTaskExecutionsByName(TaskExecutionsDocumentation.java:114)
Collapse Failed TaskExecutionsDocumentation removeTaskExecution History
< 1 sec
java.lang.AssertionError: Status expected:<200> but was:<404>
	at org.springframework.cloud.dataflow.server.rest.documentation.TaskExecutionsDocumentation.removeTaskExecution(TaskExecutionsDocumentation.java:157)
Collapse Failed TaskSchedulerDocumentation createSchedule History
< 1 sec
java.lang.AssertionError: Status expected:<201> but was:<500>
	at org.springframework.cloud.dataflow.server.rest.documentation.TaskSchedulerDocumentation.createSchedule(TaskSchedulerDocumentation.java:66)

Error summary

The build generated some errors. See the full build log for more details.

Java HotSpot(TM) 64-Bit Server VM warning: ignoring option MaxPermSize=1024m; support was removed in 8.0