Build Spring Cloud Data Flow

Build: #2610 failed

Job: Build and install SCDF failed

Stages & jobs

  1. Default Stage

  2. Build Docker Images and upload

Build log

The build generated 33,027 lines of output.The output is too long and has been truncated to the last 1,000 lines. Download or view full build log

14-Feb-2019 12:44:43
14-Feb-2019 12:44:43 MockHttpServletResponse:
14-Feb-2019 12:44:43            Status = 200
14-Feb-2019 12:44:43     Error message = null
14-Feb-2019 12:44:43           Headers = [Content-Type:"application/hal+json;charset=UTF-8", X-Content-Type-Options:"nosniff", X-XSS-Protection:"1; mode=block", Cache-Control:"no-cache, no-store, max-age=0, must-revalidate", Pragma:"no-cache", Expires:"0", X-Frame-Options:"DENY"]
14-Feb-2019 12:44:43      Content type = application/hal+json;charset=UTF-8
14-Feb-2019 12:44:43              Body = {"authenticationEnabled":true,"authenticated":true,"username":"myclient","roles":["ROLE_SCHEDULE","ROLE_DESTROY","ROLE_CREATE","ROLE_VIEW","ROLE_DEPLOY","ROLE_MODIFY","ROLE_MANAGE"],"_links":{"self":{"href":"http://localhost/security/info"}}}
14-Feb-2019 12:44:43     Forwarded URL = null
14-Feb-2019 12:44:43    Redirected URL = null
14-Feb-2019 12:44:43           Cookies = []
14-Feb-2019 12:44:43
14-Feb-2019 12:44:43 MockHttpServletRequest:
14-Feb-2019 12:44:43       HTTP Method = GET
14-Feb-2019 12:44:43       Request URI = /logout
14-Feb-2019 12:44:43        Parameters = {}
14-Feb-2019 12:44:43           Headers = [Authorization:"bearer 71d268a9-7b12-49b8-ae79-c8c7a9680674"]
14-Feb-2019 12:44:43              Body = <no character encoding set>
14-Feb-2019 12:44:43     Session Attrs = {}
14-Feb-2019 12:44:43
14-Feb-2019 12:44:43 Handler:
14-Feb-2019 12:44:43              Type = null
14-Feb-2019 12:44:43
14-Feb-2019 12:44:43 Async:
14-Feb-2019 12:44:43     Async started = false
14-Feb-2019 12:44:43      Async result = null
14-Feb-2019 12:44:43
14-Feb-2019 12:44:43 Resolved Exception:
14-Feb-2019 12:44:43              Type = null
14-Feb-2019 12:44:43
14-Feb-2019 12:44:43 ModelAndView:
14-Feb-2019 12:44:43         View name = null
14-Feb-2019 12:44:43              View = null
14-Feb-2019 12:44:43             Model = null
14-Feb-2019 12:44:43
14-Feb-2019 12:44:43 FlashMap:
14-Feb-2019 12:44:43        Attributes = null
14-Feb-2019 12:44:43
14-Feb-2019 12:44:43 MockHttpServletResponse:
14-Feb-2019 12:44:43            Status = 204
14-Feb-2019 12:44:43     Error message = null
14-Feb-2019 12:44:43           Headers = [X-Content-Type-Options:"nosniff", X-XSS-Protection:"1; mode=block", Cache-Control:"no-cache, no-store, max-age=0, must-revalidate", Pragma:"no-cache", Expires:"0", X-Frame-Options:"DENY"]
14-Feb-2019 12:44:43      Content type = null
14-Feb-2019 12:44:43              Body =
14-Feb-2019 12:44:43     Forwarded URL = null
14-Feb-2019 12:44:43    Redirected URL = null
14-Feb-2019 12:44:43           Cookies = []
14-Feb-2019 12:44:43
14-Feb-2019 12:44:43 MockHttpServletRequest:
14-Feb-2019 12:44:43       HTTP Method = GET
14-Feb-2019 12:44:43       Request URI = /security/info
14-Feb-2019 12:44:43        Parameters = {}
14-Feb-2019 12:44:43           Headers = [Authorization:"bearer 71d268a9-7b12-49b8-ae79-c8c7a9680674"]
14-Feb-2019 12:44:43              Body = null
14-Feb-2019 12:44:43     Session Attrs = {SPRING_SECURITY_CONTEXT=org.springframework.security.core.context.SecurityContextImpl@ce70a3dc: Authentication: org.springframework.security.oauth2.provider.OAuth2Authentication@ce70a3dc: Principal: myclient; Credentials: [PROTECTED]; Authenticated: true; Details: remoteAddress=127.0.0.1, tokenType=bearertokenValue=<TOKEN>; Granted Authorities: ROLE_SCHEDULE, ROLE_DESTROY, ROLE_CREATE, ROLE_VIEW, ROLE_DEPLOY, ROLE_MODIFY, ROLE_MANAGE}
14-Feb-2019 12:44:43
14-Feb-2019 12:44:43 Handler:
14-Feb-2019 12:44:43              Type = org.springframework.cloud.dataflow.server.controller.security.SecurityController
14-Feb-2019 12:44:43            Method = public org.springframework.cloud.dataflow.rest.resource.security.SecurityInfoResource org.springframework.cloud.dataflow.server.controller.security.SecurityController.getSecurityInfo()
14-Feb-2019 12:44:43
14-Feb-2019 12:44:43 Async:
14-Feb-2019 12:44:43     Async started = false
14-Feb-2019 12:44:43      Async result = null
14-Feb-2019 12:44:43
14-Feb-2019 12:44:43 Resolved Exception:
14-Feb-2019 12:44:43              Type = null
14-Feb-2019 12:44:43
14-Feb-2019 12:44:43 ModelAndView:
14-Feb-2019 12:44:43         View name = null
14-Feb-2019 12:44:43              View = null
14-Feb-2019 12:44:43             Model = null
14-Feb-2019 12:44:43
14-Feb-2019 12:44:43 FlashMap:
14-Feb-2019 12:44:43        Attributes = null
14-Feb-2019 12:44:43
14-Feb-2019 12:44:43 MockHttpServletResponse:
14-Feb-2019 12:44:43            Status = 200
14-Feb-2019 12:44:43     Error message = null
14-Feb-2019 12:44:43           Headers = [Content-Type:"application/hal+json;charset=UTF-8", X-Content-Type-Options:"nosniff", X-XSS-Protection:"1; mode=block", Cache-Control:"no-cache, no-store, max-age=0, must-revalidate", Pragma:"no-cache", Expires:"0", X-Frame-Options:"DENY"]
14-Feb-2019 12:44:43      Content type = application/hal+json;charset=UTF-8
14-Feb-2019 12:44:43              Body = {"authenticationEnabled":true,"authenticated":true,"username":"myclient","roles":["ROLE_SCHEDULE","ROLE_DESTROY","ROLE_CREATE","ROLE_VIEW","ROLE_DEPLOY","ROLE_MODIFY","ROLE_MANAGE"],"_links":{"self":{"href":"http://localhost/security/info"}}}
14-Feb-2019 12:44:43     Forwarded URL = null
14-Feb-2019 12:44:43    Redirected URL = null
14-Feb-2019 12:44:43           Cookies = []
14-Feb-2019 12:44:43 2019-02-14 12:44:43.270  INFO 13313 --- [           main] o.s.c.d.s.config.web.WebConfiguration    : Embedded H2 server stopped!
14-Feb-2019 12:44:43 2019-02-14 12:44:43.274  INFO 13313 --- [           main] o.s.s.concurrent.ThreadPoolTaskExecutor  : Shutting down ExecutorService 'applicationTaskExecutor'
14-Feb-2019 12:44:43 2019-02-14 12:44:43.276  INFO 13313 --- [           main] j.LocalContainerEntityManagerFactoryBean : Closing JPA EntityManagerFactory for persistence unit 'default'
14-Feb-2019 12:44:43 2019-02-14 12:44:43.287  INFO 13313 --- [           main] com.zaxxer.hikari.HikariDataSource       : HikariPool-2 - Shutdown initiated...
14-Feb-2019 12:44:43 2019-02-14 12:44:43.302  INFO 13313 --- [           main] com.zaxxer.hikari.HikariDataSource       : HikariPool-2 - Shutdown completed.
14-Feb-2019 12:44:43 2019-02-14 12:44:43.308  INFO 13313 --- [           main] o.apache.catalina.core.StandardService   : Stopping service [Tomcat]
14-Feb-2019 12:44:43 [INFO] Tests run: 14, Failures: 0, Errors: 0, Skipped: 0, Time elapsed: 5.124 s - in org.springframework.cloud.dataflow.server.single.security.LocalServerSecurityWithOAuth2Tests
14-Feb-2019 12:44:43 [INFO] Running org.springframework.cloud.dataflow.server.single.LocalConfigurationTests
14-Feb-2019 12:44:43 [WARNING] Tests run: 1, Failures: 0, Errors: 0, Skipped: 1, Time elapsed: 0 s - in org.springframework.cloud.dataflow.server.single.LocalConfigurationTests
14-Feb-2019 12:44:43 [INFO] Running org.springframework.cloud.dataflow.server.local.security.LocalServerSecurityWithLdapSearchAndBindTests
14-Feb-2019 12:44:43 [WARNING] Tests run: 1, Failures: 0, Errors: 0, Skipped: 1, Time elapsed: 0 s - in org.springframework.cloud.dataflow.server.local.security.LocalServerSecurityWithLdapSearchAndBindTests
14-Feb-2019 12:44:43 [INFO] Running org.springframework.cloud.dataflow.server.local.security.LocalServerSecurityWithLdapSimpleBindAndDefaultManagementTests
14-Feb-2019 12:44:43 [WARNING] Tests run: 1, Failures: 0, Errors: 0, Skipped: 1, Time elapsed: 0 s - in org.springframework.cloud.dataflow.server.local.security.LocalServerSecurityWithLdapSimpleBindAndDefaultManagementTests
14-Feb-2019 12:44:43 [INFO] Running org.springframework.cloud.dataflow.server.local.security.LocalServerSecurityWithLdapSearchAndBindSslTests
14-Feb-2019 12:44:43 [WARNING] Tests run: 1, Failures: 0, Errors: 0, Skipped: 1, Time elapsed: 0 s - in org.springframework.cloud.dataflow.server.local.security.LocalServerSecurityWithLdapSearchAndBindSslTests
14-Feb-2019 12:44:43 [INFO] Running org.springframework.cloud.dataflow.server.local.security.LocalServerSecurityWithLdapSimpleBindGroupMappingTests
14-Feb-2019 12:44:43 [WARNING] Tests run: 1, Failures: 0, Errors: 0, Skipped: 1, Time elapsed: 0 s - in org.springframework.cloud.dataflow.server.local.security.LocalServerSecurityWithLdapSimpleBindGroupMappingTests
14-Feb-2019 12:44:43 [INFO] Running org.springframework.cloud.dataflow.server.local.security.LocalServerSecurityWithLdapSimpleBindTests
14-Feb-2019 12:44:43 [WARNING] Tests run: 1, Failures: 0, Errors: 0, Skipped: 1, Time elapsed: 0 s - in org.springframework.cloud.dataflow.server.local.security.LocalServerSecurityWithLdapSimpleBindTests
14-Feb-2019 12:44:43 2019-02-14 12:44:43.340  INFO 13313 --- [      Thread-25] o.s.s.concurrent.ThreadPoolTaskExecutor  : Shutting down ExecutorService 'applicationTaskExecutor'
14-Feb-2019 12:44:43 2019-02-14 12:44:43.356  INFO 13313 --- [       Thread-9] o.s.s.concurrent.ThreadPoolTaskExecutor  : Shutting down ExecutorService 'applicationTaskExecutor'
14-Feb-2019 12:44:43 [INFO]
14-Feb-2019 12:44:43 [INFO] Results:
14-Feb-2019 12:44:43 [INFO]
14-Feb-2019 12:44:43 [WARNING] Tests run: 292, Failures: 0, Errors: 0, Skipped: 8
14-Feb-2019 12:44:43 [INFO]
14-Feb-2019 12:44:43 [INFO]
14-Feb-2019 12:44:43 [INFO] --- jacoco-maven-plugin:0.7.9:report (report) @ spring-cloud-starter-dataflow-server ---
14-Feb-2019 12:44:43 [INFO] Loading execution data file /opt/bamboo-home/xml-data/build-dir/SCD-BMASTER-JOB1/spring-cloud-starter-dataflow-server/target/jacoco.exec
14-Feb-2019 12:44:43 [INFO] Analyzed bundle 'spring-cloud-starter-dataflow-server' with 0 classes
14-Feb-2019 12:44:44 [INFO]
14-Feb-2019 12:44:44 [INFO] --- maven-jar-plugin:3.0.2:jar (default-jar) @ spring-cloud-starter-dataflow-server ---
14-Feb-2019 12:44:44 [INFO] Building jar: /opt/bamboo-home/xml-data/build-dir/SCD-BMASTER-JOB1/spring-cloud-starter-dataflow-server/target/spring-cloud-starter-dataflow-server-2.0.0.BUILD-SNAPSHOT.jar
14-Feb-2019 12:44:44 [INFO]
14-Feb-2019 12:44:44 [INFO] --- maven-jar-plugin:3.0.2:test-jar (default) @ spring-cloud-starter-dataflow-server ---
14-Feb-2019 12:44:44 [INFO] Building jar: /opt/bamboo-home/xml-data/build-dir/SCD-BMASTER-JOB1/spring-cloud-starter-dataflow-server/target/spring-cloud-starter-dataflow-server-2.0.0.BUILD-SNAPSHOT-tests.jar
14-Feb-2019 12:44:44 [INFO]
14-Feb-2019 12:44:44 [INFO] --- maven-javadoc-plugin:3.0.1:jar (attach-javadocs) @ spring-cloud-starter-dataflow-server ---
14-Feb-2019 12:44:44 [INFO]
14-Feb-2019 12:44:44 [INFO] --- maven-javadoc-plugin:3.0.1:jar (javadoc) @ spring-cloud-starter-dataflow-server ---
14-Feb-2019 12:44:44 [INFO]
14-Feb-2019 12:44:44 [INFO] >>> maven-source-plugin:3.0.1:jar (attach-sources) > generate-sources @ spring-cloud-starter-dataflow-server >>>
14-Feb-2019 12:44:44 [INFO]
14-Feb-2019 12:44:44 [INFO] --- maven-checkstyle-plugin:2.17:check (checkstyle-validation) @ spring-cloud-starter-dataflow-server ---
14-Feb-2019 12:44:44 [INFO] Starting audit...
14-Feb-2019 12:44:44 Audit done.
14-Feb-2019 12:44:44 [INFO]
14-Feb-2019 12:44:44 [INFO] --- jacoco-maven-plugin:0.7.9:prepare-agent (agent) @ spring-cloud-starter-dataflow-server ---
14-Feb-2019 12:44:44 [INFO] argLine set to -javaagent:/home/bamboo/.m2/repository/org/jacoco/org.jacoco.agent/0.7.9/org.jacoco.agent-0.7.9-runtime.jar=destfile=/opt/bamboo-home/xml-data/build-dir/SCD-BMASTER-JOB1/spring-cloud-starter-dataflow-server/target/jacoco.exec
14-Feb-2019 12:44:44 [INFO]
14-Feb-2019 12:44:44 [INFO] <<< maven-source-plugin:3.0.1:jar (attach-sources) < generate-sources @ spring-cloud-starter-dataflow-server <<<
14-Feb-2019 12:44:44 [INFO]
14-Feb-2019 12:44:44 [INFO]
14-Feb-2019 12:44:44 [INFO] --- maven-source-plugin:3.0.1:jar (attach-sources) @ spring-cloud-starter-dataflow-server ---
14-Feb-2019 12:44:44 [INFO] Building jar: /opt/bamboo-home/xml-data/build-dir/SCD-BMASTER-JOB1/spring-cloud-starter-dataflow-server/target/spring-cloud-starter-dataflow-server-2.0.0.BUILD-SNAPSHOT-sources.jar
14-Feb-2019 12:44:44 [INFO]
14-Feb-2019 12:44:44 [INFO] --- maven-install-plugin:2.4:install (default-install) @ spring-cloud-starter-dataflow-server ---
14-Feb-2019 12:44:44 [INFO] Installing /opt/bamboo-home/xml-data/build-dir/SCD-BMASTER-JOB1/spring-cloud-starter-dataflow-server/target/spring-cloud-starter-dataflow-server-2.0.0.BUILD-SNAPSHOT.jar to /home/bamboo/.m2/repository/org/springframework/cloud/spring-cloud-starter-dataflow-server/2.0.0.BUILD-SNAPSHOT/spring-cloud-starter-dataflow-server-2.0.0.BUILD-SNAPSHOT.jar
14-Feb-2019 12:44:44 [INFO] Installing /opt/bamboo-home/xml-data/build-dir/SCD-BMASTER-JOB1/spring-cloud-starter-dataflow-server/pom.xml to /home/bamboo/.m2/repository/org/springframework/cloud/spring-cloud-starter-dataflow-server/2.0.0.BUILD-SNAPSHOT/spring-cloud-starter-dataflow-server-2.0.0.BUILD-SNAPSHOT.pom
14-Feb-2019 12:44:44 [INFO] Installing /opt/bamboo-home/xml-data/build-dir/SCD-BMASTER-JOB1/spring-cloud-starter-dataflow-server/target/spring-cloud-starter-dataflow-server-2.0.0.BUILD-SNAPSHOT-tests.jar to /home/bamboo/.m2/repository/org/springframework/cloud/spring-cloud-starter-dataflow-server/2.0.0.BUILD-SNAPSHOT/spring-cloud-starter-dataflow-server-2.0.0.BUILD-SNAPSHOT-tests.jar
14-Feb-2019 12:44:44 [INFO] Installing /opt/bamboo-home/xml-data/build-dir/SCD-BMASTER-JOB1/spring-cloud-starter-dataflow-server/target/spring-cloud-starter-dataflow-server-2.0.0.BUILD-SNAPSHOT-sources.jar to /home/bamboo/.m2/repository/org/springframework/cloud/spring-cloud-starter-dataflow-server/2.0.0.BUILD-SNAPSHOT/spring-cloud-starter-dataflow-server-2.0.0.BUILD-SNAPSHOT-sources.jar
14-Feb-2019 12:44:45 [INFO]
14-Feb-2019 12:44:45 [INFO] ------------------------------------------------------------------------
14-Feb-2019 12:44:45 [INFO] Building Spring Cloud Data Flow Server 2.0.0.BUILD-SNAPSHOT
14-Feb-2019 12:44:45 [INFO] ------------------------------------------------------------------------
14-Feb-2019 12:44:45 [INFO]
14-Feb-2019 12:44:45 [INFO] --- maven-clean-plugin:2.5:clean (default-clean) @ spring-cloud-dataflow-server ---
14-Feb-2019 12:44:45 [INFO]
14-Feb-2019 12:44:45 [INFO] --- maven-checkstyle-plugin:2.17:check (checkstyle-validation) @ spring-cloud-dataflow-server ---
14-Feb-2019 12:44:45 [INFO] Starting audit...
14-Feb-2019 12:44:45 Audit done.
14-Feb-2019 12:44:45 [INFO]
14-Feb-2019 12:44:45 [INFO] --- jacoco-maven-plugin:0.7.9:prepare-agent (agent) @ spring-cloud-dataflow-server ---
14-Feb-2019 12:44:45 [INFO] argLine set to -javaagent:/home/bamboo/.m2/repository/org/jacoco/org.jacoco.agent/0.7.9/org.jacoco.agent-0.7.9-runtime.jar=destfile=/opt/bamboo-home/xml-data/build-dir/SCD-BMASTER-JOB1/spring-cloud-dataflow-server/target/jacoco.exec
14-Feb-2019 12:44:45 [INFO]
14-Feb-2019 12:44:45 [INFO] --- maven-resources-plugin:3.1.0:resources (default-resources) @ spring-cloud-dataflow-server ---
14-Feb-2019 12:44:45 [INFO] Using 'UTF-8' encoding to copy filtered resources.
14-Feb-2019 12:44:45 [INFO] Copying 2 resources
14-Feb-2019 12:44:45 [INFO]
14-Feb-2019 12:44:45 [INFO] --- maven-compiler-plugin:3.8.0:compile (default-compile) @ spring-cloud-dataflow-server ---
14-Feb-2019 12:44:45 [INFO] Changes detected - recompiling the module!
14-Feb-2019 12:44:45 [INFO] Compiling 2 source files to /opt/bamboo-home/xml-data/build-dir/SCD-BMASTER-JOB1/spring-cloud-dataflow-server/target/classes
14-Feb-2019 12:44:45 [INFO]
14-Feb-2019 12:44:45 [INFO] --- maven-resources-plugin:3.1.0:testResources (default-testResources) @ spring-cloud-dataflow-server ---
14-Feb-2019 12:44:45 [INFO] Using 'UTF-8' encoding to copy filtered resources.
14-Feb-2019 12:44:45 [INFO] skip non existing resourceDirectory /opt/bamboo-home/xml-data/build-dir/SCD-BMASTER-JOB1/spring-cloud-dataflow-server/src/test/resources
14-Feb-2019 12:44:45 [INFO]
14-Feb-2019 12:44:45 [INFO] --- maven-compiler-plugin:3.8.0:testCompile (default-testCompile) @ spring-cloud-dataflow-server ---
14-Feb-2019 12:44:45 [INFO] No sources to compile
14-Feb-2019 12:44:45 [INFO]
14-Feb-2019 12:44:45 [INFO] --- maven-surefire-plugin:2.22.0:test (default-test) @ spring-cloud-dataflow-server ---
14-Feb-2019 12:44:45 [INFO] No tests to run.
14-Feb-2019 12:44:45 [INFO]
14-Feb-2019 12:44:45 [INFO] --- jacoco-maven-plugin:0.7.9:report (report) @ spring-cloud-dataflow-server ---
14-Feb-2019 12:44:45 [INFO] Skipping JaCoCo execution due to missing execution data file.
14-Feb-2019 12:44:45 [INFO]
14-Feb-2019 12:44:45 [INFO] --- maven-jar-plugin:3.0.2:jar (default-jar) @ spring-cloud-dataflow-server ---
14-Feb-2019 12:44:45 [INFO] Building jar: /opt/bamboo-home/xml-data/build-dir/SCD-BMASTER-JOB1/spring-cloud-dataflow-server/target/spring-cloud-dataflow-server-2.0.0.BUILD-SNAPSHOT.jar
14-Feb-2019 12:44:45 [INFO]
14-Feb-2019 12:44:45 [INFO] --- spring-boot-maven-plugin:2.1.2.RELEASE:repackage (default) @ spring-cloud-dataflow-server ---
14-Feb-2019 12:44:45 [INFO] Replacing main artifact with repackaged archive
14-Feb-2019 12:44:45 [INFO]
14-Feb-2019 12:44:45 [INFO] --- maven-javadoc-plugin:3.0.1:jar (attach-javadocs) @ spring-cloud-dataflow-server ---
14-Feb-2019 12:44:45 [INFO] The goal 'org.apache.maven.plugins:maven-javadoc-plugin:3.0.1:javadoc' has not been previously called for the module: 'org.springframework.cloud:spring-cloud-starter-dataflow-server:jar:2.0.0.BUILD-SNAPSHOT'. Trying to invoke it...
14-Feb-2019 12:44:45 [WARN] Maven will be executed in interactive mode, but no input stream has been configured for this MavenInvoker instance.
14-Feb-2019 12:44:50 [ERROR] MavenInvocationException: Error when invoking Maven, consult the invoker log file: /opt/bamboo-home/xml-data/build-dir/SCD-BMASTER-JOB1/spring-cloud-dataflow-server/target/invoker/maven-javadoc-plugin433054517.txt
14-Feb-2019 12:44:50 [WARNING] Creating fake javadoc directory to prevent repeated invocations: /opt/bamboo-home/xml-data/build-dir/SCD-BMASTER-JOB1/spring-cloud-starter-dataflow-server/target/apidocs
14-Feb-2019 12:44:50 [ERROR] Error fetching link: /opt/bamboo-home/xml-data/build-dir/SCD-BMASTER-JOB1/spring-cloud-starter-dataflow-server/target/apidocs/package-list. Ignored it.
14-Feb-2019 12:44:51 [INFO] Building jar: /opt/bamboo-home/xml-data/build-dir/SCD-BMASTER-JOB1/spring-cloud-dataflow-server/target/spring-cloud-dataflow-server-2.0.0.BUILD-SNAPSHOT-javadoc.jar
14-Feb-2019 12:44:51 [INFO]
14-Feb-2019 12:44:51 [INFO] --- maven-javadoc-plugin:3.0.1:jar (javadoc) @ spring-cloud-dataflow-server ---
14-Feb-2019 12:44:51 [ERROR] Error fetching link: /opt/bamboo-home/xml-data/build-dir/SCD-BMASTER-JOB1/spring-cloud-starter-dataflow-server/target/apidocs/package-list. Ignored it.
14-Feb-2019 12:44:52 [INFO] Building jar: /opt/bamboo-home/xml-data/build-dir/SCD-BMASTER-JOB1/spring-cloud-dataflow-server/target/spring-cloud-dataflow-server-2.0.0.BUILD-SNAPSHOT-javadoc.jar
14-Feb-2019 12:44:52 [INFO]
14-Feb-2019 12:44:52 [INFO] >>> maven-source-plugin:3.0.1:jar (attach-sources) > generate-sources @ spring-cloud-dataflow-server >>>
14-Feb-2019 12:44:52 [INFO]
14-Feb-2019 12:44:52 [INFO] --- maven-checkstyle-plugin:2.17:check (checkstyle-validation) @ spring-cloud-dataflow-server ---
14-Feb-2019 12:44:52 [INFO] Starting audit...
14-Feb-2019 12:44:52 Audit done.
14-Feb-2019 12:44:52 [INFO]
14-Feb-2019 12:44:52 [INFO] --- jacoco-maven-plugin:0.7.9:prepare-agent (agent) @ spring-cloud-dataflow-server ---
14-Feb-2019 12:44:52 [INFO] argLine set to -javaagent:/home/bamboo/.m2/repository/org/jacoco/org.jacoco.agent/0.7.9/org.jacoco.agent-0.7.9-runtime.jar=destfile=/opt/bamboo-home/xml-data/build-dir/SCD-BMASTER-JOB1/spring-cloud-dataflow-server/target/jacoco.exec
14-Feb-2019 12:44:52 [INFO]
14-Feb-2019 12:44:52 [INFO] <<< maven-source-plugin:3.0.1:jar (attach-sources) < generate-sources @ spring-cloud-dataflow-server <<<
14-Feb-2019 12:44:52 [INFO]
14-Feb-2019 12:44:52 [INFO]
14-Feb-2019 12:44:52 [INFO] --- maven-source-plugin:3.0.1:jar (attach-sources) @ spring-cloud-dataflow-server ---
14-Feb-2019 12:44:52 [INFO] Building jar: /opt/bamboo-home/xml-data/build-dir/SCD-BMASTER-JOB1/spring-cloud-dataflow-server/target/spring-cloud-dataflow-server-2.0.0.BUILD-SNAPSHOT-sources.jar
14-Feb-2019 12:44:52 [INFO]
14-Feb-2019 12:44:52 [INFO] --- maven-install-plugin:2.4:install (default-install) @ spring-cloud-dataflow-server ---
14-Feb-2019 12:44:52 [INFO] Installing /opt/bamboo-home/xml-data/build-dir/SCD-BMASTER-JOB1/spring-cloud-dataflow-server/target/spring-cloud-dataflow-server-2.0.0.BUILD-SNAPSHOT.jar to /home/bamboo/.m2/repository/org/springframework/cloud/spring-cloud-dataflow-server/2.0.0.BUILD-SNAPSHOT/spring-cloud-dataflow-server-2.0.0.BUILD-SNAPSHOT.jar
14-Feb-2019 12:44:52 [INFO] Installing /opt/bamboo-home/xml-data/build-dir/SCD-BMASTER-JOB1/spring-cloud-dataflow-server/pom.xml to /home/bamboo/.m2/repository/org/springframework/cloud/spring-cloud-dataflow-server/2.0.0.BUILD-SNAPSHOT/spring-cloud-dataflow-server-2.0.0.BUILD-SNAPSHOT.pom
14-Feb-2019 12:44:52 [INFO] Installing /opt/bamboo-home/xml-data/build-dir/SCD-BMASTER-JOB1/spring-cloud-dataflow-server/target/spring-cloud-dataflow-server-2.0.0.BUILD-SNAPSHOT-javadoc.jar to /home/bamboo/.m2/repository/org/springframework/cloud/spring-cloud-dataflow-server/2.0.0.BUILD-SNAPSHOT/spring-cloud-dataflow-server-2.0.0.BUILD-SNAPSHOT-javadoc.jar
14-Feb-2019 12:44:52 [INFO] Installing /opt/bamboo-home/xml-data/build-dir/SCD-BMASTER-JOB1/spring-cloud-dataflow-server/target/spring-cloud-dataflow-server-2.0.0.BUILD-SNAPSHOT-javadoc.jar to /home/bamboo/.m2/repository/org/springframework/cloud/spring-cloud-dataflow-server/2.0.0.BUILD-SNAPSHOT/spring-cloud-dataflow-server-2.0.0.BUILD-SNAPSHOT-javadoc.jar
14-Feb-2019 12:44:52 [INFO] Installing /opt/bamboo-home/xml-data/build-dir/SCD-BMASTER-JOB1/spring-cloud-dataflow-server/target/spring-cloud-dataflow-server-2.0.0.BUILD-SNAPSHOT-sources.jar to /home/bamboo/.m2/repository/org/springframework/cloud/spring-cloud-dataflow-server/2.0.0.BUILD-SNAPSHOT/spring-cloud-dataflow-server-2.0.0.BUILD-SNAPSHOT-sources.jar
14-Feb-2019 12:44:53 [INFO]
14-Feb-2019 12:44:53 [INFO] ------------------------------------------------------------------------
14-Feb-2019 12:44:53 [INFO] Building spring-cloud-dataflow-rest-client 2.0.0.BUILD-SNAPSHOT
14-Feb-2019 12:44:53 [INFO] ------------------------------------------------------------------------
14-Feb-2019 12:44:53 [INFO]
14-Feb-2019 12:44:53 [INFO] --- maven-clean-plugin:2.5:clean (default-clean) @ spring-cloud-dataflow-rest-client ---
14-Feb-2019 12:44:53 [INFO]
14-Feb-2019 12:44:53 [INFO] --- maven-checkstyle-plugin:2.17:check (checkstyle-validation) @ spring-cloud-dataflow-rest-client ---
14-Feb-2019 12:44:53 [INFO] Starting audit...
14-Feb-2019 12:44:53 Audit done.
14-Feb-2019 12:44:53 [INFO]
14-Feb-2019 12:44:53 [INFO] --- jacoco-maven-plugin:0.7.9:prepare-agent (agent) @ spring-cloud-dataflow-rest-client ---
14-Feb-2019 12:44:53 [INFO] argLine set to -javaagent:/home/bamboo/.m2/repository/org/jacoco/org.jacoco.agent/0.7.9/org.jacoco.agent-0.7.9-runtime.jar=destfile=/opt/bamboo-home/xml-data/build-dir/SCD-BMASTER-JOB1/spring-cloud-dataflow-rest-client/target/jacoco.exec
14-Feb-2019 12:44:53 [INFO]
14-Feb-2019 12:44:53 [INFO] --- maven-resources-plugin:3.1.0:resources (default-resources) @ spring-cloud-dataflow-rest-client ---
14-Feb-2019 12:44:53 [INFO] Using 'UTF-8' encoding to copy filtered resources.
14-Feb-2019 12:44:53 [INFO] Copying 0 resource
14-Feb-2019 12:44:53 [INFO] Copying 1 resource
14-Feb-2019 12:44:53 [INFO]
14-Feb-2019 12:44:53 [INFO] --- maven-compiler-plugin:3.8.0:compile (default-compile) @ spring-cloud-dataflow-rest-client ---
14-Feb-2019 12:44:53 [INFO] Changes detected - recompiling the module!
14-Feb-2019 12:44:53 [INFO] Compiling 42 source files to /opt/bamboo-home/xml-data/build-dir/SCD-BMASTER-JOB1/spring-cloud-dataflow-rest-client/target/classes
14-Feb-2019 12:44:53 [INFO]
14-Feb-2019 12:44:53 [INFO] --- maven-resources-plugin:3.1.0:testResources (default-testResources) @ spring-cloud-dataflow-rest-client ---
14-Feb-2019 12:44:53 [INFO] Using 'UTF-8' encoding to copy filtered resources.
14-Feb-2019 12:44:53 [INFO] Copying 2 resources
14-Feb-2019 12:44:53 [INFO]
14-Feb-2019 12:44:53 [INFO] --- maven-compiler-plugin:3.8.0:testCompile (default-testCompile) @ spring-cloud-dataflow-rest-client ---
14-Feb-2019 12:44:53 [INFO] Changes detected - recompiling the module!
14-Feb-2019 12:44:53 [INFO] Compiling 8 source files to /opt/bamboo-home/xml-data/build-dir/SCD-BMASTER-JOB1/spring-cloud-dataflow-rest-client/target/test-classes
14-Feb-2019 12:44:53 [INFO]
14-Feb-2019 12:44:53 [INFO] --- maven-surefire-plugin:2.22.0:test (default-test) @ spring-cloud-dataflow-rest-client ---
14-Feb-2019 12:44:53 [INFO]
14-Feb-2019 12:44:53 [INFO] -------------------------------------------------------
14-Feb-2019 12:44:53 [INFO]  T E S T S
14-Feb-2019 12:44:53 [INFO] -------------------------------------------------------
14-Feb-2019 12:44:54 [INFO] Running org.springframework.cloud.dataflow.rest.client.dsl.StreamDslTests
14-Feb-2019 12:44:54 [INFO] Tests run: 14, Failures: 0, Errors: 0, Skipped: 0, Time elapsed: 0.805 s - in org.springframework.cloud.dataflow.rest.client.dsl.StreamDslTests
14-Feb-2019 12:44:54 [INFO] Running org.springframework.cloud.dataflow.rest.client.TaskTemplateTests
14-Feb-2019 12:44:55 [INFO] Tests run: 3, Failures: 0, Errors: 0, Skipped: 0, Time elapsed: 0.291 s - in org.springframework.cloud.dataflow.rest.client.TaskTemplateTests
14-Feb-2019 12:44:55 [INFO] Running org.springframework.cloud.dataflow.rest.client.DataflowTemplateTests
14-Feb-2019 12:44:55 12:44:55.923 [main] DEBUG org.springframework.web.client.RestTemplate - HTTP GET http://doesnotexist:1234
14-Feb-2019 12:44:56 12:44:56.010 [main] DEBUG org.springframework.web.client.RestTemplate - Accept=[application/json, application/*+json]
14-Feb-2019 12:44:56 [INFO] Tests run: 9, Failures: 0, Errors: 0, Skipped: 0, Time elapsed: 0.8 s - in org.springframework.cloud.dataflow.rest.client.DataflowTemplateTests
14-Feb-2019 12:44:56 [INFO] Running org.springframework.cloud.dataflow.rest.client.JobExecutionDeserializationTests
14-Feb-2019 12:44:56 12:44:56.152 [main] DEBUG org.springframework.cloud.dataflow.rest.client.support.JobParameterJacksonDeserializer - jobParameter - value: com.mysql.jdbc.Driver (type: STRING, isIdentifying: false)
14-Feb-2019 12:44:56 12:44:56.152 [main] DEBUG org.springframework.cloud.dataflow.rest.client.support.JobParameterJacksonDeserializer - jobParameter - value: password (type: STRING, isIdentifying: false)
14-Feb-2019 12:44:56 12:44:56.152 [main] DEBUG org.springframework.cloud.dataflow.rest.client.support.JobParameterJacksonDeserializer - jobParameter - value: foo (type: STRING, isIdentifying: false)
14-Feb-2019 12:44:56 12:44:56.152 [main] DEBUG org.springframework.cloud.dataflow.rest.client.support.JobParameterJacksonDeserializer - jobParameter - value: foo.taskbatch (type: STRING, isIdentifying: false)
14-Feb-2019 12:44:56 12:44:56.152 [main] DEBUG org.springframework.cloud.dataflow.rest.client.support.JobParameterJacksonDeserializer - jobParameter - value: foo-1458074090919 (type: STRING, isIdentifying: false)
14-Feb-2019 12:44:56 12:44:56.152 [main] DEBUG org.springframework.cloud.dataflow.rest.client.support.JobParameterJacksonDeserializer - jobParameter - value: root (type: STRING, isIdentifying: false)
14-Feb-2019 12:44:56 12:44:56.152 [main] DEBUG org.springframework.cloud.dataflow.rest.client.support.JobParameterJacksonDeserializer - jobParameter - value: 26244 (type: STRING, isIdentifying: false)
14-Feb-2019 12:44:56 12:44:56.153 [main] DEBUG org.springframework.cloud.dataflow.rest.client.support.JobParameterJacksonDeserializer - jobParameter - value: jdbc:mysql://localhost:3306/practice (type: STRING, isIdentifying: false)
14-Feb-2019 12:44:56 12:44:56.199 [main] DEBUG org.springframework.cloud.dataflow.rest.client.support.JobParameterJacksonDeserializer - jobParameter - value: com.mysql.jdbc.Driver (type: STRING, isIdentifying: false)
14-Feb-2019 12:44:56 12:44:56.199 [main] DEBUG org.springframework.cloud.dataflow.rest.client.support.JobParameterJacksonDeserializer - jobParameter - value: password (type: STRING, isIdentifying: false)
14-Feb-2019 12:44:56 12:44:56.199 [main] DEBUG org.springframework.cloud.dataflow.rest.client.support.JobParameterJacksonDeserializer - jobParameter - value: foo (type: STRING, isIdentifying: false)
14-Feb-2019 12:44:56 12:44:56.199 [main] DEBUG org.springframework.cloud.dataflow.rest.client.support.JobParameterJacksonDeserializer - jobParameter - value: foo.taskbatch (type: STRING, isIdentifying: false)
14-Feb-2019 12:44:56 12:44:56.199 [main] DEBUG org.springframework.cloud.dataflow.rest.client.support.JobParameterJacksonDeserializer - jobParameter - value: foo-1458075239963 (type: STRING, isIdentifying: false)
14-Feb-2019 12:44:56 12:44:56.199 [main] DEBUG org.springframework.cloud.dataflow.rest.client.support.JobParameterJacksonDeserializer - jobParameter - value: root (type: STRING, isIdentifying: false)
14-Feb-2019 12:44:56 12:44:56.199 [main] DEBUG org.springframework.cloud.dataflow.rest.client.support.JobParameterJacksonDeserializer - jobParameter - value: 25553 (type: STRING, isIdentifying: false)
14-Feb-2019 12:44:56 12:44:56.201 [main] DEBUG org.springframework.cloud.dataflow.rest.client.support.JobParameterJacksonDeserializer - jobParameter - value: jdbc:mysql://localhost:3306/practice (type: STRING, isIdentifying: false)
14-Feb-2019 12:44:56 12:44:56.204 [main] DEBUG org.springframework.cloud.dataflow.rest.client.support.JobParameterJacksonDeserializer - jobParameter - value: com.mysql.jdbc.Driver (type: STRING, isIdentifying: false)
14-Feb-2019 12:44:56 12:44:56.204 [main] DEBUG org.springframework.cloud.dataflow.rest.client.support.JobParameterJacksonDeserializer - jobParameter - value: password (type: STRING, isIdentifying: false)
14-Feb-2019 12:44:56 12:44:56.204 [main] DEBUG org.springframework.cloud.dataflow.rest.client.support.JobParameterJacksonDeserializer - jobParameter - value: foo (type: STRING, isIdentifying: false)
14-Feb-2019 12:44:56 12:44:56.204 [main] DEBUG org.springframework.cloud.dataflow.rest.client.support.JobParameterJacksonDeserializer - jobParameter - value: foo.taskbatch (type: STRING, isIdentifying: false)
14-Feb-2019 12:44:56 12:44:56.205 [main] DEBUG org.springframework.cloud.dataflow.rest.client.support.JobParameterJacksonDeserializer - jobParameter - value: foo-1458074090919 (type: STRING, isIdentifying: false)
14-Feb-2019 12:44:56 12:44:56.205 [main] DEBUG org.springframework.cloud.dataflow.rest.client.support.JobParameterJacksonDeserializer - jobParameter - value: root (type: STRING, isIdentifying: false)
14-Feb-2019 12:44:56 12:44:56.205 [main] DEBUG org.springframework.cloud.dataflow.rest.client.support.JobParameterJacksonDeserializer - jobParameter - value: 26244 (type: STRING, isIdentifying: false)
14-Feb-2019 12:44:56 12:44:56.205 [main] DEBUG org.springframework.cloud.dataflow.rest.client.support.JobParameterJacksonDeserializer - jobParameter - value: jdbc:mysql://localhost:3306/practice (type: STRING, isIdentifying: false)
14-Feb-2019 12:44:56 [INFO] Tests run: 2, Failures: 0, Errors: 0, Skipped: 0, Time elapsed: 0.138 s - in org.springframework.cloud.dataflow.rest.client.JobExecutionDeserializationTests
14-Feb-2019 12:44:56 [INFO] Running org.springframework.cloud.dataflow.rest.client.DataflowClientExceptionTests
14-Feb-2019 12:44:56 [INFO] Tests run: 3, Failures: 0, Errors: 0, Skipped: 0, Time elapsed: 0.001 s - in org.springframework.cloud.dataflow.rest.client.DataflowClientExceptionTests
14-Feb-2019 12:44:56 [INFO] Running org.springframework.cloud.dataflow.rest.client.DataFlowClientAutoConfigurationTests
14-Feb-2019 12:44:56
14-Feb-2019 12:44:56   .   ____          _            __ _ _
14-Feb-2019 12:44:56 /\\ / ___'_ __ _ _(_)_ __  __ _ \ \ \ \
14-Feb-2019 12:44:56 ( ( )\___ | '_ | '_| | '_ \/ _` | \ \ \ \
14-Feb-2019 12:44:56 \\/  ___)| |_)| | | | | || (_| |  ) ) ) )
14-Feb-2019 12:44:56   '  |____| .__|_| |_|_| |_\__, | / / / /
14-Feb-2019 12:44:56 =========|_|==============|___/=/_/_/_/
14-Feb-2019 12:44:56 :: Spring Boot ::        (v2.1.2.RELEASE)
14-Feb-2019 12:44:56
14-Feb-2019 12:44:56 2019-02-14 12:44:56.787  INFO 13794 --- [           main] o.a.maven.surefire.booter.ForkedBooter   : Starting ForkedBooter v2.22.0 on bamboo-05 with PID 13794 (started by bamboo in /opt/bamboo-home/xml-data/build-dir/SCD-BMASTER-JOB1/spring-cloud-dataflow-rest-client)
14-Feb-2019 12:44:56 2019-02-14 12:44:56.789  INFO 13794 --- [           main] o.a.maven.surefire.booter.ForkedBooter   : No active profile set, falling back to default profiles: default
14-Feb-2019 12:44:58 2019-02-14 12:44:58.258  INFO 13794 --- [           main] o.a.maven.surefire.booter.ForkedBooter   : Started ForkedBooter in 1.979 seconds (JVM running for 4.579)
14-Feb-2019 12:44:58
14-Feb-2019 12:44:58   .   ____          _            __ _ _
14-Feb-2019 12:44:58 /\\ / ___'_ __ _ _(_)_ __  __ _ \ \ \ \
14-Feb-2019 12:44:58 ( ( )\___ | '_ | '_| | '_ \/ _` | \ \ \ \
14-Feb-2019 12:44:58 \\/  ___)| |_)| | | | | || (_| |  ) ) ) )
14-Feb-2019 12:44:58   '  |____| .__|_| |_|_| |_\__, | / / / /
14-Feb-2019 12:44:58 =========|_|==============|___/=/_/_/_/
14-Feb-2019 12:44:58 :: Spring Boot ::        (v2.1.2.RELEASE)
14-Feb-2019 12:44:58
14-Feb-2019 12:44:58 2019-02-14 12:44:58.287  INFO 13794 --- [           main] o.a.maven.surefire.booter.ForkedBooter   : Starting ForkedBooter v2.22.0 on bamboo-05 with PID 13794 (started by bamboo in /opt/bamboo-home/xml-data/build-dir/SCD-BMASTER-JOB1/spring-cloud-dataflow-rest-client)
14-Feb-2019 12:44:58 2019-02-14 12:44:58.288  INFO 13794 --- [           main] o.a.maven.surefire.booter.ForkedBooter   : No active profile set, falling back to default profiles: default
14-Feb-2019 12:44:58 2019-02-14 12:44:58.644  INFO 13794 --- [           main] o.a.maven.surefire.booter.ForkedBooter   : Started ForkedBooter in 0.38 seconds (JVM running for 4.965)
14-Feb-2019 12:44:58 [INFO] Tests run: 2, Failures: 0, Errors: 0, Skipped: 0, Time elapsed: 2.437 s - in org.springframework.cloud.dataflow.rest.client.DataFlowClientAutoConfigurationTests
14-Feb-2019 12:44:58 [INFO] Running org.springframework.cloud.dataflow.rest.client.SchedulerTemplateTests
14-Feb-2019 12:44:58 [INFO] Tests run: 5, Failures: 0, Errors: 0, Skipped: 0, Time elapsed: 0.009 s - in org.springframework.cloud.dataflow.rest.client.SchedulerTemplateTests
14-Feb-2019 12:44:58 [INFO] Running org.springframework.cloud.dataflow.rest.client.VersionUtilsTests
14-Feb-2019 12:44:58 [INFO] Tests run: 3, Failures: 0, Errors: 0, Skipped: 0, Time elapsed: 0.003 s - in org.springframework.cloud.dataflow.rest.client.VersionUtilsTests
14-Feb-2019 12:44:59 [INFO]
14-Feb-2019 12:44:59 [INFO] Results:
14-Feb-2019 12:44:59 [INFO]
14-Feb-2019 12:44:59 [INFO] Tests run: 41, Failures: 0, Errors: 0, Skipped: 0
14-Feb-2019 12:44:59 [INFO]
14-Feb-2019 12:44:59 [INFO]
14-Feb-2019 12:44:59 [INFO] --- jacoco-maven-plugin:0.7.9:report (report) @ spring-cloud-dataflow-rest-client ---
14-Feb-2019 12:44:59 [INFO] Loading execution data file /opt/bamboo-home/xml-data/build-dir/SCD-BMASTER-JOB1/spring-cloud-dataflow-rest-client/target/jacoco.exec
14-Feb-2019 12:44:59 [INFO] Analyzed bundle 'spring-cloud-dataflow-rest-client' with 42 classes
14-Feb-2019 12:44:59 [INFO]
14-Feb-2019 12:44:59 [INFO] --- maven-jar-plugin:3.0.2:jar (default-jar) @ spring-cloud-dataflow-rest-client ---
14-Feb-2019 12:44:59 [INFO] Building jar: /opt/bamboo-home/xml-data/build-dir/SCD-BMASTER-JOB1/spring-cloud-dataflow-rest-client/target/spring-cloud-dataflow-rest-client-2.0.0.BUILD-SNAPSHOT.jar
14-Feb-2019 12:44:59 [INFO]
14-Feb-2019 12:44:59 [INFO] --- maven-javadoc-plugin:3.0.1:jar (attach-javadocs) @ spring-cloud-dataflow-rest-client ---
14-Feb-2019 12:45:00 [INFO]
14-Feb-2019 12:45:00 1 error
14-Feb-2019 12:45:00 1 warning
14-Feb-2019 12:45:00 [ERROR] MavenReportException: Error while generating Javadoc:
14-Feb-2019 12:45:00 Exit code: 1 - /opt/bamboo-home/xml-data/build-dir/SCD-BMASTER-JOB1/spring-cloud-dataflow-rest-client/src/main/java/org/springframework/cloud/dataflow/rest/client/DataFlowClientException.java:41: error: @param name not found
14-Feb-2019 12:45:00          * @param error Must not be null
14-Feb-2019 12:45:00                   ^
14-Feb-2019 12:45:00 /opt/bamboo-home/xml-data/build-dir/SCD-BMASTER-JOB1/spring-cloud-dataflow-rest-client/src/main/java/org/springframework/cloud/dataflow/rest/client/DataFlowClientException.java:43: warning: no @param for vndErrors
14-Feb-2019 12:45:00         public DataFlowClientException(VndErrors vndErrors) {
14-Feb-2019 12:45:00                ^
14-Feb-2019 12:45:00
14-Feb-2019 12:45:00 Command line was: /opt/jdk1.8.0_144/jre/../bin/javadoc @options @packages
14-Feb-2019 12:45:00
14-Feb-2019 12:45:00 Refer to the generated Javadoc files in '/opt/bamboo-home/xml-data/build-dir/SCD-BMASTER-JOB1/spring-cloud-dataflow-rest-client/target/apidocs' dir.
14-Feb-2019 12:45:00
14-Feb-2019 12:45:00 org.apache.maven.reporting.MavenReportException:
14-Feb-2019 12:45:00 Exit code: 1 - /opt/bamboo-home/xml-data/build-dir/SCD-BMASTER-JOB1/spring-cloud-dataflow-rest-client/src/main/java/org/springframework/cloud/dataflow/rest/client/DataFlowClientException.java:41: error: @param name not found
14-Feb-2019 12:45:00          * @param error Must not be null
14-Feb-2019 12:45:00                   ^
14-Feb-2019 12:45:00 /opt/bamboo-home/xml-data/build-dir/SCD-BMASTER-JOB1/spring-cloud-dataflow-rest-client/src/main/java/org/springframework/cloud/dataflow/rest/client/DataFlowClientException.java:43: warning: no @param for vndErrors
14-Feb-2019 12:45:00         public DataFlowClientException(VndErrors vndErrors) {
14-Feb-2019 12:45:00                ^
14-Feb-2019 12:45:00
14-Feb-2019 12:45:00 Command line was: /opt/jdk1.8.0_144/jre/../bin/javadoc @options @packages
14-Feb-2019 12:45:00
14-Feb-2019 12:45:00 Refer to the generated Javadoc files in '/opt/bamboo-home/xml-data/build-dir/SCD-BMASTER-JOB1/spring-cloud-dataflow-rest-client/target/apidocs' dir.
14-Feb-2019 12:45:00
14-Feb-2019 12:45:00         at org.apache.maven.plugins.javadoc.AbstractJavadocMojo.executeJavadocCommandLine(AbstractJavadocMojo.java:5298)
14-Feb-2019 12:45:00         at org.apache.maven.plugins.javadoc.AbstractJavadocMojo.executeReport(AbstractJavadocMojo.java:2134)
14-Feb-2019 12:45:00         at org.apache.maven.plugins.javadoc.JavadocJar.doExecute(JavadocJar.java:190)
14-Feb-2019 12:45:00         at org.apache.maven.plugins.javadoc.AbstractJavadocMojo.execute(AbstractJavadocMojo.java:1912)
14-Feb-2019 12:45:00         at org.apache.maven.plugin.DefaultBuildPluginManager.executeMojo(DefaultBuildPluginManager.java:134)
14-Feb-2019 12:45:00         at org.apache.maven.lifecycle.internal.MojoExecutor.execute(MojoExecutor.java:208)
14-Feb-2019 12:45:00         at org.apache.maven.lifecycle.internal.MojoExecutor.execute(MojoExecutor.java:154)
14-Feb-2019 12:45:00         at org.apache.maven.lifecycle.internal.MojoExecutor.execute(MojoExecutor.java:146)
14-Feb-2019 12:45:00         at org.apache.maven.lifecycle.internal.LifecycleModuleBuilder.buildProject(LifecycleModuleBuilder.java:117)
14-Feb-2019 12:45:00         at org.apache.maven.lifecycle.internal.LifecycleModuleBuilder.buildProject(LifecycleModuleBuilder.java:81)
14-Feb-2019 12:45:00         at org.apache.maven.lifecycle.internal.builder.singlethreaded.SingleThreadedBuilder.build(SingleThreadedBuilder.java:51)
14-Feb-2019 12:45:00         at org.apache.maven.lifecycle.internal.LifecycleStarter.execute(LifecycleStarter.java:128)
14-Feb-2019 12:45:00         at org.apache.maven.DefaultMaven.doExecute(DefaultMaven.java:309)
14-Feb-2019 12:45:00         at org.apache.maven.DefaultMaven.doExecute(DefaultMaven.java:194)
14-Feb-2019 12:45:00         at org.apache.maven.DefaultMaven.execute(DefaultMaven.java:107)
14-Feb-2019 12:45:00         at org.apache.maven.cli.MavenCli.execute(MavenCli.java:993)
14-Feb-2019 12:45:00         at org.apache.maven.cli.MavenCli.doMain(MavenCli.java:345)
14-Feb-2019 12:45:00         at org.apache.maven.cli.MavenCli.main(MavenCli.java:191)
14-Feb-2019 12:45:00         at sun.reflect.NativeMethodAccessorImpl.invoke0(Native Method)
14-Feb-2019 12:45:00         at sun.reflect.NativeMethodAccessorImpl.invoke(NativeMethodAccessorImpl.java:62)
14-Feb-2019 12:45:00         at sun.reflect.DelegatingMethodAccessorImpl.invoke(DelegatingMethodAccessorImpl.java:43)
14-Feb-2019 12:45:00         at java.lang.reflect.Method.invoke(Method.java:498)
14-Feb-2019 12:45:00         at org.codehaus.plexus.classworlds.launcher.Launcher.launchEnhanced(Launcher.java:289)
14-Feb-2019 12:45:00         at org.codehaus.plexus.classworlds.launcher.Launcher.launch(Launcher.java:229)
14-Feb-2019 12:45:00         at org.codehaus.plexus.classworlds.launcher.Launcher.mainWithExitCode(Launcher.java:415)
14-Feb-2019 12:45:00         at org.codehaus.plexus.classworlds.launcher.Launcher.main(Launcher.java:356)
14-Feb-2019 12:45:00 [INFO] Building jar: /opt/bamboo-home/xml-data/build-dir/SCD-BMASTER-JOB1/spring-cloud-dataflow-rest-client/target/spring-cloud-dataflow-rest-client-2.0.0.BUILD-SNAPSHOT-javadoc.jar
14-Feb-2019 12:45:00 [INFO]
14-Feb-2019 12:45:00 [INFO] --- maven-javadoc-plugin:3.0.1:jar (javadoc) @ spring-cloud-dataflow-rest-client ---
14-Feb-2019 12:45:02 [INFO]
14-Feb-2019 12:45:02 1 error
14-Feb-2019 12:45:02 1 warning
14-Feb-2019 12:45:02 [ERROR] MavenReportException: Error while generating Javadoc:
14-Feb-2019 12:45:02 Exit code: 1 - /opt/bamboo-home/xml-data/build-dir/SCD-BMASTER-JOB1/spring-cloud-dataflow-rest-client/src/main/java/org/springframework/cloud/dataflow/rest/client/DataFlowClientException.java:41: error: @param name not found
14-Feb-2019 12:45:02          * @param error Must not be null
14-Feb-2019 12:45:02                   ^
14-Feb-2019 12:45:02 /opt/bamboo-home/xml-data/build-dir/SCD-BMASTER-JOB1/spring-cloud-dataflow-rest-client/src/main/java/org/springframework/cloud/dataflow/rest/client/DataFlowClientException.java:43: warning: no @param for vndErrors
14-Feb-2019 12:45:02         public DataFlowClientException(VndErrors vndErrors) {
14-Feb-2019 12:45:02                ^
14-Feb-2019 12:45:02
14-Feb-2019 12:45:02 Command line was: /opt/jdk1.8.0_144/jre/../bin/javadoc @options @packages
14-Feb-2019 12:45:02
14-Feb-2019 12:45:02 Refer to the generated Javadoc files in '/opt/bamboo-home/xml-data/build-dir/SCD-BMASTER-JOB1/spring-cloud-dataflow-rest-client/target/apidocs' dir.
14-Feb-2019 12:45:02
14-Feb-2019 12:45:02 org.apache.maven.reporting.MavenReportException:
14-Feb-2019 12:45:02 Exit code: 1 - /opt/bamboo-home/xml-data/build-dir/SCD-BMASTER-JOB1/spring-cloud-dataflow-rest-client/src/main/java/org/springframework/cloud/dataflow/rest/client/DataFlowClientException.java:41: error: @param name not found
14-Feb-2019 12:45:02          * @param error Must not be null
14-Feb-2019 12:45:02                   ^
14-Feb-2019 12:45:02 /opt/bamboo-home/xml-data/build-dir/SCD-BMASTER-JOB1/spring-cloud-dataflow-rest-client/src/main/java/org/springframework/cloud/dataflow/rest/client/DataFlowClientException.java:43: warning: no @param for vndErrors
14-Feb-2019 12:45:02         public DataFlowClientException(VndErrors vndErrors) {
14-Feb-2019 12:45:02                ^
14-Feb-2019 12:45:02
14-Feb-2019 12:45:02 Command line was: /opt/jdk1.8.0_144/jre/../bin/javadoc @options @packages
14-Feb-2019 12:45:02
14-Feb-2019 12:45:02 Refer to the generated Javadoc files in '/opt/bamboo-home/xml-data/build-dir/SCD-BMASTER-JOB1/spring-cloud-dataflow-rest-client/target/apidocs' dir.
14-Feb-2019 12:45:02
14-Feb-2019 12:45:02         at org.apache.maven.plugins.javadoc.AbstractJavadocMojo.executeJavadocCommandLine(AbstractJavadocMojo.java:5298)
14-Feb-2019 12:45:02         at org.apache.maven.plugins.javadoc.AbstractJavadocMojo.executeReport(AbstractJavadocMojo.java:2134)
14-Feb-2019 12:45:02         at org.apache.maven.plugins.javadoc.JavadocJar.doExecute(JavadocJar.java:190)
14-Feb-2019 12:45:02         at org.apache.maven.plugins.javadoc.AbstractJavadocMojo.execute(AbstractJavadocMojo.java:1912)
14-Feb-2019 12:45:02         at org.apache.maven.plugin.DefaultBuildPluginManager.executeMojo(DefaultBuildPluginManager.java:134)
14-Feb-2019 12:45:02         at org.apache.maven.lifecycle.internal.MojoExecutor.execute(MojoExecutor.java:208)
14-Feb-2019 12:45:02         at org.apache.maven.lifecycle.internal.MojoExecutor.execute(MojoExecutor.java:154)
14-Feb-2019 12:45:02         at org.apache.maven.lifecycle.internal.MojoExecutor.execute(MojoExecutor.java:146)
14-Feb-2019 12:45:02         at org.apache.maven.lifecycle.internal.LifecycleModuleBuilder.buildProject(LifecycleModuleBuilder.java:117)
14-Feb-2019 12:45:02         at org.apache.maven.lifecycle.internal.LifecycleModuleBuilder.buildProject(LifecycleModuleBuilder.java:81)
14-Feb-2019 12:45:02         at org.apache.maven.lifecycle.internal.builder.singlethreaded.SingleThreadedBuilder.build(SingleThreadedBuilder.java:51)
14-Feb-2019 12:45:02         at org.apache.maven.lifecycle.internal.LifecycleStarter.execute(LifecycleStarter.java:128)
14-Feb-2019 12:45:02         at org.apache.maven.DefaultMaven.doExecute(DefaultMaven.java:309)
14-Feb-2019 12:45:02         at org.apache.maven.DefaultMaven.doExecute(DefaultMaven.java:194)
14-Feb-2019 12:45:02         at org.apache.maven.DefaultMaven.execute(DefaultMaven.java:107)
14-Feb-2019 12:45:02         at org.apache.maven.cli.MavenCli.execute(MavenCli.java:993)
14-Feb-2019 12:45:02         at org.apache.maven.cli.MavenCli.doMain(MavenCli.java:345)
14-Feb-2019 12:45:02         at org.apache.maven.cli.MavenCli.main(MavenCli.java:191)
14-Feb-2019 12:45:02         at sun.reflect.NativeMethodAccessorImpl.invoke0(Native Method)
14-Feb-2019 12:45:02         at sun.reflect.NativeMethodAccessorImpl.invoke(NativeMethodAccessorImpl.java:62)
14-Feb-2019 12:45:02         at sun.reflect.DelegatingMethodAccessorImpl.invoke(DelegatingMethodAccessorImpl.java:43)
14-Feb-2019 12:45:02         at java.lang.reflect.Method.invoke(Method.java:498)
14-Feb-2019 12:45:02         at org.codehaus.plexus.classworlds.launcher.Launcher.launchEnhanced(Launcher.java:289)
14-Feb-2019 12:45:02         at org.codehaus.plexus.classworlds.launcher.Launcher.launch(Launcher.java:229)
14-Feb-2019 12:45:02         at org.codehaus.plexus.classworlds.launcher.Launcher.mainWithExitCode(Launcher.java:415)
14-Feb-2019 12:45:02         at org.codehaus.plexus.classworlds.launcher.Launcher.main(Launcher.java:356)
14-Feb-2019 12:45:02 [INFO] Building jar: /opt/bamboo-home/xml-data/build-dir/SCD-BMASTER-JOB1/spring-cloud-dataflow-rest-client/target/spring-cloud-dataflow-rest-client-2.0.0.BUILD-SNAPSHOT-javadoc.jar
14-Feb-2019 12:45:02 [INFO]
14-Feb-2019 12:45:02 [INFO] >>> maven-source-plugin:3.0.1:jar (attach-sources) > generate-sources @ spring-cloud-dataflow-rest-client >>>
14-Feb-2019 12:45:02 [INFO]
14-Feb-2019 12:45:02 [INFO] --- maven-checkstyle-plugin:2.17:check (checkstyle-validation) @ spring-cloud-dataflow-rest-client ---
14-Feb-2019 12:45:02 [INFO] Starting audit...
14-Feb-2019 12:45:02 Audit done.
14-Feb-2019 12:45:02 [INFO]
14-Feb-2019 12:45:02 [INFO] --- jacoco-maven-plugin:0.7.9:prepare-agent (agent) @ spring-cloud-dataflow-rest-client ---
14-Feb-2019 12:45:02 [INFO] argLine set to -javaagent:/home/bamboo/.m2/repository/org/jacoco/org.jacoco.agent/0.7.9/org.jacoco.agent-0.7.9-runtime.jar=destfile=/opt/bamboo-home/xml-data/build-dir/SCD-BMASTER-JOB1/spring-cloud-dataflow-rest-client/target/jacoco.exec
14-Feb-2019 12:45:02 [INFO]
14-Feb-2019 12:45:02 [INFO] <<< maven-source-plugin:3.0.1:jar (attach-sources) < generate-sources @ spring-cloud-dataflow-rest-client <<<
14-Feb-2019 12:45:02 [INFO]
14-Feb-2019 12:45:02 [INFO]
14-Feb-2019 12:45:02 [INFO] --- maven-source-plugin:3.0.1:jar (attach-sources) @ spring-cloud-dataflow-rest-client ---
14-Feb-2019 12:45:02 [INFO] Building jar: /opt/bamboo-home/xml-data/build-dir/SCD-BMASTER-JOB1/spring-cloud-dataflow-rest-client/target/spring-cloud-dataflow-rest-client-2.0.0.BUILD-SNAPSHOT-sources.jar
14-Feb-2019 12:45:02 [INFO]
14-Feb-2019 12:45:02 [INFO] --- maven-install-plugin:2.4:install (default-install) @ spring-cloud-dataflow-rest-client ---
14-Feb-2019 12:45:02 [INFO] Installing /opt/bamboo-home/xml-data/build-dir/SCD-BMASTER-JOB1/spring-cloud-dataflow-rest-client/target/spring-cloud-dataflow-rest-client-2.0.0.BUILD-SNAPSHOT.jar to /home/bamboo/.m2/repository/org/springframework/cloud/spring-cloud-dataflow-rest-client/2.0.0.BUILD-SNAPSHOT/spring-cloud-dataflow-rest-client-2.0.0.BUILD-SNAPSHOT.jar
14-Feb-2019 12:45:02 [INFO] Installing /opt/bamboo-home/xml-data/build-dir/SCD-BMASTER-JOB1/spring-cloud-dataflow-rest-client/pom.xml to /home/bamboo/.m2/repository/org/springframework/cloud/spring-cloud-dataflow-rest-client/2.0.0.BUILD-SNAPSHOT/spring-cloud-dataflow-rest-client-2.0.0.BUILD-SNAPSHOT.pom
14-Feb-2019 12:45:02 [INFO] Installing /opt/bamboo-home/xml-data/build-dir/SCD-BMASTER-JOB1/spring-cloud-dataflow-rest-client/target/spring-cloud-dataflow-rest-client-2.0.0.BUILD-SNAPSHOT-javadoc.jar to /home/bamboo/.m2/repository/org/springframework/cloud/spring-cloud-dataflow-rest-client/2.0.0.BUILD-SNAPSHOT/spring-cloud-dataflow-rest-client-2.0.0.BUILD-SNAPSHOT-javadoc.jar
14-Feb-2019 12:45:02 [INFO] Installing /opt/bamboo-home/xml-data/build-dir/SCD-BMASTER-JOB1/spring-cloud-dataflow-rest-client/target/spring-cloud-dataflow-rest-client-2.0.0.BUILD-SNAPSHOT-javadoc.jar to /home/bamboo/.m2/repository/org/springframework/cloud/spring-cloud-dataflow-rest-client/2.0.0.BUILD-SNAPSHOT/spring-cloud-dataflow-rest-client-2.0.0.BUILD-SNAPSHOT-javadoc.jar
14-Feb-2019 12:45:02 [INFO] Installing /opt/bamboo-home/xml-data/build-dir/SCD-BMASTER-JOB1/spring-cloud-dataflow-rest-client/target/spring-cloud-dataflow-rest-client-2.0.0.BUILD-SNAPSHOT-sources.jar to /home/bamboo/.m2/repository/org/springframework/cloud/spring-cloud-dataflow-rest-client/2.0.0.BUILD-SNAPSHOT/spring-cloud-dataflow-rest-client-2.0.0.BUILD-SNAPSHOT-sources.jar
14-Feb-2019 12:45:02 [INFO]
14-Feb-2019 12:45:02 [INFO] ------------------------------------------------------------------------
14-Feb-2019 12:45:02 [INFO] Building spring-cloud-dataflow-shell-core 2.0.0.BUILD-SNAPSHOT
14-Feb-2019 12:45:02 [INFO] ------------------------------------------------------------------------
14-Feb-2019 12:45:02 [INFO]
14-Feb-2019 12:45:02 [INFO] --- maven-clean-plugin:2.5:clean (default-clean) @ spring-cloud-dataflow-shell-core ---
14-Feb-2019 12:45:02 [INFO]
14-Feb-2019 12:45:02 [INFO] --- maven-checkstyle-plugin:2.17:check (checkstyle-validation) @ spring-cloud-dataflow-shell-core ---
14-Feb-2019 12:45:02 [INFO] Starting audit...
14-Feb-2019 12:45:02 Audit done.
14-Feb-2019 12:45:02 [INFO]
14-Feb-2019 12:45:02 [INFO] --- jacoco-maven-plugin:0.7.9:prepare-agent (agent) @ spring-cloud-dataflow-shell-core ---
14-Feb-2019 12:45:02 [INFO] argLine set to -javaagent:/home/bamboo/.m2/repository/org/jacoco/org.jacoco.agent/0.7.9/org.jacoco.agent-0.7.9-runtime.jar=destfile=/opt/bamboo-home/xml-data/build-dir/SCD-BMASTER-JOB1/spring-cloud-dataflow-shell-core/target/jacoco.exec
14-Feb-2019 12:45:02 [INFO]
14-Feb-2019 12:45:02 [INFO] --- maven-resources-plugin:3.1.0:resources (default-resources) @ spring-cloud-dataflow-shell-core ---
14-Feb-2019 12:45:02 [INFO] Using 'UTF-8' encoding to copy filtered resources.
14-Feb-2019 12:45:02 [INFO] Copying 0 resource
14-Feb-2019 12:45:02 [INFO] Copying 4 resources
14-Feb-2019 12:45:02 [INFO]
14-Feb-2019 12:45:02 [INFO] --- maven-compiler-plugin:3.8.0:compile (default-compile) @ spring-cloud-dataflow-shell-core ---
14-Feb-2019 12:45:02 [INFO] Changes detected - recompiling the module!
14-Feb-2019 12:45:02 [INFO] Compiling 40 source files to /opt/bamboo-home/xml-data/build-dir/SCD-BMASTER-JOB1/spring-cloud-dataflow-shell-core/target/classes
14-Feb-2019 12:45:03 [INFO]
14-Feb-2019 12:45:03 [INFO] --- maven-resources-plugin:3.1.0:testResources (default-testResources) @ spring-cloud-dataflow-shell-core ---
14-Feb-2019 12:45:03 [INFO] Using 'UTF-8' encoding to copy filtered resources.
14-Feb-2019 12:45:03 [INFO] Copying 17 resources
14-Feb-2019 12:45:03 [INFO]
14-Feb-2019 12:45:03 [INFO] --- maven-compiler-plugin:3.8.0:testCompile (default-testCompile) @ spring-cloud-dataflow-shell-core ---
14-Feb-2019 12:45:03 [INFO] Changes detected - recompiling the module!
14-Feb-2019 12:45:03 [INFO] Compiling 16 source files to /opt/bamboo-home/xml-data/build-dir/SCD-BMASTER-JOB1/spring-cloud-dataflow-shell-core/target/test-classes
14-Feb-2019 12:45:03 [INFO]
14-Feb-2019 12:45:03 [INFO] --- maven-surefire-plugin:2.22.0:test (default-test) @ spring-cloud-dataflow-shell-core ---
14-Feb-2019 12:45:03 [INFO]
14-Feb-2019 12:45:03 [INFO] -------------------------------------------------------
14-Feb-2019 12:45:03 [INFO]  T E S T S
14-Feb-2019 12:45:03 [INFO] -------------------------------------------------------
14-Feb-2019 12:45:04 [INFO] Running org.springframework.cloud.dataflow.shell.config.DataFlowShellTests
14-Feb-2019 12:45:04 [INFO] Tests run: 8, Failures: 0, Errors: 0, Skipped: 0, Time elapsed: 0.783 s - in org.springframework.cloud.dataflow.shell.config.DataFlowShellTests
14-Feb-2019 12:45:04 [INFO] Running org.springframework.cloud.dataflow.shell.command.support.RoleTypeTests
14-Feb-2019 12:45:04 [INFO] Tests run: 4, Failures: 0, Errors: 0, Skipped: 0, Time elapsed: 0 s - in org.springframework.cloud.dataflow.shell.command.support.RoleTypeTests
14-Feb-2019 12:45:04 [INFO] Running org.springframework.cloud.dataflow.shell.command.AssertionsTests
14-Feb-2019 12:45:04 [INFO] Tests run: 10, Failures: 0, Errors: 0, Skipped: 0, Time elapsed: 0.001 s - in org.springframework.cloud.dataflow.shell.command.AssertionsTests
14-Feb-2019 12:45:04 [INFO] Running org.springframework.cloud.dataflow.shell.command.StreamCommandTests
14-Feb-2019 12:45:06   ____                              ____ _                __
14-Feb-2019 12:45:06 / ___| _ __  _ __(_)_ __   __ _   / ___| | ___  _   _  __| |
14-Feb-2019 12:45:06 \___ \| '_ \| '__| | '_ \ / _` | | |   | |/ _ \| | | |/ _` |
14-Feb-2019 12:45:06   ___) | |_) | |  | | | | | (_| | | |___| | (_) | |_| | (_| |
14-Feb-2019 12:45:06 |____/| .__/|_|  |_|_| |_|\__, |  \____|_|\___/ \__,_|\__,_|
14-Feb-2019 12:45:06   ____ |_|    _          __|___/                 __________
14-Feb-2019 12:45:06 |  _ \  __ _| |_ __ _  |  ___| | _____      __  \ \ \ \ \ \
14-Feb-2019 12:45:06 | | | |/ _` | __/ _` | | |_  | |/ _ \ \ /\ / /   \ \ \ \ \ \
14-Feb-2019 12:45:06 | |_| | (_| | || (_| | |  _| | | (_) \ V  V /    / / / / / /
14-Feb-2019 12:45:06 |____/ \__,_|\__\__,_| |_|   |_|\___/ \_/\_/    /_/_/_/_/_/
14-Feb-2019 12:45:06
14-Feb-2019 12:45:06 SureFire Booter  (v2.22.0)
14-Feb-2019 12:45:06
14-Feb-2019 12:45:08 2019-02-14T12:45:08+0000 WARN main o.s.b.a.e.EndpointId:135 - Endpoint ID 'hystrix.stream' contains invalid characters, please migrate to a valid format.
14-Feb-2019 12:45:09 2019-02-14T12:45:09+0000 INFO main o.s.b.w.e.t.TomcatWebServer:90 - Tomcat initialized with port(s): 63140 (http)
14-Feb-2019 12:45:10 2019-02-14T12:45:10+0000 WARN main c.n.c.s.URLConfigurationSource:121 - No URLs will be polled as dynamic configuration sources.
14-Feb-2019 12:45:14 2019-02-14T12:45:14+0000 WARN main c.n.c.s.URLConfigurationSource:121 - No URLs will be polled as dynamic configuration sources.
14-Feb-2019 12:45:15 2019-02-14T12:45:15+0000 WARN main o.s.b.a.o.j.JpaBaseConfiguration$JpaWebConfiguration$JpaWebMvcConfiguration:234 - spring.jpa.open-in-view is enabled by default. Therefore, database queries may be performed during view rendering. Explicitly configure spring.jpa.open-in-view to disable this warning
14-Feb-2019 12:45:16 2019-02-14T12:45:16+0000 INFO main o.s.b.a.s.s.UserDetailsServiceAutoConfiguration:86 -
14-Feb-2019 12:45:16
14-Feb-2019 12:45:16 Using generated security password: b414bd07-ba7f-487a-bfb3-baadddaba4f4
14-Feb-2019 12:45:16
14-Feb-2019 12:45:18 2019-02-14T12:45:18+0000 INFO main o.s.b.w.e.t.TomcatWebServer:204 - Tomcat started on port(s): 63140 (http) with context path ''
14-Feb-2019 12:45:18
14-Feb-2019 12:45:18   ____                              ____ _                __
14-Feb-2019 12:45:18 / ___| _ __  _ __(_)_ __   __ _   / ___| | ___  _   _  __| |
14-Feb-2019 12:45:18 \___ \| '_ \| '__| | '_ \ / _` | | |   | |/ _ \| | | |/ _` |
14-Feb-2019 12:45:18   ___) | |_) | |  | | | | | (_| | | |___| | (_) | |_| | (_| |
14-Feb-2019 12:45:18 |____/| .__/|_|  |_|_| |_|\__, |  \____|_|\___/ \__,_|\__,_|
14-Feb-2019 12:45:18   ____ |_|    _          __|___/                 __________
14-Feb-2019 12:45:18 |  _ \  __ _| |_ __ _  |  ___| | _____      __  \ \ \ \ \ \
14-Feb-2019 12:45:18 | | | |/ _` | __/ _` | | |_  | |/ _ \ \ /\ / /   \ \ \ \ \ \
14-Feb-2019 12:45:18 | |_| | (_| | || (_| | |  _| | | (_) \ V  V /    / / / / / /
14-Feb-2019 12:45:18 |____/ \__,_|\__\__,_| |_|   |_|\___/ \_/\_/    /_/_/_/_/_/
14-Feb-2019 12:45:18
14-Feb-2019 12:45:18 Unknown Version
14-Feb-2019 12:45:18
14-Feb-2019 12:45:18
14-Feb-2019 12:45:18 Welcome to the Spring Cloud Data Flow shell. For assistance hit TAB or type "help".
14-Feb-2019 12:45:18
14-Feb-2019 12:45:18 Command 'stream create testValidate-d2be134b-f568-dbc5-a1a6-abc4881c332e --definition "time | log" --deploy false' was found but is not currently available (type 'help' then ENTER to learn about this command)
14-Feb-2019 12:45:18
14-Feb-2019 12:45:18 server-unknown:>
14-Feb-2019 12:45:18 Command 'stream create testStreamLifecycleForTickTock-2175bdab-d919-51d3-2252-6b6c141b3e5a --definition "time | log" --deploy true' was found but is not currently available (type 'help' then ENTER to learn about this command)
14-Feb-2019 12:45:18
14-Feb-2019 12:45:18 server-unknown:>[ERROR] Tests run: 2, Failures: 0, Errors: 2, Skipped: 0, Time elapsed: 13.949 s <<< FAILURE! - in org.springframework.cloud.dataflow.shell.command.StreamCommandTests
14-Feb-2019 12:45:18 [ERROR] testValidate(org.springframework.cloud.dataflow.shell.command.StreamCommandTests)  Time elapsed: 0.666 s  <<< ERROR!
14-Feb-2019 12:45:18 java.lang.IllegalArgumentException: Failure.  CommandResult = CommandResult [success=false, result=null, exception=null]
14-Feb-2019 12:45:18         at org.springframework.cloud.dataflow.shell.command.StreamCommandTests.testValidate(StreamCommandTests.java:92)
14-Feb-2019 12:45:18
14-Feb-2019 12:45:18 [ERROR] testStreamLifecycleForTickTock(org.springframework.cloud.dataflow.shell.command.StreamCommandTests)  Time elapsed: 0.044 s  <<< ERROR!
14-Feb-2019 12:45:18 java.lang.IllegalArgumentException: Failure.  CommandResult = CommandResult [success=false, result=null, exception=null]
14-Feb-2019 12:45:18         at org.springframework.cloud.dataflow.shell.command.StreamCommandTests.testStreamLifecycleForTickTock(StreamCommandTests.java:73)
14-Feb-2019 12:45:18
14-Feb-2019 12:45:18 [INFO] Running org.springframework.cloud.dataflow.shell.command.JobCommandTests
14-Feb-2019 12:45:18
14-Feb-2019 12:45:18 Successfully targeted http://localhost:63140
14-Feb-2019 12:45:19 dataflow:>
14-Feb-2019 12:45:19 ╔═══╤═══════╤════════════╤═══════════╤═════════════════════╤══════════════════╗
14-Feb-2019 12:45:19 ║ID │Task ID│  Job Name  │Start Time │Step Execution Count │Definition Status ║
14-Feb-2019 12:45:19 ╠═══╪═══════╪════════════╪═══════════╪═════════════════════╪══════════════════╣
14-Feb-2019 12:45:19 ║4  │3      │myJob_FOOBAR│           │1                    │Destroyed         ║
14-Feb-2019 12:45:19 ║3  │3      │myJob_FOOBAR│           │1                    │Destroyed         ║
14-Feb-2019 12:45:19 ║2  │2      │myJob_FOO   │           │1                    │Destroyed         ║
14-Feb-2019 12:45:19 ║1  │1      │myJob_ORIG  │           │1                    │Destroyed         ║
14-Feb-2019 12:45:19 ╚═══╧═══════╧════════════╧═══════════╧═════════════════════╧══════════════════╝
14-Feb-2019 12:45:19
14-Feb-2019 12:45:19
14-Feb-2019 12:45:19 dataflow:>
14-Feb-2019 12:45:19 ╔═══╤══════════╤════════════╤════════════════════════════╤═════════╤════════╗
14-Feb-2019 12:45:19 ║ID │Step Name │Job Exec Id │         Start Time         │End Time │ Status ║
14-Feb-2019 12:45:19 ╠═══╪══════════╪════════════╪════════════════════════════╪═════════╪════════╣
14-Feb-2019 12:45:19 ║4  │foobar    │4           │Thu Feb 14 12:45:18 UTC 2019│         │STARTING║
14-Feb-2019 12:45:19 ╚═══╧══════════╧════════════╧════════════════════════════╧═════════╧════════╝
14-Feb-2019 12:45:19
14-Feb-2019 12:45:19
14-Feb-2019 12:45:19 dataflow:>
14-Feb-2019 12:45:19 ╔═══════════════════╤════════════════════════════╗
14-Feb-2019 12:45:19 ║        Key        │           Value            ║
14-Feb-2019 12:45:19 ╠═══════════════════╪════════════════════════════╣
14-Feb-2019 12:45:19 ║Step Execution Id  │4                           ║
14-Feb-2019 12:45:19 ║Job Execution Id   │4                           ║
14-Feb-2019 12:45:19 ║Step Name          │foobar                      ║
14-Feb-2019 12:45:19 ║Start Time         │Thu Feb 14 12:45:18 UTC 2019║
14-Feb-2019 12:45:19 ║End Time           │                            ║
14-Feb-2019 12:45:19 ║Duration           │262.0 ms                    ║
14-Feb-2019 12:45:19 ║Status             │STARTING                    ║
14-Feb-2019 12:45:19 ║Last Updated       │Thu Feb 14 12:45:18 UTC 2019║
14-Feb-2019 12:45:19 ║Read Count         │0                           ║
14-Feb-2019 12:45:19 ║Write Count        │0                           ║
14-Feb-2019 12:45:19 ║Filter Count       │0                           ║
14-Feb-2019 12:45:19 ║Read Skip Count    │0                           ║
14-Feb-2019 12:45:19 ║Write Skip Count   │0                           ║
14-Feb-2019 12:45:19 ║Process Skip Count │0                           ║
14-Feb-2019 12:45:19 ║Read Skip Count    │0                           ║
14-Feb-2019 12:45:19 ║Commit Count       │0                           ║
14-Feb-2019 12:45:19 ║Rollback Count     │0                           ║
14-Feb-2019 12:45:19 ║Exit Status        │EXECUTING                   ║
14-Feb-2019 12:45:19 ║Exit Description   │                            ║
14-Feb-2019 12:45:19 ╚═══════════════════╧════════════════════════════╝
14-Feb-2019 12:45:19
14-Feb-2019 12:45:19
14-Feb-2019 12:45:19 dataflow:>
14-Feb-2019 12:45:19 ╔═══╤═══════╤════════════╤═══════════╤═════════════════════╤══════════════════╗
14-Feb-2019 12:45:19 ║ID │Task ID│  Job Name  │Start Time │Step Execution Count │Definition Status ║
14-Feb-2019 12:45:19 ╠═══╪═══════╪════════════╪═══════════╪═════════════════════╪══════════════════╣
14-Feb-2019 12:45:19 ║4  │3      │myJob_FOOBAR│           │1                    │Destroyed         ║
14-Feb-2019 12:45:19 ║3  │3      │myJob_FOOBAR│           │1                    │Destroyed         ║
14-Feb-2019 12:45:19 ║2  │2      │myJob_FOO   │           │1                    │Destroyed         ║
14-Feb-2019 12:45:19 ║1  │1      │myJob_ORIG  │           │1                    │Destroyed         ║
14-Feb-2019 12:45:19 ╚═══╧═══════╧════════════╧═══════════╧═════════════════════╧══════════════════╝
14-Feb-2019 12:45:19
14-Feb-2019 12:45:19
14-Feb-2019 12:45:19 dataflow:>
14-Feb-2019 12:45:19 ╔═══╤══════════╤════════════╤════════════════════════════╤═════════╤════════╗
14-Feb-2019 12:45:19 ║ID │Step Name │Job Exec Id │         Start Time         │End Time │ Status ║
14-Feb-2019 12:45:19 ╠═══╪══════════╪════════════╪════════════════════════════╪═════════╪════════╣
14-Feb-2019 12:45:19 ║4  │foobar    │4           │Thu Feb 14 12:45:18 UTC 2019│         │STARTING║
14-Feb-2019 12:45:19 ╚═══╧══════════╧════════════╧════════════════════════════╧═════════╧════════╝
14-Feb-2019 12:45:19
14-Feb-2019 12:45:19
14-Feb-2019 12:45:19 dataflow:>
14-Feb-2019 12:45:19 ╔═══╤═══════╤════════════╤═══════════╤═════════════════════╤══════════════════╗
14-Feb-2019 12:45:19 ║ID │Task ID│  Job Name  │Start Time │Step Execution Count │Definition Status ║
14-Feb-2019 12:45:19 ╠═══╪═══════╪════════════╪═══════════╪═════════════════════╪══════════════════╣
14-Feb-2019 12:45:19 ║4  │3      │myJob_FOOBAR│           │1                    │Destroyed         ║
14-Feb-2019 12:45:19 ║3  │3      │myJob_FOOBAR│           │1                    │Destroyed         ║
14-Feb-2019 12:45:19 ║2  │2      │myJob_FOO   │           │1                    │Destroyed         ║
14-Feb-2019 12:45:19 ║1  │1      │myJob_ORIG  │           │1                    │Destroyed         ║
14-Feb-2019 12:45:19 ╚═══╧═══════╧════════════╧═══════════╧═════════════════════╧══════════════════╝
14-Feb-2019 12:45:19
14-Feb-2019 12:45:19
14-Feb-2019 12:45:19 dataflow:>
14-Feb-2019 12:45:19 ╔═════════════════════╤════════════════════════════╗
14-Feb-2019 12:45:19 ║         Key         │           Value            ║
14-Feb-2019 12:45:19 ╠═════════════════════╪════════════════════════════╣
14-Feb-2019 12:45:19 ║Job Execution Id     │4                           ║
14-Feb-2019 12:45:19 ║Task Execution Id    │3                           ║
14-Feb-2019 12:45:19 ║Task Instance Id     │3                           ║
14-Feb-2019 12:45:19 ║Job Name             │myJob_FOOBAR                ║
14-Feb-2019 12:45:19 ║Create Time          │Thu Feb 14 12:45:18 UTC 2019║
14-Feb-2019 12:45:19 ║Start Time           │                            ║
14-Feb-2019 12:45:19 ║End Time             │                            ║
14-Feb-2019 12:45:19 ║Running              │false                       ║
14-Feb-2019 12:45:19 ║Stopping             │false                       ║
14-Feb-2019 12:45:19 ║Step Execution Count │1                           ║
14-Feb-2019 12:45:19 ║Execution Status     │STARTING                    ║
14-Feb-2019 12:45:19 ║Exit Status          │UNKNOWN                     ║
14-Feb-2019 12:45:19 ║Exit Message         │                            ║
14-Feb-2019 12:45:19 ║Definition Status    │Destroyed                   ║
14-Feb-2019 12:45:19 ║Job Parameters       │                            ║
14-Feb-2019 12:45:19 ║-bar(STRING)         │BAR                         ║
14-Feb-2019 12:45:19 ║foo(STRING)          │FOO                         ║
14-Feb-2019 12:45:19 ╚═════════════════════╧════════════════════════════╝
14-Feb-2019 12:45:19
14-Feb-2019 12:45:19
14-Feb-2019 12:45:19 dataflow:>
14-Feb-2019 12:45:19 ╔══════════╤═════════════╤═════════════════════╤════════╤════════════════╗
14-Feb-2019 12:45:19 ║   Name   │Execution ID │Step Execution Count │ Status │ Job Parameters ║
14-Feb-2019 12:45:19 ╠══════════╪═════════════╪═════════════════════╪════════╪════════════════╣
14-Feb-2019 12:45:19 ║myJob_ORIG│1            │1                    │STARTING│-bar=BAR,foo=FOO║
14-Feb-2019 12:45:19 ╚══════════╧═════════════╧═════════════════════╧════════╧════════════════╝
14-Feb-2019 12:45:19
14-Feb-2019 12:45:19
14-Feb-2019 12:45:19 dataflow:>
14-Feb-2019 12:45:19 ╔═══╤═══════╤════════════╤═══════════╤═════════════════════╤══════════════════╗
14-Feb-2019 12:45:19 ║ID │Task ID│  Job Name  │Start Time │Step Execution Count │Definition Status ║
14-Feb-2019 12:45:19 ╠═══╪═══════╪════════════╪═══════════╪═════════════════════╪══════════════════╣
14-Feb-2019 12:45:19 ║4  │3      │myJob_FOOBAR│           │1                    │Destroyed         ║
14-Feb-2019 12:45:19 ║3  │3      │myJob_FOOBAR│           │1                    │Destroyed         ║
14-Feb-2019 12:45:19 ║2  │2      │myJob_FOO   │           │1                    │Destroyed         ║
14-Feb-2019 12:45:19 ║1  │1      │myJob_ORIG  │           │1                    │Destroyed         ║
14-Feb-2019 12:45:19 ╚═══╧═══════╧════════════╧═══════════╧═════════════════════╧══════════════════╝
14-Feb-2019 12:45:19
14-Feb-2019 12:45:19
14-Feb-2019 12:45:19 dataflow:>
14-Feb-2019 12:45:19 ╔═══╤══════════╤════════════╤════════════════════════════╤═════════╤════════╗
14-Feb-2019 12:45:19 ║ID │Step Name │Job Exec Id │         Start Time         │End Time │ Status ║
14-Feb-2019 12:45:19 ╠═══╪══════════╪════════════╪════════════════════════════╪═════════╪════════╣
14-Feb-2019 12:45:19 ║4  │foobar    │4           │Thu Feb 14 12:45:18 UTC 2019│         │STARTING║
14-Feb-2019 12:45:19 ╚═══╧══════════╧════════════╧════════════════════════════╧═════════╧════════╝
14-Feb-2019 12:45:19
14-Feb-2019 12:45:19
14-Feb-2019 12:45:19 dataflow:>
14-Feb-2019 12:45:19 ╔═══╤══════════╤═════════╤═════════╗
14-Feb-2019 12:45:19 ║ID │Step Name │Complete │Duration ║
14-Feb-2019 12:45:19 ╠═══╪══════════╪═════════╪═════════╣
14-Feb-2019 12:45:19 ║4  │foobar    │50.0%    │528.0 ms ║
14-Feb-2019 12:45:19 ╚═══╧══════════╧═════════╧═════════╝
14-Feb-2019 12:45:19
14-Feb-2019 12:45:19
14-Feb-2019 12:45:19 dataflow:>
14-Feb-2019 12:45:19 ╔═══╤═══════╤════════════╤═══════════╤═════════════════════╤══════════════════╗
14-Feb-2019 12:45:19 ║ID │Task ID│  Job Name  │Start Time │Step Execution Count │Definition Status ║
14-Feb-2019 12:45:19 ╠═══╪═══════╪════════════╪═══════════╪═════════════════════╪══════════════════╣
14-Feb-2019 12:45:19 ║4  │3      │myJob_FOOBAR│           │1                    │Destroyed         ║
14-Feb-2019 12:45:19 ║3  │3      │myJob_FOOBAR│           │1                    │Destroyed         ║
14-Feb-2019 12:45:19 ╚═══╧═══════╧════════════╧═══════════╧═════════════════════╧══════════════════╝
14-Feb-2019 12:45:19
14-Feb-2019 12:45:19
14-Feb-2019 12:45:19 dataflow:>[INFO] Tests run: 7, Failures: 0, Errors: 0, Skipped: 0, Time elapsed: 0.672 s - in org.springframework.cloud.dataflow.shell.command.JobCommandTests
14-Feb-2019 12:45:19 [INFO] Running org.springframework.cloud.dataflow.shell.command.TaskCommandTests
14-Feb-2019 12:45:19
14-Feb-2019 12:45:19 Request to clean up resources for task execution 10000 has been submitted
14-Feb-2019 12:45:19
14-Feb-2019 12:45:19 dataflow:>
14-Feb-2019 12:45:19 Created new task 'destroyAllTasks-61ab9f1d-68f8-76c1-c58b-6dace8aa80b5'
14-Feb-2019 12:45:19
14-Feb-2019 12:45:19 dataflow:>
14-Feb-2019 12:45:19 ╔════════════════════════════════════════════════════╤═════════════╤══════════╗
14-Feb-2019 12:45:19 ║                     Task Name                      │    Task     │   Task   ║
14-Feb-2019 12:45:19 ║                                                    │ Definition  │  Status  ║
14-Feb-2019 12:45:19 ╠════════════════════════════════════════════════════╪═════════════╪══════════╣
14-Feb-2019 12:45:19 ║destroyAllTasks-61ab9f1d-68f8-76c1-c58b-6dace8aa80b5│timestamp    │UNKNOWN   ║
14-Feb-2019 12:45:19 ╚════════════════════════════════════════════════════╧═════════════╧══════════╝
14-Feb-2019 12:45:19
14-Feb-2019 12:45:19
14-Feb-2019 12:45:19 dataflow:>
14-Feb-2019 12:45:19 Created new task 'destroyAllTasks-d5c93668-9a79-739e-0744-0bc85f2fff99'
14-Feb-2019 12:45:19
14-Feb-2019 12:45:19 dataflow:>
14-Feb-2019 12:45:19 ╔════════════════════════════════════════════════════╤═════════════╤══════════╗
14-Feb-2019 12:45:19 ║                     Task Name                      │    Task     │   Task   ║
14-Feb-2019 12:45:19 ║                                                    │ Definition  │  Status  ║
14-Feb-2019 12:45:19 ╠════════════════════════════════════════════════════╪═════════════╪══════════╣
14-Feb-2019 12:45:19 ║destroyAllTasks-61ab9f1d-68f8-76c1-c58b-6dace8aa80b5│timestamp    │UNKNOWN   ║
14-Feb-2019 12:45:19 ║destroyAllTasks-d5c93668-9a79-739e-0744-0bc85f2fff99│timestamp    │UNKNOWN   ║
14-Feb-2019 12:45:19 ╚════════════════════════════════════════════════════╧═════════════╧══════════╝
14-Feb-2019 12:45:19
14-Feb-2019 12:45:19
14-Feb-2019 12:45:19 dataflow:>
14-Feb-2019 12:45:19 All tasks destroyed
14-Feb-2019 12:45:19
14-Feb-2019 12:45:19 dataflow:>
14-Feb-2019 12:45:19 ╔═══════════════════════════════════════╤═════╤════════════╤════════════╤═════╗
14-Feb-2019 12:45:19 ║               Task Name               │ ID  │ Start Time │  End Time  │Exit ║
14-Feb-2019 12:45:19 ║                                       │     │            │            │Code ║
14-Feb-2019 12:45:19 ╠═══════════════════════════════════════╪═════╪════════════╪════════════╪═════╣
14-Feb-2019 12:45:19 ║foo6390b48d-585b-443b-aa0d-6012a32699da│10000│Thu Feb 14  │Thu Feb 14  │20   ║
14-Feb-2019 12:45:19 ║                                       │     │12:45:19 UTC│12:45:24 UTC│     ║
14-Feb-2019 12:45:19 ║                                       │     │2019        │2019        │     ║
14-Feb-2019 12:45:19 ║foo6390b48d-585b-443b-aa0d-6012a32699da│9999 │Thu Feb 14  │            │     ║
14-Feb-2019 12:45:19 ║                                       │     │12:45:19 UTC│            │     ║
14-Feb-2019 12:45:19 ║                                       │     │2019        │            │     ║
14-Feb-2019 12:45:19 ╚═══════════════════════════════════════╧═════╧════════════╧════════════╧═════╝
14-Feb-2019 12:45:19
14-Feb-2019 12:45:19
14-Feb-2019 12:45:19 dataflow:>
14-Feb-2019 12:45:19 Created new task 'mytask'
14-Feb-2019 12:45:19
14-Feb-2019 12:45:19 dataflow:>
14-Feb-2019 12:45:19 ╔═════════╤═══════════════╤═══════════╗
14-Feb-2019 12:45:19 ║Task Name│Task Definition│Task Status║
14-Feb-2019 12:45:19 ╠═════════╪═══════════════╪═══════════╣
14-Feb-2019 12:45:19 ║mytask   │timestamp      │UNKNOWN    ║
14-Feb-2019 12:45:19 ╚═════════╧═══════════════╧═══════════╝
14-Feb-2019 12:45:19
14-Feb-2019 12:45:19
14-Feb-2019 12:45:19 dataflow:>
14-Feb-2019 12:45:19 ╔═════════╤══╤══════════╤════════╤═════════╗
14-Feb-2019 12:45:19 ║Task Name│ID│Start Time│End Time│Exit Code║
14-Feb-2019 12:45:19 ╚═════════╧══╧══════════╧════════╧═════════╝
14-Feb-2019 12:45:19
14-Feb-2019 12:45:19
14-Feb-2019 12:45:19 dataflow:>
14-Feb-2019 12:45:19 Created new task 'destroySpecificTask-588d9f8f-9234-1b91-71a3-436a3640d80c'
14-Feb-2019 12:45:19
14-Feb-2019 12:45:19 dataflow:>
14-Feb-2019 12:45:19 ╔════════════════════════════════════════════════════════╤═══════════╤════════╗
14-Feb-2019 12:45:19 ║                       Task Name                        │   Task    │  Task  ║
14-Feb-2019 12:45:19 ║                                                        │Definition │ Status ║
14-Feb-2019 12:45:19 ╠════════════════════════════════════════════════════════╪═══════════╪════════╣
14-Feb-2019 12:45:19 ║mytask                                                  │timestamp  │UNKNOWN ║
14-Feb-2019 12:45:19 ║destroySpecificTask-588d9f8f-9234-1b91-71a3-436a3640d80c│timestamp  │UNKNOWN ║
14-Feb-2019 12:45:19 ╚════════════════════════════════════════════════════════╧═══════════╧════════╝
14-Feb-2019 12:45:19
14-Feb-2019 12:45:19
14-Feb-2019 12:45:19 dataflow:>
14-Feb-2019 12:45:19 Destroyed task 'destroySpecificTask-588d9f8f-9234-1b91-71a3-436a3640d80c'
14-Feb-2019 12:45:19
14-Feb-2019 12:45:19 dataflow:>
14-Feb-2019 12:45:19 ╔═════════════════════════════╤══╗
14-Feb-2019 12:45:19 ║    Current Running Tasks    │1 ║
14-Feb-2019 12:45:19 ╠═════════════════════════════╪══╣
14-Feb-2019 12:45:19 ║Maximum Concurrent Executions│20║
14-Feb-2019 12:45:19 ╚═════════════════════════════╧══╝
14-Feb-2019 12:45:19
14-Feb-2019 12:45:20
14-Feb-2019 12:45:20 dataflow:>
14-Feb-2019 12:45:20 Created new task 'testValidate-6f481656-83e9-2dc8-372f-4922298ff928'
14-Feb-2019 12:45:20
14-Feb-2019 12:45:20 dataflow:>
14-Feb-2019 12:45:20 ╔═════════════════════════════════════════════════╤═══════════════╤═══════════╗
14-Feb-2019 12:45:20 ║                    Task Name                    │Task Definition│Task Status║
14-Feb-2019 12:45:20 ╠═════════════════════════════════════════════════╪═══════════════╪═══════════╣
14-Feb-2019 12:45:20 ║mytask                                           │timestamp      │UNKNOWN    ║
14-Feb-2019 12:45:20 ║testValidate-6f481656-83e9-2dc8-372f-4922298ff928│timestamp      │UNKNOWN    ║
14-Feb-2019 12:45:20 ╚═════════════════════════════════════════════════╧═══════════════╧═══════════╝
14-Feb-2019 12:45:20
14-Feb-2019 12:45:20
14-Feb-2019 12:45:20 dataflow:>
14-Feb-2019 12:45:20 ╔═════════════════════════════════════════════════╤═══════════════╗
14-Feb-2019 12:45:20 ║                    Task Name                    │Task Definition║
14-Feb-2019 12:45:20 ╠═════════════════════════════════════════════════╪═══════════════╣
14-Feb-2019 12:45:20 ║testValidate-6f481656-83e9-2dc8-372f-4922298ff928│timestamp      ║
14-Feb-2019 12:45:20 ╚═════════════════════════════════════════════════╧═══════════════╝
14-Feb-2019 12:45:20
14-Feb-2019 12:45:20
14-Feb-2019 12:45:20 dataflow:>
14-Feb-2019 12:45:20 testValidate-6f481656-83e9-2dc8-372f-4922298ff928 is a valid task.
14-Feb-2019 12:45:20
14-Feb-2019 12:45:20 dataflow:>
14-Feb-2019 12:45:20 ╔══════════════════════════════════════════════════════╤═════════════════╗
14-Feb-2019 12:45:20 ║                       App Name                       │Validation Status║
14-Feb-2019 12:45:20 ╠══════════════════════════════════════════════════════╪═════════════════╣
14-Feb-2019 12:45:20 ║task:testValidate-6f481656-83e9-2dc8-372f-4922298ff928│valid            ║
14-Feb-2019 12:45:20 ╚══════════════════════════════════════════════════════╧═════════════════╝
14-Feb-2019 12:45:20
14-Feb-2019 12:45:20
14-Feb-2019 12:45:20 dataflow:>
14-Feb-2019 12:45:20 ╔═══════════════════════════════════════╤═════╤════════════╤════════════╤═════╗
14-Feb-2019 12:45:20 ║               Task Name               │ ID  │ Start Time │  End Time  │Exit ║
14-Feb-2019 12:45:20 ║                                       │     │            │            │Code ║
14-Feb-2019 12:45:20 ╠═══════════════════════════════════════╪═════╪════════════╪════════════╪═════╣
14-Feb-2019 12:45:20 ║foo6390b48d-585b-443b-aa0d-6012a32699da│10000│Thu Feb 14  │Thu Feb 14  │20   ║
14-Feb-2019 12:45:20 ║                                       │     │12:45:19 UTC│12:45:24 UTC│     ║
14-Feb-2019 12:45:20 ║                                       │     │2019        │2019        │     ║
14-Feb-2019 12:45:20 ║foo6390b48d-585b-443b-aa0d-6012a32699da│9999 │Thu Feb 14  │            │     ║
14-Feb-2019 12:45:20 ║                                       │     │12:45:19 UTC│            │     ║
14-Feb-2019 12:45:20 ║                                       │     │2019        │            │     ║
14-Feb-2019 12:45:20 ╚═══════════════════════════════════════╧═════╧════════════╧════════════╧═════╝
14-Feb-2019 12:45:20
14-Feb-2019 12:45:20
14-Feb-2019 12:45:20 dataflow:>
14-Feb-2019 12:45:20 ╔══════════════════════╤═══════════════════════════════════════╗
14-Feb-2019 12:45:20 ║         Key          │                 Value                 ║
14-Feb-2019 12:45:20 ╠══════════════════════╪═══════════════════════════════════════╣
14-Feb-2019 12:45:20 ║Id                    │10000                                  ║
14-Feb-2019 12:45:20 ║Name                  │foo6390b48d-585b-443b-aa0d-6012a32699da║
14-Feb-2019 12:45:20 ║Arguments             │[]                                     ║
14-Feb-2019 12:45:20 ║Job Execution Ids     │[]                                     ║
14-Feb-2019 12:45:20 ║Start Time            │Thu Feb 14 12:45:19 UTC 2019           ║
14-Feb-2019 12:45:20 ║End Time              │Thu Feb 14 12:45:24 UTC 2019           ║
14-Feb-2019 12:45:20 ║Exit Code             │20                                     ║
14-Feb-2019 12:45:20 ║Exit Message          │exit                                   ║
14-Feb-2019 12:45:20 ║Error Message         │error                                  ║
14-Feb-2019 12:45:20 ║External Execution Id │WOW22                                  ║
14-Feb-2019 12:45:20 ╚══════════════════════╧═══════════════════════════════════════╝
14-Feb-2019 12:45:20
14-Feb-2019 12:45:20
14-Feb-2019 12:45:20 dataflow:>
14-Feb-2019 12:45:20 Created new task 'testCreateTask-77880c25-7e52-b1b0-becf-e93cee52b619'
14-Feb-2019 12:45:20
14-Feb-2019 12:45:20 dataflow:>
14-Feb-2019 12:45:20 ╔═══════════════════════════════════════════════════╤══════════════╤══════════╗
14-Feb-2019 12:45:20 ║                     Task Name                     │     Task     │   Task   ║
14-Feb-2019 12:45:20 ║                                                   │  Definition  │  Status  ║
14-Feb-2019 12:45:20 ╠═══════════════════════════════════════════════════╪══════════════╪══════════╣
14-Feb-2019 12:45:20 ║mytask                                             │timestamp     │UNKNOWN   ║
14-Feb-2019 12:45:20 ║testValidate-6f481656-83e9-2dc8-372f-4922298ff928  │timestamp     │UNKNOWN   ║
14-Feb-2019 12:45:20 ║testCreateTask-77880c25-7e52-b1b0-becf-e93cee52b619│timestamp     │UNKNOWN   ║
14-Feb-2019 12:45:20 ╚═══════════════════════════════════════════════════╧══════════════╧══════════╝
14-Feb-2019 12:45:20
14-Feb-2019 12:45:20
14-Feb-2019 12:45:20 dataflow:>
14-Feb-2019 12:45:20 ╔════════╤════════╤═══════════════════════════════════════════════════════════╗
14-Feb-2019 12:45:20 ║Platform│Platform│                        Description                        ║
14-Feb-2019 12:45:20 ║  Name  │  Type  │                                                           ║
14-Feb-2019 12:45:20 ╠════════╪════════╪═══════════════════════════════════════════════════════════╣
14-Feb-2019 12:45:20 ║default │local   │ShutdownTimeout = [30], EnvVarsToInherit =                 ║
14-Feb-2019 12:45:20 ║        │        │[TMP,LANG,LANGUAGE,LC_.*,PATH,SPRING_APPLICATION_JSON],    ║
14-Feb-2019 12:45:20 ║        │        │JavaCmd = [/opt/jdk1.8.0_144/jre/bin/java],                ║
14-Feb-2019 12:45:20 ║        │        │WorkingDirectoriesRoot = [/tmp], DeleteFilesOnExit = [true]║
14-Feb-2019 12:45:20 ╚════════╧════════╧═══════════════════════════════════════════════════════════╝
14-Feb-2019 12:45:20
14-Feb-2019 12:45:20
14-Feb-2019 12:45:20 dataflow:>[INFO] Tests run: 10, Failures: 0, Errors: 0, Skipped: 0, Time elapsed: 1.345 s - in org.springframework.cloud.dataflow.shell.command.TaskCommandTests
14-Feb-2019 12:45:20 [INFO] Running org.springframework.cloud.dataflow.shell.command.ConfigCommandTests
14-Feb-2019 12:45:21 Successfully targeted http://localhost:9393/
14-Feb-2019 12:45:21 [INFO] Tests run: 3, Failures: 0, Errors: 0, Skipped: 0, Time elapsed: 0.268 s - in org.springframework.cloud.dataflow.shell.command.ConfigCommandTests
14-Feb-2019 12:45:21 [INFO] Running org.springframework.cloud.dataflow.shell.command.RuntimeCommandsTests
14-Feb-2019 12:45:21 [INFO] Tests run: 3, Failures: 0, Errors: 0, Skipped: 0, Time elapsed: 0.012 s - in org.springframework.cloud.dataflow.shell.command.RuntimeCommandsTests
14-Feb-2019 12:45:21 [INFO] Running org.springframework.cloud.dataflow.shell.ShellCommandsTests
14-Feb-2019 12:45:21 Successfully targeted http://localhost:63140
14-Feb-2019 12:45:21 2019-02-14T12:45:21+0000 WARN pool-1-thread-1 o.s.c.n.a.ArchaiusAutoConfiguration:194 - Netflix ConfigurationManager has already been installed, unable to re-install
14-Feb-2019 12:45:22
14-Feb-2019 12:45:22 Destroyed all streams
14-Feb-2019 12:45:22
14-Feb-2019 12:45:22 dataflow:>
14-Feb-2019 12:45:22 Successfully registered application 'task:timestamp'
14-Feb-2019 12:45:22
14-Feb-2019 12:45:22 dataflow:>
14-Feb-2019 12:45:22 Successfully unregistered application 'timestamp' with type 'task'.
14-Feb-2019 12:45:22
14-Feb-2019 12:45:22 dataflow:>
14-Feb-2019 12:45:22 Successfully registered application 'sink:log'
14-Feb-2019 12:45:22
14-Feb-2019 12:45:22 dataflow:>
14-Feb-2019 12:45:22 Successfully unregistered application 'log' with type 'sink'.
14-Feb-2019 12:45:22
14-Feb-2019 12:45:22 dataflow:>Successfully targeted http://localhost:63140
14-Feb-2019 12:45:22 2019-02-14T12:45:22+0000 WARN pool-2-thread-1 c.n.c.s.URLConfigurationSource:121 - No URLs will be polled as dynamic configuration sources.
14-Feb-2019 12:45:23
14-Feb-2019 12:45:23 Successfully registered application 'task:timestamp'
14-Feb-2019 12:45:23
14-Feb-2019 12:45:23 dataflow:>Successfully targeted http://localhost:63140
14-Feb-2019 12:45:23 2019-02-14T12:45:23+0000 WARN pool-3-thread-1 c.n.c.s.URLConfigurationSource:121 - No URLs will be polled as dynamic configuration sources.
14-Feb-2019 12:45:23
14-Feb-2019 12:45:23 Successfully registered application 'sink:log'
14-Feb-2019 12:45:23
14-Feb-2019 12:45:23 dataflow:>[INFO] Tests run: 3, Failures: 0, Errors: 0, Skipped: 0, Time elapsed: 2.776 s - in org.springframework.cloud.dataflow.shell.ShellCommandsTests
14-Feb-2019 12:45:54 [INFO]
14-Feb-2019 12:45:54 [INFO] Results:
14-Feb-2019 12:45:54 [INFO]
14-Feb-2019 12:45:54 [ERROR] Errors:
14-Feb-2019 12:45:54 [ERROR]   StreamCommandTests.testStreamLifecycleForTickTock:73 » IllegalArgument Failure...
14-Feb-2019 12:45:54 [ERROR]   StreamCommandTests.testValidate:92 » IllegalArgument Failure.  CommandResult =...
14-Feb-2019 12:45:54 [INFO]
14-Feb-2019 12:45:54 [ERROR] Tests run: 50, Failures: 0, Errors: 2, Skipped: 0
14-Feb-2019 12:45:54 [INFO]
14-Feb-2019 12:45:54 [INFO] ------------------------------------------------------------------------
14-Feb-2019 12:45:54 [INFO] Reactor Summary:
14-Feb-2019 12:45:54 [INFO]
14-Feb-2019 12:45:54 [INFO] spring-cloud-dataflow-parent ....................... SUCCESS [  1.717 s]
14-Feb-2019 12:45:54 [INFO] spring-cloud-dataflow-configuration-metadata ....... SUCCESS [  4.821 s]
14-Feb-2019 12:45:54 [INFO] spring-cloud-dataflow-core ......................... SUCCESS [  6.330 s]
14-Feb-2019 12:45:54 [INFO] spring-cloud-dataflow-rest-resource ................ SUCCESS [  7.089 s]
14-Feb-2019 12:45:54 [INFO] spring-cloud-dataflow-audit ........................ SUCCESS [  4.595 s]
14-Feb-2019 12:45:54 [INFO] spring-cloud-dataflow-registry ..................... SUCCESS [  5.108 s]
14-Feb-2019 12:45:54 [INFO] spring-cloud-dataflow-completion ................... SUCCESS [  7.496 s]
14-Feb-2019 12:45:54 [INFO] spring-cloud-dataflow-server-core .................. SUCCESS [02:44 min]
14-Feb-2019 12:45:54 [INFO] spring-cloud-dataflow-platform-kubernetes .......... SUCCESS [  8.055 s]
14-Feb-2019 12:45:54 [INFO] spring-cloud-dataflow-platform-cloudfoundry ........ SUCCESS [  8.210 s]
14-Feb-2019 12:45:54 [INFO] spring-cloud-dataflow-autoconfigure ................ SUCCESS [ 45.013 s]
14-Feb-2019 12:45:54 [INFO] spring-cloud-starter-dataflow-server ............... SUCCESS [ 49.793 s]
14-Feb-2019 12:45:54 [INFO] Spring Cloud Data Flow Server ...................... SUCCESS [  7.106 s]
14-Feb-2019 12:45:54 [INFO] spring-cloud-dataflow-rest-client .................. SUCCESS [  9.138 s]
14-Feb-2019 12:45:54 [INFO] spring-cloud-dataflow-shell-core ................... FAILURE [ 51.753 s]
14-Feb-2019 12:45:54 [INFO] spring-cloud-dataflow-shell ........................ SKIPPED
14-Feb-2019 12:45:54 [INFO] Spring Cloud Data Flow Docs for Classic mode ....... SKIPPED
14-Feb-2019 12:45:54 [INFO] Spring Cloud Data Flow Docs ........................ SKIPPED
14-Feb-2019 12:45:54 [INFO] spring-cloud-dataflow-dependencies ................. SKIPPED
14-Feb-2019 12:45:54 [INFO] ------------------------------------------------------------------------
14-Feb-2019 12:45:54 [INFO] BUILD FAILURE
14-Feb-2019 12:45:54 [INFO] ------------------------------------------------------------------------
14-Feb-2019 12:45:54 [INFO] Total time: 06:28 min
14-Feb-2019 12:45:54 [INFO] Finished at: 2019-02-14T12:45:54Z
14-Feb-2019 12:45:54 [INFO] Final Memory: 155M/790M
14-Feb-2019 12:45:54 [INFO] ------------------------------------------------------------------------
14-Feb-2019 12:45:54 [ERROR] Failed to execute goal org.apache.maven.plugins:maven-surefire-plugin:2.22.0:test (default-test) on project spring-cloud-dataflow-shell-core: There are test failures.
14-Feb-2019 12:45:54 [ERROR]
14-Feb-2019 12:45:54 [ERROR] Please refer to /opt/bamboo-home/xml-data/build-dir/SCD-BMASTER-JOB1/spring-cloud-dataflow-shell-core/target/surefire-reports for the individual test results.
14-Feb-2019 12:45:54 [ERROR] Please refer to dump files (if any exist) [date]-jvmRun[N].dump, [date].dumpstream and [date]-jvmRun[N].dumpstream.
14-Feb-2019 12:45:54 [ERROR] -> [Help 1]
14-Feb-2019 12:45:54 [ERROR]
14-Feb-2019 12:45:54 [ERROR] To see the full stack trace of the errors, re-run Maven with the -e switch.
14-Feb-2019 12:45:54 [ERROR] Re-run Maven using the -X switch to enable full debug logging.
14-Feb-2019 12:45:54 [ERROR]
14-Feb-2019 12:45:54 [ERROR] For more information about the errors and possible solutions, please read the following articles:
14-Feb-2019 12:45:54 [ERROR] [Help 1] http://cwiki.apache.org/confluence/display/MAVEN/MojoFailureException
14-Feb-2019 12:45:54 [ERROR]
14-Feb-2019 12:45:54 [ERROR] After correcting the problems, you can resume the build with the command
14-Feb-2019 12:45:54 [ERROR]   mvn <goals> -rf :spring-cloud-dataflow-shell-core
14-Feb-2019 12:45:54
14-Feb-2019 12:45:54 Failing task since return code of [/opt/jdk-8/bin/java -cp /opt/maven-3.5/boot/plexus-classworlds-2.5.2.jar -Dclassworlds.conf=/tmp/artifactoryM22950646847519114218conf -DbuildInfoConfig.propertiesFile=/tmp/buildInfo7891850316973786012.properties -Xmx2048m -XX:MaxPermSize=1024m -Dmaven.home=/opt/maven-3.5 -Dmaven.multiModuleProjectDirectory=/opt/bamboo-home/xml-data/build-dir/SCD-BMASTER-JOB1 org.codehaus.plexus.classworlds.launcher.Launcher -s .settings.xml clean install -Pfull --batch-mode -U -Dartifactory.publish.password=********] was 1 while expected 0
14-Feb-2019 12:45:54 Parsing test results under /opt/bamboo-home/xml-data/build-dir/SCD-BMASTER-JOB1...
14-Feb-2019 12:45:55 Finished task 'Build and publish Spring Cloud Data' with result: Failed
14-Feb-2019 12:45:55 Running post build plugin 'Docker Container Cleanup'
14-Feb-2019 12:45:55 Running post build plugin 'NCover Results Collector'
14-Feb-2019 12:45:55 Running post build plugin 'Artifactory Release Management Staging'
14-Feb-2019 12:45:55 Running post build plugin 'Artifactory Build Info Copier'
14-Feb-2019 12:45:55 Running post build plugin 'Artifactory Gradle Properties Info Copier'
14-Feb-2019 12:45:55 Running post build plugin 'Clover Results Collector'
14-Feb-2019 12:45:55 Running post build plugin 'npm Cache Cleanup'
14-Feb-2019 12:45:55 Running post build plugin 'Artifact Copier'
14-Feb-2019 12:45:55 Publishing an artifact: Test Results
14-Feb-2019 12:45:55 Finished publishing of artifact Shared artifact: [Test Results], pattern: [**/target/surefire-reports/**/*.*] in 270.9 ms
14-Feb-2019 12:45:55 Successfully removed working directory at '/opt/bamboo-home/xml-data/build-dir/SCD-BMASTER-JOB1'
14-Feb-2019 12:45:55 Finalising the build...
14-Feb-2019 12:45:55 Stopping timer.
14-Feb-2019 12:45:55 Build SCD-BMASTER-JOB1-2610 completed.
14-Feb-2019 12:45:55 Running on server: post build plugin 'NCover Results Collector'
14-Feb-2019 12:45:55 Running on server: post build plugin 'Build Hanging Detection Configuration'
14-Feb-2019 12:45:55 Running on server: post build plugin 'Clover Delta Calculator'
14-Feb-2019 12:45:55 Running on server: post build plugin 'Maven Dependencies Postprocessor'
14-Feb-2019 12:45:55 All post build plugins have finished
14-Feb-2019 12:45:55 Generating build results summary...
14-Feb-2019 12:45:56 Saving build results to disk...
14-Feb-2019 12:45:56 Logging substituted variables...
14-Feb-2019 12:45:56 Indexing build results...
14-Feb-2019 12:45:56 Finished building SCD-BMASTER-JOB1-2610.