Build Spring Cloud Data Flow

Build: #3048 failed

Job: Build and install SCDF failed

Stages & jobs

  1. Default Stage

Build log

The build generated 1,161 lines of output.The output is too long and has been truncated to the last 1,000 lines. Download or view full build log

12-Jul-2019 09:04:32 [INFO] --- maven-compiler-plugin:3.8.0:testCompile (default-testCompile) @ spring-cloud-dataflow-configuration-metadata ---
12-Jul-2019 09:04:32 [INFO] Changes detected - recompiling the module!
12-Jul-2019 09:04:32 [INFO] Compiling 1 source file to /opt/bamboo-home/xml-data/build-dir/SCD-BMASTER-JOB1/spring-cloud-dataflow-configuration-metadata/target/test-classes
12-Jul-2019 09:04:32 [INFO]
12-Jul-2019 09:04:32 [INFO] --- maven-surefire-plugin:2.22.0:test (default-test) @ spring-cloud-dataflow-configuration-metadata ---
12-Jul-2019 09:04:32 [INFO]
12-Jul-2019 09:04:32 [INFO] -------------------------------------------------------
12-Jul-2019 09:04:32 [INFO]  T E S T S
12-Jul-2019 09:04:32 [INFO] -------------------------------------------------------
12-Jul-2019 09:04:33 [INFO] Running org.springframework.cloud.dataflow.configuration.metadata.BootApplicationConfigurationMetadataResolverTests
12-Jul-2019 09:04:33 [INFO] Tests run: 6, Failures: 0, Errors: 0, Skipped: 0, Time elapsed: 0.268 s - in org.springframework.cloud.dataflow.configuration.metadata.BootApplicationConfigurationMetadataResolverTests
12-Jul-2019 09:04:33 [INFO]
12-Jul-2019 09:04:33 [INFO] Results:
12-Jul-2019 09:04:33 [INFO]
12-Jul-2019 09:04:33 [INFO] Tests run: 6, Failures: 0, Errors: 0, Skipped: 0
12-Jul-2019 09:04:33 [INFO]
12-Jul-2019 09:04:33 [INFO]
12-Jul-2019 09:04:33 [INFO] --- jacoco-maven-plugin:0.7.9:report (report) @ spring-cloud-dataflow-configuration-metadata ---
12-Jul-2019 09:04:33 [INFO] Loading execution data file /opt/bamboo-home/xml-data/build-dir/SCD-BMASTER-JOB1/spring-cloud-dataflow-configuration-metadata/target/jacoco.exec
12-Jul-2019 09:04:33 [INFO] Analyzed bundle 'spring-cloud-dataflow-configuration-metadata' with 7 classes
12-Jul-2019 09:04:33 [INFO]
12-Jul-2019 09:04:33 [INFO] --- maven-jar-plugin:3.0.2:jar (default-jar) @ spring-cloud-dataflow-configuration-metadata ---
12-Jul-2019 09:04:33 [INFO] Building jar: /opt/bamboo-home/xml-data/build-dir/SCD-BMASTER-JOB1/spring-cloud-dataflow-configuration-metadata/target/spring-cloud-dataflow-configuration-metadata-2.2.0.BUILD-SNAPSHOT.jar
12-Jul-2019 09:04:33 [INFO]
12-Jul-2019 09:04:33 [INFO] --- maven-javadoc-plugin:3.0.1:jar (attach-javadocs) @ spring-cloud-dataflow-configuration-metadata ---
12-Jul-2019 09:04:34 [INFO] Building jar: /opt/bamboo-home/xml-data/build-dir/SCD-BMASTER-JOB1/spring-cloud-dataflow-configuration-metadata/target/spring-cloud-dataflow-configuration-metadata-2.2.0.BUILD-SNAPSHOT-javadoc.jar
12-Jul-2019 09:04:34 [INFO]
12-Jul-2019 09:04:34 [INFO] --- maven-javadoc-plugin:3.0.1:jar (javadoc) @ spring-cloud-dataflow-configuration-metadata ---
12-Jul-2019 09:04:35 [INFO] Building jar: /opt/bamboo-home/xml-data/build-dir/SCD-BMASTER-JOB1/spring-cloud-dataflow-configuration-metadata/target/spring-cloud-dataflow-configuration-metadata-2.2.0.BUILD-SNAPSHOT-javadoc.jar
12-Jul-2019 09:04:35 [INFO]
12-Jul-2019 09:04:35 [INFO] >>> maven-source-plugin:3.0.1:jar (attach-sources) > generate-sources @ spring-cloud-dataflow-configuration-metadata >>>
12-Jul-2019 09:04:35 [INFO]
12-Jul-2019 09:04:35 [INFO] --- maven-checkstyle-plugin:3.0.0:check (checkstyle-validation) @ spring-cloud-dataflow-configuration-metadata ---
12-Jul-2019 09:04:35 [INFO] Starting audit...
12-Jul-2019 09:04:35 Audit done.
12-Jul-2019 09:04:35 [INFO]
12-Jul-2019 09:04:35 [INFO] --- jacoco-maven-plugin:0.7.9:prepare-agent (agent) @ spring-cloud-dataflow-configuration-metadata ---
12-Jul-2019 09:04:35 [INFO] argLine set to -javaagent:/home/bamboo/.m2/repository/org/jacoco/org.jacoco.agent/0.7.9/org.jacoco.agent-0.7.9-runtime.jar=destfile=/opt/bamboo-home/xml-data/build-dir/SCD-BMASTER-JOB1/spring-cloud-dataflow-configuration-metadata/target/jacoco.exec
12-Jul-2019 09:04:35 [INFO]
12-Jul-2019 09:04:35 [INFO] <<< maven-source-plugin:3.0.1:jar (attach-sources) < generate-sources @ spring-cloud-dataflow-configuration-metadata <<<
12-Jul-2019 09:04:35 [INFO]
12-Jul-2019 09:04:35 [INFO]
12-Jul-2019 09:04:35 [INFO] --- maven-source-plugin:3.0.1:jar (attach-sources) @ spring-cloud-dataflow-configuration-metadata ---
12-Jul-2019 09:04:35 [INFO] Building jar: /opt/bamboo-home/xml-data/build-dir/SCD-BMASTER-JOB1/spring-cloud-dataflow-configuration-metadata/target/spring-cloud-dataflow-configuration-metadata-2.2.0.BUILD-SNAPSHOT-sources.jar
12-Jul-2019 09:04:35 [INFO]
12-Jul-2019 09:04:35 [INFO] --- maven-install-plugin:2.4:install (default-install) @ spring-cloud-dataflow-configuration-metadata ---
12-Jul-2019 09:04:35 [INFO] Installing /opt/bamboo-home/xml-data/build-dir/SCD-BMASTER-JOB1/spring-cloud-dataflow-configuration-metadata/target/spring-cloud-dataflow-configuration-metadata-2.2.0.BUILD-SNAPSHOT.jar to /home/bamboo/.m2/repository/org/springframework/cloud/spring-cloud-dataflow-configuration-metadata/2.2.0.BUILD-SNAPSHOT/spring-cloud-dataflow-configuration-metadata-2.2.0.BUILD-SNAPSHOT.jar
12-Jul-2019 09:04:35 [INFO] Installing /opt/bamboo-home/xml-data/build-dir/SCD-BMASTER-JOB1/spring-cloud-dataflow-configuration-metadata/pom.xml to /home/bamboo/.m2/repository/org/springframework/cloud/spring-cloud-dataflow-configuration-metadata/2.2.0.BUILD-SNAPSHOT/spring-cloud-dataflow-configuration-metadata-2.2.0.BUILD-SNAPSHOT.pom
12-Jul-2019 09:04:35 [INFO] Installing /opt/bamboo-home/xml-data/build-dir/SCD-BMASTER-JOB1/spring-cloud-dataflow-configuration-metadata/target/spring-cloud-dataflow-configuration-metadata-2.2.0.BUILD-SNAPSHOT-javadoc.jar to /home/bamboo/.m2/repository/org/springframework/cloud/spring-cloud-dataflow-configuration-metadata/2.2.0.BUILD-SNAPSHOT/spring-cloud-dataflow-configuration-metadata-2.2.0.BUILD-SNAPSHOT-javadoc.jar
12-Jul-2019 09:04:35 [INFO] Installing /opt/bamboo-home/xml-data/build-dir/SCD-BMASTER-JOB1/spring-cloud-dataflow-configuration-metadata/target/spring-cloud-dataflow-configuration-metadata-2.2.0.BUILD-SNAPSHOT-javadoc.jar to /home/bamboo/.m2/repository/org/springframework/cloud/spring-cloud-dataflow-configuration-metadata/2.2.0.BUILD-SNAPSHOT/spring-cloud-dataflow-configuration-metadata-2.2.0.BUILD-SNAPSHOT-javadoc.jar
12-Jul-2019 09:04:35 [INFO] Installing /opt/bamboo-home/xml-data/build-dir/SCD-BMASTER-JOB1/spring-cloud-dataflow-configuration-metadata/target/spring-cloud-dataflow-configuration-metadata-2.2.0.BUILD-SNAPSHOT-sources.jar to /home/bamboo/.m2/repository/org/springframework/cloud/spring-cloud-dataflow-configuration-metadata/2.2.0.BUILD-SNAPSHOT/spring-cloud-dataflow-configuration-metadata-2.2.0.BUILD-SNAPSHOT-sources.jar
12-Jul-2019 09:04:35 [INFO]
12-Jul-2019 09:04:35 [INFO] ------< org.springframework.cloud:spring-cloud-dataflow-core-dsl >------
12-Jul-2019 09:04:35 [INFO] Building spring-cloud-dataflow-core-dsl 2.2.0.BUILD-SNAPSHOT      [3/20]
12-Jul-2019 09:04:35 [INFO] --------------------------------[ jar ]---------------------------------
12-Jul-2019 09:04:35 [INFO]
12-Jul-2019 09:04:35 [INFO] --- maven-clean-plugin:2.5:clean (default-clean) @ spring-cloud-dataflow-core-dsl ---
12-Jul-2019 09:04:35 [INFO]
12-Jul-2019 09:04:35 [INFO] --- maven-checkstyle-plugin:3.0.0:check (checkstyle-validation) @ spring-cloud-dataflow-core-dsl ---
12-Jul-2019 09:04:36 [INFO] Starting audit...
12-Jul-2019 09:04:36 Audit done.
12-Jul-2019 09:04:36 [INFO]
12-Jul-2019 09:04:36 [INFO] --- jacoco-maven-plugin:0.7.9:prepare-agent (agent) @ spring-cloud-dataflow-core-dsl ---
12-Jul-2019 09:04:36 [INFO] argLine set to -javaagent:/home/bamboo/.m2/repository/org/jacoco/org.jacoco.agent/0.7.9/org.jacoco.agent-0.7.9-runtime.jar=destfile=/opt/bamboo-home/xml-data/build-dir/SCD-BMASTER-JOB1/spring-cloud-dataflow-core-dsl/target/jacoco.exec
12-Jul-2019 09:04:36 [INFO]
12-Jul-2019 09:04:36 [INFO] --- maven-resources-plugin:3.1.0:resources (default-resources) @ spring-cloud-dataflow-core-dsl ---
12-Jul-2019 09:04:36 [INFO] Using 'UTF-8' encoding to copy filtered resources.
12-Jul-2019 09:04:36 [INFO] skip non existing resourceDirectory /opt/bamboo-home/xml-data/build-dir/SCD-BMASTER-JOB1/spring-cloud-dataflow-core-dsl/src/main/resources
12-Jul-2019 09:04:36 [INFO] skip non existing resourceDirectory /opt/bamboo-home/xml-data/build-dir/SCD-BMASTER-JOB1/spring-cloud-dataflow-core-dsl/src/main/resources
12-Jul-2019 09:04:36 [INFO]
12-Jul-2019 09:04:36 [INFO] --- maven-compiler-plugin:3.8.0:compile (default-compile) @ spring-cloud-dataflow-core-dsl ---
12-Jul-2019 09:04:36 [INFO] Changes detected - recompiling the module!
12-Jul-2019 09:04:36 [INFO] Compiling 36 source files to /opt/bamboo-home/xml-data/build-dir/SCD-BMASTER-JOB1/spring-cloud-dataflow-core-dsl/target/classes
12-Jul-2019 09:04:36 [INFO]
12-Jul-2019 09:04:36 [INFO] --- maven-resources-plugin:3.1.0:testResources (default-testResources) @ spring-cloud-dataflow-core-dsl ---
12-Jul-2019 09:04:36 [INFO] Using 'UTF-8' encoding to copy filtered resources.
12-Jul-2019 09:04:36 [INFO] skip non existing resourceDirectory /opt/bamboo-home/xml-data/build-dir/SCD-BMASTER-JOB1/spring-cloud-dataflow-core-dsl/src/test/resources
12-Jul-2019 09:04:36 [INFO]
12-Jul-2019 09:04:36 [INFO] --- maven-compiler-plugin:3.8.0:testCompile (default-testCompile) @ spring-cloud-dataflow-core-dsl ---
12-Jul-2019 09:04:36 [INFO] Changes detected - recompiling the module!
12-Jul-2019 09:04:36 [INFO] Compiling 3 source files to /opt/bamboo-home/xml-data/build-dir/SCD-BMASTER-JOB1/spring-cloud-dataflow-core-dsl/target/test-classes
12-Jul-2019 09:04:36 [INFO]
12-Jul-2019 09:04:36 [INFO] --- maven-surefire-plugin:2.22.0:test (default-test) @ spring-cloud-dataflow-core-dsl ---
12-Jul-2019 09:04:36 [INFO]
12-Jul-2019 09:04:36 [INFO] -------------------------------------------------------
12-Jul-2019 09:04:36 [INFO]  T E S T S
12-Jul-2019 09:04:36 [INFO] -------------------------------------------------------
12-Jul-2019 09:04:37 [INFO] Running org.springframework.cloud.dataflow.core.dsl.StreamParserTests
12-Jul-2019 09:04:37 [INFO] Tests run: 54, Failures: 0, Errors: 0, Skipped: 0, Time elapsed: 0.105 s - in org.springframework.cloud.dataflow.core.dsl.StreamParserTests
12-Jul-2019 09:04:37 [INFO] Running org.springframework.cloud.dataflow.core.dsl.NodeTests
12-Jul-2019 09:04:37 (foo.bar.bazz --foo=bar --abc='xyz')
12-Jul-2019 09:04:37 [INFO] Tests run: 3, Failures: 0, Errors: 0, Skipped: 0, Time elapsed: 0.001 s - in org.springframework.cloud.dataflow.core.dsl.NodeTests
12-Jul-2019 09:04:37 [INFO] Running org.springframework.cloud.dataflow.core.dsl.TaskParserTests
12-Jul-2019 09:04:37 org.springframework.cloud.dataflow.core.dsl.TaskValidationException: Problems found when validating '<1: jdbchdfs-local && spark-client && timestamp || spark-cluster && spark-cluster && timestamp || spark-yarn>': [166E:(pos 68): duplicate app name. Use a label to ensure uniqueness, 166E:(pos 85): duplicate app name. Use a label to ensure uniqueness]
12-Jul-2019 09:04:37 [WARNING] Tests run: 99, Failures: 0, Errors: 0, Skipped: 1, Time elapsed: 0.058 s - in org.springframework.cloud.dataflow.core.dsl.TaskParserTests
12-Jul-2019 09:04:37 [INFO]
12-Jul-2019 09:04:37 [INFO] Results:
12-Jul-2019 09:04:37 [INFO]
12-Jul-2019 09:04:37 [WARNING] Tests run: 156, Failures: 0, Errors: 0, Skipped: 1
12-Jul-2019 09:04:37 [INFO]
12-Jul-2019 09:04:37 [INFO]
12-Jul-2019 09:04:37 [INFO] --- jacoco-maven-plugin:0.7.9:report (report) @ spring-cloud-dataflow-core-dsl ---
12-Jul-2019 09:04:37 [INFO] Loading execution data file /opt/bamboo-home/xml-data/build-dir/SCD-BMASTER-JOB1/spring-cloud-dataflow-core-dsl/target/jacoco.exec
12-Jul-2019 09:04:37 [INFO] Analyzed bundle 'spring-cloud-dataflow-core-dsl' with 42 classes
12-Jul-2019 09:04:37 [INFO]
12-Jul-2019 09:04:37 [INFO] --- maven-jar-plugin:3.0.2:jar (default-jar) @ spring-cloud-dataflow-core-dsl ---
12-Jul-2019 09:04:37 [INFO] Building jar: /opt/bamboo-home/xml-data/build-dir/SCD-BMASTER-JOB1/spring-cloud-dataflow-core-dsl/target/spring-cloud-dataflow-core-dsl-2.2.0.BUILD-SNAPSHOT.jar
12-Jul-2019 09:04:37 [INFO]
12-Jul-2019 09:04:37 [INFO] --- maven-javadoc-plugin:3.0.1:jar (attach-javadocs) @ spring-cloud-dataflow-core-dsl ---
12-Jul-2019 09:04:39 [INFO] Building jar: /opt/bamboo-home/xml-data/build-dir/SCD-BMASTER-JOB1/spring-cloud-dataflow-core-dsl/target/spring-cloud-dataflow-core-dsl-2.2.0.BUILD-SNAPSHOT-javadoc.jar
12-Jul-2019 09:04:39 [INFO]
12-Jul-2019 09:04:39 [INFO] --- maven-javadoc-plugin:3.0.1:jar (javadoc) @ spring-cloud-dataflow-core-dsl ---
12-Jul-2019 09:04:40 [INFO] Building jar: /opt/bamboo-home/xml-data/build-dir/SCD-BMASTER-JOB1/spring-cloud-dataflow-core-dsl/target/spring-cloud-dataflow-core-dsl-2.2.0.BUILD-SNAPSHOT-javadoc.jar
12-Jul-2019 09:04:40 [INFO]
12-Jul-2019 09:04:40 [INFO] >>> maven-source-plugin:3.0.1:jar (attach-sources) > generate-sources @ spring-cloud-dataflow-core-dsl >>>
12-Jul-2019 09:04:40 [INFO]
12-Jul-2019 09:04:40 [INFO] --- maven-checkstyle-plugin:3.0.0:check (checkstyle-validation) @ spring-cloud-dataflow-core-dsl ---
12-Jul-2019 09:04:40 [INFO] Starting audit...
12-Jul-2019 09:04:40 Audit done.
12-Jul-2019 09:04:40 [INFO]
12-Jul-2019 09:04:40 [INFO] --- jacoco-maven-plugin:0.7.9:prepare-agent (agent) @ spring-cloud-dataflow-core-dsl ---
12-Jul-2019 09:04:40 [INFO] argLine set to -javaagent:/home/bamboo/.m2/repository/org/jacoco/org.jacoco.agent/0.7.9/org.jacoco.agent-0.7.9-runtime.jar=destfile=/opt/bamboo-home/xml-data/build-dir/SCD-BMASTER-JOB1/spring-cloud-dataflow-core-dsl/target/jacoco.exec
12-Jul-2019 09:04:40 [INFO]
12-Jul-2019 09:04:40 [INFO] <<< maven-source-plugin:3.0.1:jar (attach-sources) < generate-sources @ spring-cloud-dataflow-core-dsl <<<
12-Jul-2019 09:04:40 [INFO]
12-Jul-2019 09:04:40 [INFO]
12-Jul-2019 09:04:40 [INFO] --- maven-source-plugin:3.0.1:jar (attach-sources) @ spring-cloud-dataflow-core-dsl ---
12-Jul-2019 09:04:40 [INFO] Building jar: /opt/bamboo-home/xml-data/build-dir/SCD-BMASTER-JOB1/spring-cloud-dataflow-core-dsl/target/spring-cloud-dataflow-core-dsl-2.2.0.BUILD-SNAPSHOT-sources.jar
12-Jul-2019 09:04:40 [INFO]
12-Jul-2019 09:04:40 [INFO] --- maven-install-plugin:2.4:install (default-install) @ spring-cloud-dataflow-core-dsl ---
12-Jul-2019 09:04:40 [INFO] Installing /opt/bamboo-home/xml-data/build-dir/SCD-BMASTER-JOB1/spring-cloud-dataflow-core-dsl/target/spring-cloud-dataflow-core-dsl-2.2.0.BUILD-SNAPSHOT.jar to /home/bamboo/.m2/repository/org/springframework/cloud/spring-cloud-dataflow-core-dsl/2.2.0.BUILD-SNAPSHOT/spring-cloud-dataflow-core-dsl-2.2.0.BUILD-SNAPSHOT.jar
12-Jul-2019 09:04:40 [INFO] Installing /opt/bamboo-home/xml-data/build-dir/SCD-BMASTER-JOB1/spring-cloud-dataflow-core-dsl/pom.xml to /home/bamboo/.m2/repository/org/springframework/cloud/spring-cloud-dataflow-core-dsl/2.2.0.BUILD-SNAPSHOT/spring-cloud-dataflow-core-dsl-2.2.0.BUILD-SNAPSHOT.pom
12-Jul-2019 09:04:40 [INFO] Installing /opt/bamboo-home/xml-data/build-dir/SCD-BMASTER-JOB1/spring-cloud-dataflow-core-dsl/target/spring-cloud-dataflow-core-dsl-2.2.0.BUILD-SNAPSHOT-javadoc.jar to /home/bamboo/.m2/repository/org/springframework/cloud/spring-cloud-dataflow-core-dsl/2.2.0.BUILD-SNAPSHOT/spring-cloud-dataflow-core-dsl-2.2.0.BUILD-SNAPSHOT-javadoc.jar
12-Jul-2019 09:04:40 [INFO] Installing /opt/bamboo-home/xml-data/build-dir/SCD-BMASTER-JOB1/spring-cloud-dataflow-core-dsl/target/spring-cloud-dataflow-core-dsl-2.2.0.BUILD-SNAPSHOT-javadoc.jar to /home/bamboo/.m2/repository/org/springframework/cloud/spring-cloud-dataflow-core-dsl/2.2.0.BUILD-SNAPSHOT/spring-cloud-dataflow-core-dsl-2.2.0.BUILD-SNAPSHOT-javadoc.jar
12-Jul-2019 09:04:40 [INFO] Installing /opt/bamboo-home/xml-data/build-dir/SCD-BMASTER-JOB1/spring-cloud-dataflow-core-dsl/target/spring-cloud-dataflow-core-dsl-2.2.0.BUILD-SNAPSHOT-sources.jar to /home/bamboo/.m2/repository/org/springframework/cloud/spring-cloud-dataflow-core-dsl/2.2.0.BUILD-SNAPSHOT/spring-cloud-dataflow-core-dsl-2.2.0.BUILD-SNAPSHOT-sources.jar
12-Jul-2019 09:04:40 [INFO]
12-Jul-2019 09:04:40 [INFO] --------< org.springframework.cloud:spring-cloud-dataflow-core >--------
12-Jul-2019 09:04:40 [INFO] Building spring-cloud-dataflow-core 2.2.0.BUILD-SNAPSHOT          [4/20]
12-Jul-2019 09:04:40 [INFO] --------------------------------[ jar ]---------------------------------
12-Jul-2019 09:04:40 [INFO]
12-Jul-2019 09:04:40 [INFO] --- maven-clean-plugin:2.5:clean (default-clean) @ spring-cloud-dataflow-core ---
12-Jul-2019 09:04:40 [INFO]
12-Jul-2019 09:04:40 [INFO] --- maven-checkstyle-plugin:3.0.0:check (checkstyle-validation) @ spring-cloud-dataflow-core ---
12-Jul-2019 09:04:40 [INFO] Starting audit...
12-Jul-2019 09:04:40 Audit done.
12-Jul-2019 09:04:40 [INFO]
12-Jul-2019 09:04:40 [INFO] --- jacoco-maven-plugin:0.7.9:prepare-agent (agent) @ spring-cloud-dataflow-core ---
12-Jul-2019 09:04:40 [INFO] argLine set to -javaagent:/home/bamboo/.m2/repository/org/jacoco/org.jacoco.agent/0.7.9/org.jacoco.agent-0.7.9-runtime.jar=destfile=/opt/bamboo-home/xml-data/build-dir/SCD-BMASTER-JOB1/spring-cloud-dataflow-core/target/jacoco.exec
12-Jul-2019 09:04:40 [INFO]
12-Jul-2019 09:04:40 [INFO] --- maven-resources-plugin:3.1.0:resources (default-resources) @ spring-cloud-dataflow-core ---
12-Jul-2019 09:04:40 [INFO] Using 'UTF-8' encoding to copy filtered resources.
12-Jul-2019 09:04:40 [INFO] skip non existing resourceDirectory /opt/bamboo-home/xml-data/build-dir/SCD-BMASTER-JOB1/spring-cloud-dataflow-core/src/main/resources
12-Jul-2019 09:04:40 [INFO] skip non existing resourceDirectory /opt/bamboo-home/xml-data/build-dir/SCD-BMASTER-JOB1/spring-cloud-dataflow-core/src/main/resources
12-Jul-2019 09:04:40 [INFO]
12-Jul-2019 09:04:40 [INFO] --- maven-compiler-plugin:3.8.0:compile (default-compile) @ spring-cloud-dataflow-core ---
12-Jul-2019 09:04:40 [INFO] Changes detected - recompiling the module!
12-Jul-2019 09:04:40 [INFO] Compiling 31 source files to /opt/bamboo-home/xml-data/build-dir/SCD-BMASTER-JOB1/spring-cloud-dataflow-core/target/classes
12-Jul-2019 09:04:40 [INFO]
12-Jul-2019 09:04:40 [INFO] --- maven-resources-plugin:3.1.0:testResources (default-testResources) @ spring-cloud-dataflow-core ---
12-Jul-2019 09:04:40 [INFO] Using 'UTF-8' encoding to copy filtered resources.
12-Jul-2019 09:04:40 [INFO] skip non existing resourceDirectory /opt/bamboo-home/xml-data/build-dir/SCD-BMASTER-JOB1/spring-cloud-dataflow-core/src/test/resources
12-Jul-2019 09:04:40 [INFO]
12-Jul-2019 09:04:40 [INFO] --- maven-compiler-plugin:3.8.0:testCompile (default-testCompile) @ spring-cloud-dataflow-core ---
12-Jul-2019 09:04:40 [INFO] Changes detected - recompiling the module!
12-Jul-2019 09:04:40 [INFO] Compiling 6 source files to /opt/bamboo-home/xml-data/build-dir/SCD-BMASTER-JOB1/spring-cloud-dataflow-core/target/test-classes
12-Jul-2019 09:04:40 [INFO]
12-Jul-2019 09:04:40 [INFO] --- maven-surefire-plugin:2.22.0:test (default-test) @ spring-cloud-dataflow-core ---
12-Jul-2019 09:04:40 [INFO]
12-Jul-2019 09:04:40 [INFO] -------------------------------------------------------
12-Jul-2019 09:04:40 [INFO]  T E S T S
12-Jul-2019 09:04:40 [INFO] -------------------------------------------------------
12-Jul-2019 09:04:41 [INFO] Running org.springframework.cloud.dataflow.core.StreamDefinitionTests
12-Jul-2019 09:04:41 [INFO] Tests run: 14, Failures: 0, Errors: 0, Skipped: 0, Time elapsed: 0.102 s - in org.springframework.cloud.dataflow.core.StreamDefinitionTests
12-Jul-2019 09:04:41 [INFO] Running org.springframework.cloud.dataflow.core.TaskDefinitionToDslConverterTests
12-Jul-2019 09:04:41 foo --spring.cloud.task.name=boza
12-Jul-2019 09:04:41 [INFO] Tests run: 5, Failures: 0, Errors: 0, Skipped: 0, Time elapsed: 0.034 s - in org.springframework.cloud.dataflow.core.TaskDefinitionToDslConverterTests
12-Jul-2019 09:04:41 [INFO] Running org.springframework.cloud.dataflow.core.TaskDefinitionTests
12-Jul-2019 09:04:41 [INFO] Tests run: 8, Failures: 0, Errors: 0, Skipped: 0, Time elapsed: 0.004 s - in org.springframework.cloud.dataflow.core.TaskDefinitionTests
12-Jul-2019 09:04:41 [INFO] Running org.springframework.cloud.dataflow.core.StreamApplicationDefinitionTests
12-Jul-2019 09:04:41 [INFO] Tests run: 1, Failures: 0, Errors: 0, Skipped: 0, Time elapsed: 0 s - in org.springframework.cloud.dataflow.core.StreamApplicationDefinitionTests
12-Jul-2019 09:04:41 [INFO] Running org.springframework.cloud.dataflow.core.AppRegistrationTests
12-Jul-2019 09:04:41 [INFO] Tests run: 2, Failures: 0, Errors: 0, Skipped: 0, Time elapsed: 0.118 s - in org.springframework.cloud.dataflow.core.AppRegistrationTests
12-Jul-2019 09:04:41 [INFO] Running org.springframework.cloud.dataflow.core.StreamDefinitionToDslConverterTests
12-Jul-2019 09:04:41 foo --spring.cloud.stream.bindings.input.destination=boza  | bar
12-Jul-2019 09:04:41 foo --spring.cloud.dataflow.stream.app.type=boza  | bar
12-Jul-2019 09:04:41 foo --spring.cloud.dataflow.stream.app.label=boza  | bar
12-Jul-2019 09:04:41 foo --spring.cloud.dataflow.stream.name=boza  | bar
12-Jul-2019 09:04:41 foo --spring.metrics.export.triggers.application.includes=boza  | bar
12-Jul-2019 09:04:41 foo --spring.cloud.stream.metrics.key=boza  | bar
12-Jul-2019 09:04:41 foo --spring.cloud.stream.metrics.properties=boza  | bar
12-Jul-2019 09:04:41 foo --spring.cloud.stream.bindings.input.group=boza  | bar
12-Jul-2019 09:04:41 foo --spring.cloud.stream.bindings.output.producer.requiredGroups=boza  | bar
12-Jul-2019 09:04:41 foo --spring.cloud.stream.bindings.output.destination=boza  | bar
12-Jul-2019 09:04:41 [WARNING] Tests run: 21, Failures: 0, Errors: 0, Skipped: 3, Time elapsed: 0.018 s - in org.springframework.cloud.dataflow.core.StreamDefinitionToDslConverterTests
12-Jul-2019 09:04:41 [INFO]
12-Jul-2019 09:04:41 [INFO] Results:
12-Jul-2019 09:04:41 [INFO]
12-Jul-2019 09:04:41 [WARNING] Tests run: 51, Failures: 0, Errors: 0, Skipped: 3
12-Jul-2019 09:04:41 [INFO]
12-Jul-2019 09:04:41 [INFO]
12-Jul-2019 09:04:41 [INFO] --- jacoco-maven-plugin:0.7.9:report (report) @ spring-cloud-dataflow-core ---
12-Jul-2019 09:04:41 [INFO] Loading execution data file /opt/bamboo-home/xml-data/build-dir/SCD-BMASTER-JOB1/spring-cloud-dataflow-core/target/jacoco.exec
12-Jul-2019 09:04:41 [INFO] Analyzed bundle 'spring-cloud-dataflow-core' with 32 classes
12-Jul-2019 09:04:41 [INFO]
12-Jul-2019 09:04:41 [INFO] --- maven-jar-plugin:3.0.2:jar (default-jar) @ spring-cloud-dataflow-core ---
12-Jul-2019 09:04:41 [INFO] Building jar: /opt/bamboo-home/xml-data/build-dir/SCD-BMASTER-JOB1/spring-cloud-dataflow-core/target/spring-cloud-dataflow-core-2.2.0.BUILD-SNAPSHOT.jar
12-Jul-2019 09:04:41 [INFO]
12-Jul-2019 09:04:41 [INFO] --- maven-javadoc-plugin:3.0.1:jar (attach-javadocs) @ spring-cloud-dataflow-core ---
12-Jul-2019 09:04:43 [INFO] Building jar: /opt/bamboo-home/xml-data/build-dir/SCD-BMASTER-JOB1/spring-cloud-dataflow-core/target/spring-cloud-dataflow-core-2.2.0.BUILD-SNAPSHOT-javadoc.jar
12-Jul-2019 09:04:43 [INFO]
12-Jul-2019 09:04:43 [INFO] --- maven-javadoc-plugin:3.0.1:jar (javadoc) @ spring-cloud-dataflow-core ---
12-Jul-2019 09:04:44 [INFO] Building jar: /opt/bamboo-home/xml-data/build-dir/SCD-BMASTER-JOB1/spring-cloud-dataflow-core/target/spring-cloud-dataflow-core-2.2.0.BUILD-SNAPSHOT-javadoc.jar
12-Jul-2019 09:04:44 [INFO]
12-Jul-2019 09:04:44 [INFO] >>> maven-source-plugin:3.0.1:jar (attach-sources) > generate-sources @ spring-cloud-dataflow-core >>>
12-Jul-2019 09:04:44 [INFO]
12-Jul-2019 09:04:44 [INFO] --- maven-checkstyle-plugin:3.0.0:check (checkstyle-validation) @ spring-cloud-dataflow-core ---
12-Jul-2019 09:04:44 [INFO] Starting audit...
12-Jul-2019 09:04:44 Audit done.
12-Jul-2019 09:04:44 [INFO]
12-Jul-2019 09:04:44 [INFO] --- jacoco-maven-plugin:0.7.9:prepare-agent (agent) @ spring-cloud-dataflow-core ---
12-Jul-2019 09:04:44 [INFO] argLine set to -javaagent:/home/bamboo/.m2/repository/org/jacoco/org.jacoco.agent/0.7.9/org.jacoco.agent-0.7.9-runtime.jar=destfile=/opt/bamboo-home/xml-data/build-dir/SCD-BMASTER-JOB1/spring-cloud-dataflow-core/target/jacoco.exec
12-Jul-2019 09:04:44 [INFO]
12-Jul-2019 09:04:44 [INFO] <<< maven-source-plugin:3.0.1:jar (attach-sources) < generate-sources @ spring-cloud-dataflow-core <<<
12-Jul-2019 09:04:44 [INFO]
12-Jul-2019 09:04:44 [INFO]
12-Jul-2019 09:04:44 [INFO] --- maven-source-plugin:3.0.1:jar (attach-sources) @ spring-cloud-dataflow-core ---
12-Jul-2019 09:04:44 [INFO] Building jar: /opt/bamboo-home/xml-data/build-dir/SCD-BMASTER-JOB1/spring-cloud-dataflow-core/target/spring-cloud-dataflow-core-2.2.0.BUILD-SNAPSHOT-sources.jar
12-Jul-2019 09:04:44 [INFO]
12-Jul-2019 09:04:44 [INFO] --- maven-install-plugin:2.4:install (default-install) @ spring-cloud-dataflow-core ---
12-Jul-2019 09:04:44 [INFO] Installing /opt/bamboo-home/xml-data/build-dir/SCD-BMASTER-JOB1/spring-cloud-dataflow-core/target/spring-cloud-dataflow-core-2.2.0.BUILD-SNAPSHOT.jar to /home/bamboo/.m2/repository/org/springframework/cloud/spring-cloud-dataflow-core/2.2.0.BUILD-SNAPSHOT/spring-cloud-dataflow-core-2.2.0.BUILD-SNAPSHOT.jar
12-Jul-2019 09:04:44 [INFO] Installing /opt/bamboo-home/xml-data/build-dir/SCD-BMASTER-JOB1/spring-cloud-dataflow-core/pom.xml to /home/bamboo/.m2/repository/org/springframework/cloud/spring-cloud-dataflow-core/2.2.0.BUILD-SNAPSHOT/spring-cloud-dataflow-core-2.2.0.BUILD-SNAPSHOT.pom
12-Jul-2019 09:04:44 [INFO] Installing /opt/bamboo-home/xml-data/build-dir/SCD-BMASTER-JOB1/spring-cloud-dataflow-core/target/spring-cloud-dataflow-core-2.2.0.BUILD-SNAPSHOT-javadoc.jar to /home/bamboo/.m2/repository/org/springframework/cloud/spring-cloud-dataflow-core/2.2.0.BUILD-SNAPSHOT/spring-cloud-dataflow-core-2.2.0.BUILD-SNAPSHOT-javadoc.jar
12-Jul-2019 09:04:44 [INFO] Installing /opt/bamboo-home/xml-data/build-dir/SCD-BMASTER-JOB1/spring-cloud-dataflow-core/target/spring-cloud-dataflow-core-2.2.0.BUILD-SNAPSHOT-javadoc.jar to /home/bamboo/.m2/repository/org/springframework/cloud/spring-cloud-dataflow-core/2.2.0.BUILD-SNAPSHOT/spring-cloud-dataflow-core-2.2.0.BUILD-SNAPSHOT-javadoc.jar
12-Jul-2019 09:04:44 [INFO] Installing /opt/bamboo-home/xml-data/build-dir/SCD-BMASTER-JOB1/spring-cloud-dataflow-core/target/spring-cloud-dataflow-core-2.2.0.BUILD-SNAPSHOT-sources.jar to /home/bamboo/.m2/repository/org/springframework/cloud/spring-cloud-dataflow-core/2.2.0.BUILD-SNAPSHOT/spring-cloud-dataflow-core-2.2.0.BUILD-SNAPSHOT-sources.jar
12-Jul-2019 09:04:44 [INFO]
12-Jul-2019 09:04:44 [INFO] ---< org.springframework.cloud:spring-cloud-dataflow-rest-resource >----
12-Jul-2019 09:04:44 [INFO] Building spring-cloud-dataflow-rest-resource 2.2.0.BUILD-SNAPSHOT [5/20]
12-Jul-2019 09:04:44 [INFO] --------------------------------[ jar ]---------------------------------
12-Jul-2019 09:04:44 [INFO] Downloading from spring-snapshots: https://repo.spring.io/libs-snapshot-local/org/springframework/cloud/spring-cloud-skipper/2.1.0.BUILD-SNAPSHOT/maven-metadata.xml
12-Jul-2019 09:04:44 [INFO] Downloaded from spring-snapshots: https://repo.spring.io/libs-snapshot-local/org/springframework/cloud/spring-cloud-skipper/2.1.0.BUILD-SNAPSHOT/maven-metadata.xml (1.3 kB at 8.0 kB/s)
12-Jul-2019 09:04:44 [INFO] Downloading from spring-snapshots: https://repo.spring.io/libs-snapshot-local/org/springframework/cloud/spring-cloud-skipper/2.1.0.BUILD-SNAPSHOT/spring-cloud-skipper-2.1.0.BUILD-20190712.085227-30.pom
12-Jul-2019 09:04:44 [INFO] Downloaded from spring-snapshots: https://repo.spring.io/libs-snapshot-local/org/springframework/cloud/spring-cloud-skipper/2.1.0.BUILD-SNAPSHOT/spring-cloud-skipper-2.1.0.BUILD-20190712.085227-30.pom (2.4 kB at 15 kB/s)
12-Jul-2019 09:04:44 [INFO] Downloading from spring-snapshots: https://repo.spring.io/libs-snapshot-local/org/springframework/cloud/spring-cloud-skipper-parent/2.1.0.BUILD-SNAPSHOT/maven-metadata.xml
12-Jul-2019 09:04:45 [INFO] Downloaded from spring-snapshots: https://repo.spring.io/libs-snapshot-local/org/springframework/cloud/spring-cloud-skipper-parent/2.1.0.BUILD-SNAPSHOT/maven-metadata.xml (643 B at 4.2 kB/s)
12-Jul-2019 09:04:45 [INFO] Downloading from spring-snapshots: https://repo.spring.io/libs-snapshot-local/org/springframework/cloud/spring-cloud-skipper-parent/2.1.0.BUILD-SNAPSHOT/spring-cloud-skipper-parent-2.1.0.BUILD-20190712.085227-30.pom
12-Jul-2019 09:04:45 [INFO] Downloaded from spring-snapshots: https://repo.spring.io/libs-snapshot-local/org/springframework/cloud/spring-cloud-skipper-parent/2.1.0.BUILD-SNAPSHOT/spring-cloud-skipper-parent-2.1.0.BUILD-20190712.085227-30.pom (16 kB at 88 kB/s)
12-Jul-2019 09:04:45 [INFO] Downloading from spring-snapshots: https://repo.spring.io/libs-snapshot-local/org/springframework/cloud/spring-cloud-skipper/2.1.0.BUILD-SNAPSHOT/spring-cloud-skipper-2.1.0.BUILD-20190712.085227-30.jar
12-Jul-2019 09:04:45 [INFO] Downloaded from spring-snapshots: https://repo.spring.io/libs-snapshot-local/org/springframework/cloud/spring-cloud-skipper/2.1.0.BUILD-SNAPSHOT/spring-cloud-skipper-2.1.0.BUILD-20190712.085227-30.jar (106 kB at 362 kB/s)
12-Jul-2019 09:04:45 [INFO]
12-Jul-2019 09:04:45 [INFO] --- maven-clean-plugin:2.5:clean (default-clean) @ spring-cloud-dataflow-rest-resource ---
12-Jul-2019 09:04:45 [INFO]
12-Jul-2019 09:04:45 [INFO] --- maven-checkstyle-plugin:3.0.0:check (checkstyle-validation) @ spring-cloud-dataflow-rest-resource ---
12-Jul-2019 09:04:45 [INFO] Starting audit...
12-Jul-2019 09:04:45 Audit done.
12-Jul-2019 09:04:45 [INFO]
12-Jul-2019 09:04:45 [INFO] --- jacoco-maven-plugin:0.7.9:prepare-agent (agent) @ spring-cloud-dataflow-rest-resource ---
12-Jul-2019 09:04:45 [INFO] argLine set to -javaagent:/home/bamboo/.m2/repository/org/jacoco/org.jacoco.agent/0.7.9/org.jacoco.agent-0.7.9-runtime.jar=destfile=/opt/bamboo-home/xml-data/build-dir/SCD-BMASTER-JOB1/spring-cloud-dataflow-rest-resource/target/jacoco.exec
12-Jul-2019 09:04:45 [INFO]
12-Jul-2019 09:04:45 [INFO] --- maven-resources-plugin:3.1.0:resources (default-resources) @ spring-cloud-dataflow-rest-resource ---
12-Jul-2019 09:04:45 [INFO] Using 'UTF-8' encoding to copy filtered resources.
12-Jul-2019 09:04:45 [INFO] skip non existing resourceDirectory /opt/bamboo-home/xml-data/build-dir/SCD-BMASTER-JOB1/spring-cloud-dataflow-rest-resource/src/main/resources
12-Jul-2019 09:04:45 [INFO] skip non existing resourceDirectory /opt/bamboo-home/xml-data/build-dir/SCD-BMASTER-JOB1/spring-cloud-dataflow-rest-resource/src/main/resources
12-Jul-2019 09:04:45 [INFO]
12-Jul-2019 09:04:45 [INFO] --- maven-compiler-plugin:3.8.0:compile (default-compile) @ spring-cloud-dataflow-rest-resource ---
12-Jul-2019 09:04:45 [INFO] Changes detected - recompiling the module!
12-Jul-2019 09:04:45 [INFO] Compiling 66 source files to /opt/bamboo-home/xml-data/build-dir/SCD-BMASTER-JOB1/spring-cloud-dataflow-rest-resource/target/classes
12-Jul-2019 09:04:46 [INFO]
12-Jul-2019 09:04:46 [INFO] --- maven-resources-plugin:3.1.0:testResources (default-testResources) @ spring-cloud-dataflow-rest-resource ---
12-Jul-2019 09:04:46 [INFO] Using 'UTF-8' encoding to copy filtered resources.
12-Jul-2019 09:04:46 [INFO] skip non existing resourceDirectory /opt/bamboo-home/xml-data/build-dir/SCD-BMASTER-JOB1/spring-cloud-dataflow-rest-resource/src/test/resources
12-Jul-2019 09:04:46 [INFO]
12-Jul-2019 09:04:46 [INFO] --- maven-compiler-plugin:3.8.0:testCompile (default-testCompile) @ spring-cloud-dataflow-rest-resource ---
12-Jul-2019 09:04:46 [INFO] Changes detected - recompiling the module!
12-Jul-2019 09:04:46 [INFO] Compiling 7 source files to /opt/bamboo-home/xml-data/build-dir/SCD-BMASTER-JOB1/spring-cloud-dataflow-rest-resource/target/test-classes
12-Jul-2019 09:04:46 [INFO]
12-Jul-2019 09:04:46 [INFO] --- maven-surefire-plugin:2.22.0:test (default-test) @ spring-cloud-dataflow-rest-resource ---
12-Jul-2019 09:04:46 [INFO]
12-Jul-2019 09:04:46 [INFO] -------------------------------------------------------
12-Jul-2019 09:04:46 [INFO]  T E S T S
12-Jul-2019 09:04:46 [INFO] -------------------------------------------------------
12-Jul-2019 09:04:46 [INFO] Running org.springframework.cloud.dataflow.rest.support.jackson.StepExecutionJacksonMixInTests
12-Jul-2019 09:04:47 [INFO] Tests run: 2, Failures: 0, Errors: 0, Skipped: 0, Time elapsed: 0.532 s - in org.springframework.cloud.dataflow.rest.support.jackson.StepExecutionJacksonMixInTests
12-Jul-2019 09:04:47 [INFO] Running org.springframework.cloud.dataflow.rest.job.support.JobUtilsTests
12-Jul-2019 09:04:47 [INFO] Tests run: 15, Failures: 0, Errors: 0, Skipped: 0, Time elapsed: 0.006 s - in org.springframework.cloud.dataflow.rest.job.support.JobUtilsTests
12-Jul-2019 09:04:47 [INFO] Running org.springframework.cloud.dataflow.rest.job.support.DeploymentPropertiesUtilsTests
12-Jul-2019 09:04:47 09:04:47.273 [main] DEBUG org.springframework.beans.factory.config.YamlPropertiesFactoryBean - Loading from YAML: file [/tmp/3282770893034278660.yaml]
12-Jul-2019 09:04:47 09:04:47.309 [main] DEBUG org.springframework.beans.factory.config.YamlPropertiesFactoryBean - Merging document (no matchers set): {foo1={bar1=spam}}
12-Jul-2019 09:04:47 09:04:47.310 [main] DEBUG org.springframework.beans.factory.config.YamlPropertiesFactoryBean - Loaded 1 document from YAML resource: file [/tmp/3282770893034278660.yaml]
12-Jul-2019 09:04:47 [INFO] Tests run: 6, Failures: 0, Errors: 0, Skipped: 0, Time elapsed: 0.179 s - in org.springframework.cloud.dataflow.rest.job.support.DeploymentPropertiesUtilsTests
12-Jul-2019 09:04:47 [INFO] Running org.springframework.cloud.dataflow.rest.util.HttpClientConfigurerTests
12-Jul-2019 09:04:47 [INFO] Tests run: 6, Failures: 0, Errors: 0, Skipped: 0, Time elapsed: 0.249 s - in org.springframework.cloud.dataflow.rest.util.HttpClientConfigurerTests
12-Jul-2019 09:04:47 [INFO] Running org.springframework.cloud.dataflow.rest.resource.HttpClientTest
12-Jul-2019 09:04:47 09:04:47.602 [main] DEBUG org.apache.http.client.protocol.RequestAddCookies - CookieSpec selected: default
12-Jul-2019 09:04:47 09:04:47.617 [main] DEBUG org.apache.http.client.protocol.RequestAuthCache - Auth cache not set in the context
12-Jul-2019 09:04:47 09:04:47.654 [Finalizer] DEBUG org.apache.http.impl.conn.PoolingHttpClientConnectionManager - Connection manager is shutting down
12-Jul-2019 09:04:47 09:04:47.654 [Finalizer] DEBUG org.apache.http.impl.conn.PoolingHttpClientConnectionManager - Connection manager shut down
12-Jul-2019 09:04:47 09:04:47.654 [Finalizer] DEBUG org.apache.http.impl.conn.PoolingHttpClientConnectionManager - Connection manager is shutting down
12-Jul-2019 09:04:47 09:04:47.654 [Finalizer] DEBUG org.apache.http.impl.conn.PoolingHttpClientConnectionManager - Connection manager shut down
12-Jul-2019 09:04:47 09:04:47.707 [main] DEBUG org.apache.http.impl.conn.PoolingHttpClientConnectionManager - Connection manager is shutting down
12-Jul-2019 09:04:47 09:04:47.707 [main] DEBUG org.apache.http.impl.conn.PoolingHttpClientConnectionManager - Connection manager shut down
12-Jul-2019 09:04:47 09:04:47.711 [main] DEBUG org.apache.http.client.protocol.RequestAddCookies - CookieSpec selected: default
12-Jul-2019 09:04:47 09:04:47.711 [main] DEBUG org.apache.http.client.protocol.RequestAuthCache - Auth cache not set in the context
12-Jul-2019 09:04:47 09:04:47.712 [main] INFO org.apache.http.impl.execchain.RetryExec - I/O exception (org.springframework.cloud.dataflow.rest.resource.HttpClientTest$TestException) caught when processing request to {}->http://test.com:80: It broke
12-Jul-2019 09:04:47 09:04:47.715 [main] DEBUG org.apache.http.impl.execchain.RetryExec - It broke
12-Jul-2019 09:04:47 org.springframework.cloud.dataflow.rest.resource.HttpClientTest$TestException: It broke
12-Jul-2019 09:04:47         at org.springframework.cloud.dataflow.rest.resource.HttpClientTest.resourceBasedAuthorizationHeaderResourceCheck(HttpClientTest.java:88)
12-Jul-2019 09:04:47         at sun.reflect.NativeMethodAccessorImpl.invoke0(Native Method)
12-Jul-2019 09:04:47         at sun.reflect.NativeMethodAccessorImpl.invoke(NativeMethodAccessorImpl.java:62)
12-Jul-2019 09:04:47         at sun.reflect.DelegatingMethodAccessorImpl.invoke(DelegatingMethodAccessorImpl.java:43)
12-Jul-2019 09:04:47         at java.lang.reflect.Method.invoke(Method.java:498)
12-Jul-2019 09:04:47         at org.junit.runners.model.FrameworkMethod$1.runReflectiveCall(FrameworkMethod.java:50)
12-Jul-2019 09:04:47         at org.junit.internal.runners.model.ReflectiveCallable.run(ReflectiveCallable.java:12)
12-Jul-2019 09:04:47         at org.junit.runners.model.FrameworkMethod.invokeExplosively(FrameworkMethod.java:47)
12-Jul-2019 09:04:47         at org.junit.internal.runners.statements.InvokeMethod.evaluate(InvokeMethod.java:17)
12-Jul-2019 09:04:47         at org.junit.internal.runners.statements.ExpectException.evaluate(ExpectException.java:19)
12-Jul-2019 09:04:47         at org.junit.runners.ParentRunner.runLeaf(ParentRunner.java:325)
12-Jul-2019 09:04:47         at org.junit.runners.BlockJUnit4ClassRunner.runChild(BlockJUnit4ClassRunner.java:78)
12-Jul-2019 09:04:47         at org.junit.runners.BlockJUnit4ClassRunner.runChild(BlockJUnit4ClassRunner.java:57)
12-Jul-2019 09:04:47         at org.junit.runners.ParentRunner$3.run(ParentRunner.java:290)
12-Jul-2019 09:04:47         at org.junit.runners.ParentRunner$1.schedule(ParentRunner.java:71)
12-Jul-2019 09:04:47         at org.junit.runners.ParentRunner.runChildren(ParentRunner.java:288)
12-Jul-2019 09:04:47         at org.junit.runners.ParentRunner.access$000(ParentRunner.java:58)
12-Jul-2019 09:04:47         at org.junit.runners.ParentRunner$2.evaluate(ParentRunner.java:268)
12-Jul-2019 09:04:47         at org.junit.runners.ParentRunner.run(ParentRunner.java:363)
12-Jul-2019 09:04:47         at org.apache.maven.surefire.junit4.JUnit4Provider.execute(JUnit4Provider.java:365)
12-Jul-2019 09:04:47         at org.apache.maven.surefire.junit4.JUnit4Provider.executeWithRerun(JUnit4Provider.java:273)
12-Jul-2019 09:04:47         at org.apache.maven.surefire.junit4.JUnit4Provider.executeTestSet(JUnit4Provider.java:238)
12-Jul-2019 09:04:47         at org.apache.maven.surefire.junit4.JUnit4Provider.invoke(JUnit4Provider.java:159)
12-Jul-2019 09:04:47         at org.apache.maven.surefire.booter.ForkedBooter.invokeProviderInSameClassLoader(ForkedBooter.java:383)
12-Jul-2019 09:04:47         at org.apache.maven.surefire.booter.ForkedBooter.runSuitesInProcess(ForkedBooter.java:344)
12-Jul-2019 09:04:47         at org.apache.maven.surefire.booter.ForkedBooter.execute(ForkedBooter.java:125)
12-Jul-2019 09:04:47         at org.apache.maven.surefire.booter.ForkedBooter.main(ForkedBooter.java:417)
12-Jul-2019 09:04:47 09:04:47.718 [main] INFO org.apache.http.impl.execchain.RetryExec - Retrying request to {}->http://test.com:80
12-Jul-2019 09:04:47 09:04:47.718 [main] DEBUG org.apache.http.client.protocol.RequestAddCookies - CookieSpec selected: default
12-Jul-2019 09:04:47 09:04:47.719 [main] DEBUG org.apache.http.client.protocol.RequestAuthCache - Auth cache not set in the context
12-Jul-2019 09:04:47 09:04:47.719 [main] INFO org.apache.http.impl.execchain.RetryExec - I/O exception (org.springframework.cloud.dataflow.rest.resource.HttpClientTest$TestException) caught when processing request to {}->http://test.com:80: It broke
12-Jul-2019 09:04:47 09:04:47.719 [main] DEBUG org.apache.http.impl.execchain.RetryExec - It broke
12-Jul-2019 09:04:47 org.springframework.cloud.dataflow.rest.resource.HttpClientTest$TestException: It broke
12-Jul-2019 09:04:47         at org.springframework.cloud.dataflow.rest.resource.HttpClientTest.resourceBasedAuthorizationHeaderResourceCheck(HttpClientTest.java:88)
12-Jul-2019 09:04:47         at sun.reflect.NativeMethodAccessorImpl.invoke0(Native Method)
12-Jul-2019 09:04:47         at sun.reflect.NativeMethodAccessorImpl.invoke(NativeMethodAccessorImpl.java:62)
12-Jul-2019 09:04:47         at sun.reflect.DelegatingMethodAccessorImpl.invoke(DelegatingMethodAccessorImpl.java:43)
12-Jul-2019 09:04:47         at java.lang.reflect.Method.invoke(Method.java:498)
12-Jul-2019 09:04:47         at org.junit.runners.model.FrameworkMethod$1.runReflectiveCall(FrameworkMethod.java:50)
12-Jul-2019 09:04:47         at org.junit.internal.runners.model.ReflectiveCallable.run(ReflectiveCallable.java:12)
12-Jul-2019 09:04:47         at org.junit.runners.model.FrameworkMethod.invokeExplosively(FrameworkMethod.java:47)
12-Jul-2019 09:04:47         at org.junit.internal.runners.statements.InvokeMethod.evaluate(InvokeMethod.java:17)
12-Jul-2019 09:04:47         at org.junit.internal.runners.statements.ExpectException.evaluate(ExpectException.java:19)
12-Jul-2019 09:04:47         at org.junit.runners.ParentRunner.runLeaf(ParentRunner.java:325)
12-Jul-2019 09:04:47         at org.junit.runners.BlockJUnit4ClassRunner.runChild(BlockJUnit4ClassRunner.java:78)
12-Jul-2019 09:04:47         at org.junit.runners.BlockJUnit4ClassRunner.runChild(BlockJUnit4ClassRunner.java:57)
12-Jul-2019 09:04:47         at org.junit.runners.ParentRunner$3.run(ParentRunner.java:290)
12-Jul-2019 09:04:47         at org.junit.runners.ParentRunner$1.schedule(ParentRunner.java:71)
12-Jul-2019 09:04:47         at org.junit.runners.ParentRunner.runChildren(ParentRunner.java:288)
12-Jul-2019 09:04:47         at org.junit.runners.ParentRunner.access$000(ParentRunner.java:58)
12-Jul-2019 09:04:47         at org.junit.runners.ParentRunner$2.evaluate(ParentRunner.java:268)
12-Jul-2019 09:04:47         at org.junit.runners.ParentRunner.run(ParentRunner.java:363)
12-Jul-2019 09:04:47         at org.apache.maven.surefire.junit4.JUnit4Provider.execute(JUnit4Provider.java:365)
12-Jul-2019 09:04:47         at org.apache.maven.surefire.junit4.JUnit4Provider.executeWithRerun(JUnit4Provider.java:273)
12-Jul-2019 09:04:47         at org.apache.maven.surefire.junit4.JUnit4Provider.executeTestSet(JUnit4Provider.java:238)
12-Jul-2019 09:04:47         at org.apache.maven.surefire.junit4.JUnit4Provider.invoke(JUnit4Provider.java:159)
12-Jul-2019 09:04:47         at org.apache.maven.surefire.booter.ForkedBooter.invokeProviderInSameClassLoader(ForkedBooter.java:383)
12-Jul-2019 09:04:47         at org.apache.maven.surefire.booter.ForkedBooter.runSuitesInProcess(ForkedBooter.java:344)
12-Jul-2019 09:04:47         at org.apache.maven.surefire.booter.ForkedBooter.execute(ForkedBooter.java:125)
12-Jul-2019 09:04:47         at org.apache.maven.surefire.booter.ForkedBooter.main(ForkedBooter.java:417)
12-Jul-2019 09:04:47 09:04:47.723 [main] INFO org.apache.http.impl.execchain.RetryExec - Retrying request to {}->http://test.com:80
12-Jul-2019 09:04:47 09:04:47.723 [main] DEBUG org.apache.http.client.protocol.RequestAddCookies - CookieSpec selected: default
12-Jul-2019 09:04:47 09:04:47.724 [main] DEBUG org.apache.http.client.protocol.RequestAuthCache - Auth cache not set in the context
12-Jul-2019 09:04:47 09:04:47.724 [main] INFO org.apache.http.impl.execchain.RetryExec - I/O exception (org.springframework.cloud.dataflow.rest.resource.HttpClientTest$TestException) caught when processing request to {}->http://test.com:80: It broke
12-Jul-2019 09:04:47 09:04:47.724 [main] DEBUG org.apache.http.impl.execchain.RetryExec - It broke
12-Jul-2019 09:04:47 org.springframework.cloud.dataflow.rest.resource.HttpClientTest$TestException: It broke
12-Jul-2019 09:04:47         at org.springframework.cloud.dataflow.rest.resource.HttpClientTest.resourceBasedAuthorizationHeaderResourceCheck(HttpClientTest.java:88)
12-Jul-2019 09:04:47         at sun.reflect.NativeMethodAccessorImpl.invoke0(Native Method)
12-Jul-2019 09:04:47         at sun.reflect.NativeMethodAccessorImpl.invoke(NativeMethodAccessorImpl.java:62)
12-Jul-2019 09:04:47         at sun.reflect.DelegatingMethodAccessorImpl.invoke(DelegatingMethodAccessorImpl.java:43)
12-Jul-2019 09:04:47         at java.lang.reflect.Method.invoke(Method.java:498)
12-Jul-2019 09:04:47         at org.junit.runners.model.FrameworkMethod$1.runReflectiveCall(FrameworkMethod.java:50)
12-Jul-2019 09:04:47         at org.junit.internal.runners.model.ReflectiveCallable.run(ReflectiveCallable.java:12)
12-Jul-2019 09:04:47         at org.junit.runners.model.FrameworkMethod.invokeExplosively(FrameworkMethod.java:47)
12-Jul-2019 09:04:47         at org.junit.internal.runners.statements.InvokeMethod.evaluate(InvokeMethod.java:17)
12-Jul-2019 09:04:47         at org.junit.internal.runners.statements.ExpectException.evaluate(ExpectException.java:19)
12-Jul-2019 09:04:47         at org.junit.runners.ParentRunner.runLeaf(ParentRunner.java:325)
12-Jul-2019 09:04:47         at org.junit.runners.BlockJUnit4ClassRunner.runChild(BlockJUnit4ClassRunner.java:78)
12-Jul-2019 09:04:47         at org.junit.runners.BlockJUnit4ClassRunner.runChild(BlockJUnit4ClassRunner.java:57)
12-Jul-2019 09:04:47         at org.junit.runners.ParentRunner$3.run(ParentRunner.java:290)
12-Jul-2019 09:04:47         at org.junit.runners.ParentRunner$1.schedule(ParentRunner.java:71)
12-Jul-2019 09:04:47         at org.junit.runners.ParentRunner.runChildren(ParentRunner.java:288)
12-Jul-2019 09:04:47         at org.junit.runners.ParentRunner.access$000(ParentRunner.java:58)
12-Jul-2019 09:04:47         at org.junit.runners.ParentRunner$2.evaluate(ParentRunner.java:268)
12-Jul-2019 09:04:47         at org.junit.runners.ParentRunner.run(ParentRunner.java:363)
12-Jul-2019 09:04:47         at org.apache.maven.surefire.junit4.JUnit4Provider.execute(JUnit4Provider.java:365)
12-Jul-2019 09:04:47         at org.apache.maven.surefire.junit4.JUnit4Provider.executeWithRerun(JUnit4Provider.java:273)
12-Jul-2019 09:04:47         at org.apache.maven.surefire.junit4.JUnit4Provider.executeTestSet(JUnit4Provider.java:238)
12-Jul-2019 09:04:47         at org.apache.maven.surefire.junit4.JUnit4Provider.invoke(JUnit4Provider.java:159)
12-Jul-2019 09:04:47         at org.apache.maven.surefire.booter.ForkedBooter.invokeProviderInSameClassLoader(ForkedBooter.java:383)
12-Jul-2019 09:04:47         at org.apache.maven.surefire.booter.ForkedBooter.runSuitesInProcess(ForkedBooter.java:344)
12-Jul-2019 09:04:47         at org.apache.maven.surefire.booter.ForkedBooter.execute(ForkedBooter.java:125)
12-Jul-2019 09:04:47         at org.apache.maven.surefire.booter.ForkedBooter.main(ForkedBooter.java:417)
12-Jul-2019 09:04:47 09:04:47.728 [main] INFO org.apache.http.impl.execchain.RetryExec - Retrying request to {}->http://test.com:80
12-Jul-2019 09:04:47 09:04:47.728 [main] DEBUG org.apache.http.client.protocol.RequestAddCookies - CookieSpec selected: default
12-Jul-2019 09:04:47 09:04:47.728 [main] DEBUG org.apache.http.client.protocol.RequestAuthCache - Auth cache not set in the context
12-Jul-2019 09:04:47 09:04:47.728 [main] DEBUG org.apache.http.impl.conn.PoolingHttpClientConnectionManager - Connection manager is shutting down
12-Jul-2019 09:04:47 09:04:47.728 [main] DEBUG org.apache.http.impl.conn.PoolingHttpClientConnectionManager - Connection manager shut down
12-Jul-2019 09:04:47 [INFO] Tests run: 2, Failures: 0, Errors: 0, Skipped: 0, Time elapsed: 0.155 s - in org.springframework.cloud.dataflow.rest.resource.HttpClientTest
12-Jul-2019 09:04:47 [INFO] Running org.springframework.cloud.dataflow.rest.resource.TaskExecutionResourceTests
12-Jul-2019 09:04:47 [INFO] Tests run: 5, Failures: 0, Errors: 0, Skipped: 0, Time elapsed: 0.006 s - in org.springframework.cloud.dataflow.rest.resource.TaskExecutionResourceTests
12-Jul-2019 09:04:47 [INFO] Running org.springframework.cloud.dataflow.rest.resource.DeploymentStateResourceTests
12-Jul-2019 09:04:47 09:04:47.800 [main] DEBUG com.jayway.jsonpath.internal.path.CompiledPath - Evaluating path: $['key']
12-Jul-2019 09:04:47 09:04:47.806 [main] DEBUG com.jayway.jsonpath.internal.path.CompiledPath - Evaluating path: $['displayName']
12-Jul-2019 09:04:47 09:04:47.807 [main] DEBUG com.jayway.jsonpath.internal.path.CompiledPath - Evaluating path: $['description']
12-Jul-2019 09:04:47 [INFO] Tests run: 1, Failures: 0, Errors: 0, Skipped: 0, Time elapsed: 0.067 s - in org.springframework.cloud.dataflow.rest.resource.DeploymentStateResourceTests
12-Jul-2019 09:04:48 [INFO]
12-Jul-2019 09:04:48 [INFO] Results:
12-Jul-2019 09:04:48 [INFO]
12-Jul-2019 09:04:48 [INFO] Tests run: 37, Failures: 0, Errors: 0, Skipped: 0
12-Jul-2019 09:04:48 [INFO]
12-Jul-2019 09:04:48 [INFO]
12-Jul-2019 09:04:48 [INFO] --- jacoco-maven-plugin:0.7.9:report (report) @ spring-cloud-dataflow-rest-resource ---
12-Jul-2019 09:04:48 [INFO] Loading execution data file /opt/bamboo-home/xml-data/build-dir/SCD-BMASTER-JOB1/spring-cloud-dataflow-rest-resource/target/jacoco.exec
12-Jul-2019 09:04:48 [INFO] Analyzed bundle 'spring-cloud-dataflow-rest-resource' with 74 classes
12-Jul-2019 09:04:48 [INFO]
12-Jul-2019 09:04:48 [INFO] --- maven-jar-plugin:3.0.2:jar (default-jar) @ spring-cloud-dataflow-rest-resource ---
12-Jul-2019 09:04:48 [INFO] Building jar: /opt/bamboo-home/xml-data/build-dir/SCD-BMASTER-JOB1/spring-cloud-dataflow-rest-resource/target/spring-cloud-dataflow-rest-resource-2.2.0.BUILD-SNAPSHOT.jar
12-Jul-2019 09:04:48 [INFO]
12-Jul-2019 09:04:48 [INFO] --- maven-javadoc-plugin:3.0.1:jar (attach-javadocs) @ spring-cloud-dataflow-rest-resource ---
12-Jul-2019 09:04:49 [INFO]
12-Jul-2019 09:04:49 2 warnings
12-Jul-2019 09:04:49 [WARNING] Javadoc Warnings
12-Jul-2019 09:04:49 [WARNING] /opt/bamboo-home/xml-data/build-dir/SCD-BMASTER-JOB1/spring-cloud-dataflow-rest-resource/src/main/java/org/springframework/cloud/dataflow/rest/resource/CurrentTaskExecutionsResource.java:77: warning: no description for @param
12-Jul-2019 09:04:49 [WARNING] * @param taskExecutionInformation
12-Jul-2019 09:04:49 [WARNING] ^
12-Jul-2019 09:04:49 [WARNING] /opt/bamboo-home/xml-data/build-dir/SCD-BMASTER-JOB1/spring-cloud-dataflow-rest-resource/src/main/java/org/springframework/cloud/dataflow/rest/resource/CurrentTaskExecutionsResource.java:79: warning: no @return
12-Jul-2019 09:04:49 [WARNING] public static CurrentTaskExecutionsResource fromTaskExecutionInformation(
12-Jul-2019 09:04:49 [WARNING] ^
12-Jul-2019 09:04:49 [INFO] Building jar: /opt/bamboo-home/xml-data/build-dir/SCD-BMASTER-JOB1/spring-cloud-dataflow-rest-resource/target/spring-cloud-dataflow-rest-resource-2.2.0.BUILD-SNAPSHOT-javadoc.jar
12-Jul-2019 09:04:49 [INFO]
12-Jul-2019 09:04:49 [INFO] --- maven-javadoc-plugin:3.0.1:jar (javadoc) @ spring-cloud-dataflow-rest-resource ---
12-Jul-2019 09:04:51 [INFO]
12-Jul-2019 09:04:51 2 warnings
12-Jul-2019 09:04:51 [WARNING] Javadoc Warnings
12-Jul-2019 09:04:51 [WARNING] /opt/bamboo-home/xml-data/build-dir/SCD-BMASTER-JOB1/spring-cloud-dataflow-rest-resource/src/main/java/org/springframework/cloud/dataflow/rest/resource/CurrentTaskExecutionsResource.java:77: warning: no description for @param
12-Jul-2019 09:04:51 [WARNING] * @param taskExecutionInformation
12-Jul-2019 09:04:51 [WARNING] ^
12-Jul-2019 09:04:51 [WARNING] /opt/bamboo-home/xml-data/build-dir/SCD-BMASTER-JOB1/spring-cloud-dataflow-rest-resource/src/main/java/org/springframework/cloud/dataflow/rest/resource/CurrentTaskExecutionsResource.java:79: warning: no @return
12-Jul-2019 09:04:51 [WARNING] public static CurrentTaskExecutionsResource fromTaskExecutionInformation(
12-Jul-2019 09:04:51 [WARNING] ^
12-Jul-2019 09:04:51 [INFO] Building jar: /opt/bamboo-home/xml-data/build-dir/SCD-BMASTER-JOB1/spring-cloud-dataflow-rest-resource/target/spring-cloud-dataflow-rest-resource-2.2.0.BUILD-SNAPSHOT-javadoc.jar
12-Jul-2019 09:04:51 [INFO]
12-Jul-2019 09:04:51 [INFO] >>> maven-source-plugin:3.0.1:jar (attach-sources) > generate-sources @ spring-cloud-dataflow-rest-resource >>>
12-Jul-2019 09:04:51 [INFO]
12-Jul-2019 09:04:51 [INFO] --- maven-checkstyle-plugin:3.0.0:check (checkstyle-validation) @ spring-cloud-dataflow-rest-resource ---
12-Jul-2019 09:04:51 [INFO] Starting audit...
12-Jul-2019 09:04:51 Audit done.
12-Jul-2019 09:04:51 [INFO]
12-Jul-2019 09:04:51 [INFO] --- jacoco-maven-plugin:0.7.9:prepare-agent (agent) @ spring-cloud-dataflow-rest-resource ---
12-Jul-2019 09:04:51 [INFO] argLine set to -javaagent:/home/bamboo/.m2/repository/org/jacoco/org.jacoco.agent/0.7.9/org.jacoco.agent-0.7.9-runtime.jar=destfile=/opt/bamboo-home/xml-data/build-dir/SCD-BMASTER-JOB1/spring-cloud-dataflow-rest-resource/target/jacoco.exec
12-Jul-2019 09:04:51 [INFO]
12-Jul-2019 09:04:51 [INFO] <<< maven-source-plugin:3.0.1:jar (attach-sources) < generate-sources @ spring-cloud-dataflow-rest-resource <<<
12-Jul-2019 09:04:51 [INFO]
12-Jul-2019 09:04:51 [INFO]
12-Jul-2019 09:04:51 [INFO] --- maven-source-plugin:3.0.1:jar (attach-sources) @ spring-cloud-dataflow-rest-resource ---
12-Jul-2019 09:04:51 [INFO] Building jar: /opt/bamboo-home/xml-data/build-dir/SCD-BMASTER-JOB1/spring-cloud-dataflow-rest-resource/target/spring-cloud-dataflow-rest-resource-2.2.0.BUILD-SNAPSHOT-sources.jar
12-Jul-2019 09:04:51 [INFO]
12-Jul-2019 09:04:51 [INFO] --- maven-install-plugin:2.4:install (default-install) @ spring-cloud-dataflow-rest-resource ---
12-Jul-2019 09:04:51 [INFO] Installing /opt/bamboo-home/xml-data/build-dir/SCD-BMASTER-JOB1/spring-cloud-dataflow-rest-resource/target/spring-cloud-dataflow-rest-resource-2.2.0.BUILD-SNAPSHOT.jar to /home/bamboo/.m2/repository/org/springframework/cloud/spring-cloud-dataflow-rest-resource/2.2.0.BUILD-SNAPSHOT/spring-cloud-dataflow-rest-resource-2.2.0.BUILD-SNAPSHOT.jar
12-Jul-2019 09:04:51 [INFO] Installing /opt/bamboo-home/xml-data/build-dir/SCD-BMASTER-JOB1/spring-cloud-dataflow-rest-resource/pom.xml to /home/bamboo/.m2/repository/org/springframework/cloud/spring-cloud-dataflow-rest-resource/2.2.0.BUILD-SNAPSHOT/spring-cloud-dataflow-rest-resource-2.2.0.BUILD-SNAPSHOT.pom
12-Jul-2019 09:04:51 [INFO] Installing /opt/bamboo-home/xml-data/build-dir/SCD-BMASTER-JOB1/spring-cloud-dataflow-rest-resource/target/spring-cloud-dataflow-rest-resource-2.2.0.BUILD-SNAPSHOT-javadoc.jar to /home/bamboo/.m2/repository/org/springframework/cloud/spring-cloud-dataflow-rest-resource/2.2.0.BUILD-SNAPSHOT/spring-cloud-dataflow-rest-resource-2.2.0.BUILD-SNAPSHOT-javadoc.jar
12-Jul-2019 09:04:51 [INFO] Installing /opt/bamboo-home/xml-data/build-dir/SCD-BMASTER-JOB1/spring-cloud-dataflow-rest-resource/target/spring-cloud-dataflow-rest-resource-2.2.0.BUILD-SNAPSHOT-javadoc.jar to /home/bamboo/.m2/repository/org/springframework/cloud/spring-cloud-dataflow-rest-resource/2.2.0.BUILD-SNAPSHOT/spring-cloud-dataflow-rest-resource-2.2.0.BUILD-SNAPSHOT-javadoc.jar
12-Jul-2019 09:04:51 [INFO] Installing /opt/bamboo-home/xml-data/build-dir/SCD-BMASTER-JOB1/spring-cloud-dataflow-rest-resource/target/spring-cloud-dataflow-rest-resource-2.2.0.BUILD-SNAPSHOT-sources.jar to /home/bamboo/.m2/repository/org/springframework/cloud/spring-cloud-dataflow-rest-resource/2.2.0.BUILD-SNAPSHOT/spring-cloud-dataflow-rest-resource-2.2.0.BUILD-SNAPSHOT-sources.jar
12-Jul-2019 09:04:51 [INFO]
12-Jul-2019 09:04:51 [INFO] -------< org.springframework.cloud:spring-cloud-dataflow-audit >--------
12-Jul-2019 09:04:51 [INFO] Building spring-cloud-dataflow-audit 2.2.0.BUILD-SNAPSHOT         [6/20]
12-Jul-2019 09:04:51 [INFO] --------------------------------[ jar ]---------------------------------
12-Jul-2019 09:04:51 [INFO]
12-Jul-2019 09:04:51 [INFO] --- maven-clean-plugin:2.5:clean (default-clean) @ spring-cloud-dataflow-audit ---
12-Jul-2019 09:04:51 [INFO]
12-Jul-2019 09:04:51 [INFO] --- maven-checkstyle-plugin:3.0.0:check (checkstyle-validation) @ spring-cloud-dataflow-audit ---
12-Jul-2019 09:04:51 [INFO] Starting audit...
12-Jul-2019 09:04:51 Audit done.
12-Jul-2019 09:04:51 [INFO]
12-Jul-2019 09:04:51 [INFO] --- jacoco-maven-plugin:0.7.9:prepare-agent (agent) @ spring-cloud-dataflow-audit ---
12-Jul-2019 09:04:51 [INFO] argLine set to -javaagent:/home/bamboo/.m2/repository/org/jacoco/org.jacoco.agent/0.7.9/org.jacoco.agent-0.7.9-runtime.jar=destfile=/opt/bamboo-home/xml-data/build-dir/SCD-BMASTER-JOB1/spring-cloud-dataflow-audit/target/jacoco.exec
12-Jul-2019 09:04:51 [INFO]
12-Jul-2019 09:04:51 [INFO] --- maven-resources-plugin:3.1.0:resources (default-resources) @ spring-cloud-dataflow-audit ---
12-Jul-2019 09:04:51 [INFO] Using 'UTF-8' encoding to copy filtered resources.
12-Jul-2019 09:04:51 [INFO] skip non existing resourceDirectory /opt/bamboo-home/xml-data/build-dir/SCD-BMASTER-JOB1/spring-cloud-dataflow-audit/src/main/resources
12-Jul-2019 09:04:51 [INFO] skip non existing resourceDirectory /opt/bamboo-home/xml-data/build-dir/SCD-BMASTER-JOB1/spring-cloud-dataflow-audit/src/main/resources
12-Jul-2019 09:04:51 [INFO]
12-Jul-2019 09:04:51 [INFO] --- maven-compiler-plugin:3.8.0:compile (default-compile) @ spring-cloud-dataflow-audit ---
12-Jul-2019 09:04:51 [INFO] Changes detected - recompiling the module!
12-Jul-2019 09:04:51 [INFO] Compiling 9 source files to /opt/bamboo-home/xml-data/build-dir/SCD-BMASTER-JOB1/spring-cloud-dataflow-audit/target/classes
12-Jul-2019 09:04:52 [INFO]
12-Jul-2019 09:04:52 [INFO] --- maven-resources-plugin:3.1.0:testResources (default-testResources) @ spring-cloud-dataflow-audit ---
12-Jul-2019 09:04:52 [INFO] Using 'UTF-8' encoding to copy filtered resources.
12-Jul-2019 09:04:52 [INFO] skip non existing resourceDirectory /opt/bamboo-home/xml-data/build-dir/SCD-BMASTER-JOB1/spring-cloud-dataflow-audit/src/test/resources
12-Jul-2019 09:04:52 [INFO]
12-Jul-2019 09:04:52 [INFO] --- maven-compiler-plugin:3.8.0:testCompile (default-testCompile) @ spring-cloud-dataflow-audit ---
12-Jul-2019 09:04:52 [INFO] Changes detected - recompiling the module!
12-Jul-2019 09:04:52 [INFO] Compiling 1 source file to /opt/bamboo-home/xml-data/build-dir/SCD-BMASTER-JOB1/spring-cloud-dataflow-audit/target/test-classes
12-Jul-2019 09:04:52 [INFO]
12-Jul-2019 09:04:52 [INFO] --- maven-surefire-plugin:2.22.0:test (default-test) @ spring-cloud-dataflow-audit ---
12-Jul-2019 09:04:52 [INFO]
12-Jul-2019 09:04:52 [INFO] -------------------------------------------------------
12-Jul-2019 09:04:52 [INFO]  T E S T S
12-Jul-2019 09:04:52 [INFO] -------------------------------------------------------
12-Jul-2019 09:04:52 [INFO] Running org.springframework.cloud.dataflow.server.audit.service.DefaultAuditRecordServiceTests
12-Jul-2019 09:04:53 09:04:53.947 [main] ERROR org.springframework.cloud.dataflow.audit.service.DefaultAuditRecordService - Error serializing audit record data.  Data = {foo=bar}
12-Jul-2019 09:04:54 [INFO] Tests run: 12, Failures: 0, Errors: 0, Skipped: 0, Time elapsed: 1.557 s - in org.springframework.cloud.dataflow.server.audit.service.DefaultAuditRecordServiceTests
12-Jul-2019 09:04:54 [INFO]
12-Jul-2019 09:04:54 [INFO] Results:
12-Jul-2019 09:04:54 [INFO]
12-Jul-2019 09:04:54 [INFO] Tests run: 12, Failures: 0, Errors: 0, Skipped: 0
12-Jul-2019 09:04:54 [INFO]
12-Jul-2019 09:04:54 [INFO]
12-Jul-2019 09:04:54 [INFO] --- jacoco-maven-plugin:0.7.9:report (report) @ spring-cloud-dataflow-audit ---
12-Jul-2019 09:04:54 [INFO] Loading execution data file /opt/bamboo-home/xml-data/build-dir/SCD-BMASTER-JOB1/spring-cloud-dataflow-audit/target/jacoco.exec
12-Jul-2019 09:04:54 [INFO] Analyzed bundle 'spring-cloud-dataflow-audit' with 3 classes
12-Jul-2019 09:04:54 [INFO]
12-Jul-2019 09:04:54 [INFO] --- maven-jar-plugin:3.0.2:jar (default-jar) @ spring-cloud-dataflow-audit ---
12-Jul-2019 09:04:54 [INFO] Building jar: /opt/bamboo-home/xml-data/build-dir/SCD-BMASTER-JOB1/spring-cloud-dataflow-audit/target/spring-cloud-dataflow-audit-2.2.0.BUILD-SNAPSHOT.jar
12-Jul-2019 09:04:54 [INFO]
12-Jul-2019 09:04:54 [INFO] --- maven-javadoc-plugin:3.0.1:jar (attach-javadocs) @ spring-cloud-dataflow-audit ---
12-Jul-2019 09:04:55 [INFO] Building jar: /opt/bamboo-home/xml-data/build-dir/SCD-BMASTER-JOB1/spring-cloud-dataflow-audit/target/spring-cloud-dataflow-audit-2.2.0.BUILD-SNAPSHOT-javadoc.jar
12-Jul-2019 09:04:55 [INFO]
12-Jul-2019 09:04:55 [INFO] --- maven-javadoc-plugin:3.0.1:jar (javadoc) @ spring-cloud-dataflow-audit ---
12-Jul-2019 09:04:56 [INFO] Building jar: /opt/bamboo-home/xml-data/build-dir/SCD-BMASTER-JOB1/spring-cloud-dataflow-audit/target/spring-cloud-dataflow-audit-2.2.0.BUILD-SNAPSHOT-javadoc.jar
12-Jul-2019 09:04:56 [INFO]
12-Jul-2019 09:04:56 [INFO] >>> maven-source-plugin:3.0.1:jar (attach-sources) > generate-sources @ spring-cloud-dataflow-audit >>>
12-Jul-2019 09:04:56 [INFO]
12-Jul-2019 09:04:56 [INFO] --- maven-checkstyle-plugin:3.0.0:check (checkstyle-validation) @ spring-cloud-dataflow-audit ---
12-Jul-2019 09:04:56 [INFO] Starting audit...
12-Jul-2019 09:04:56 Audit done.
12-Jul-2019 09:04:56 [INFO]
12-Jul-2019 09:04:56 [INFO] --- jacoco-maven-plugin:0.7.9:prepare-agent (agent) @ spring-cloud-dataflow-audit ---
12-Jul-2019 09:04:56 [INFO] argLine set to -javaagent:/home/bamboo/.m2/repository/org/jacoco/org.jacoco.agent/0.7.9/org.jacoco.agent-0.7.9-runtime.jar=destfile=/opt/bamboo-home/xml-data/build-dir/SCD-BMASTER-JOB1/spring-cloud-dataflow-audit/target/jacoco.exec
12-Jul-2019 09:04:56 [INFO]
12-Jul-2019 09:04:56 [INFO] <<< maven-source-plugin:3.0.1:jar (attach-sources) < generate-sources @ spring-cloud-dataflow-audit <<<
12-Jul-2019 09:04:56 [INFO]
12-Jul-2019 09:04:56 [INFO]
12-Jul-2019 09:04:56 [INFO] --- maven-source-plugin:3.0.1:jar (attach-sources) @ spring-cloud-dataflow-audit ---
12-Jul-2019 09:04:56 [INFO] Building jar: /opt/bamboo-home/xml-data/build-dir/SCD-BMASTER-JOB1/spring-cloud-dataflow-audit/target/spring-cloud-dataflow-audit-2.2.0.BUILD-SNAPSHOT-sources.jar
12-Jul-2019 09:04:56 [INFO]
12-Jul-2019 09:04:56 [INFO] --- maven-install-plugin:2.4:install (default-install) @ spring-cloud-dataflow-audit ---
12-Jul-2019 09:04:56 [INFO] Installing /opt/bamboo-home/xml-data/build-dir/SCD-BMASTER-JOB1/spring-cloud-dataflow-audit/target/spring-cloud-dataflow-audit-2.2.0.BUILD-SNAPSHOT.jar to /home/bamboo/.m2/repository/org/springframework/cloud/spring-cloud-dataflow-audit/2.2.0.BUILD-SNAPSHOT/spring-cloud-dataflow-audit-2.2.0.BUILD-SNAPSHOT.jar
12-Jul-2019 09:04:56 [INFO] Installing /opt/bamboo-home/xml-data/build-dir/SCD-BMASTER-JOB1/spring-cloud-dataflow-audit/pom.xml to /home/bamboo/.m2/repository/org/springframework/cloud/spring-cloud-dataflow-audit/2.2.0.BUILD-SNAPSHOT/spring-cloud-dataflow-audit-2.2.0.BUILD-SNAPSHOT.pom
12-Jul-2019 09:04:56 [INFO] Installing /opt/bamboo-home/xml-data/build-dir/SCD-BMASTER-JOB1/spring-cloud-dataflow-audit/target/spring-cloud-dataflow-audit-2.2.0.BUILD-SNAPSHOT-javadoc.jar to /home/bamboo/.m2/repository/org/springframework/cloud/spring-cloud-dataflow-audit/2.2.0.BUILD-SNAPSHOT/spring-cloud-dataflow-audit-2.2.0.BUILD-SNAPSHOT-javadoc.jar
12-Jul-2019 09:04:56 [INFO] Installing /opt/bamboo-home/xml-data/build-dir/SCD-BMASTER-JOB1/spring-cloud-dataflow-audit/target/spring-cloud-dataflow-audit-2.2.0.BUILD-SNAPSHOT-javadoc.jar to /home/bamboo/.m2/repository/org/springframework/cloud/spring-cloud-dataflow-audit/2.2.0.BUILD-SNAPSHOT/spring-cloud-dataflow-audit-2.2.0.BUILD-SNAPSHOT-javadoc.jar
12-Jul-2019 09:04:56 [INFO] Installing /opt/bamboo-home/xml-data/build-dir/SCD-BMASTER-JOB1/spring-cloud-dataflow-audit/target/spring-cloud-dataflow-audit-2.2.0.BUILD-SNAPSHOT-sources.jar to /home/bamboo/.m2/repository/org/springframework/cloud/spring-cloud-dataflow-audit/2.2.0.BUILD-SNAPSHOT/spring-cloud-dataflow-audit-2.2.0.BUILD-SNAPSHOT-sources.jar
12-Jul-2019 09:04:56 [INFO]
12-Jul-2019 09:04:56 [INFO] ------< org.springframework.cloud:spring-cloud-dataflow-registry >------
12-Jul-2019 09:04:56 [INFO] Building spring-cloud-dataflow-registry 2.2.0.BUILD-SNAPSHOT      [7/20]
12-Jul-2019 09:04:56 [INFO] --------------------------------[ jar ]---------------------------------
12-Jul-2019 09:04:56 [INFO]
12-Jul-2019 09:04:56 [INFO] --- maven-clean-plugin:2.5:clean (default-clean) @ spring-cloud-dataflow-registry ---
12-Jul-2019 09:04:56 [INFO]
12-Jul-2019 09:04:56 [INFO] --- maven-checkstyle-plugin:3.0.0:check (checkstyle-validation) @ spring-cloud-dataflow-registry ---
12-Jul-2019 09:04:56 [INFO] Starting audit...
12-Jul-2019 09:04:56 Audit done.
12-Jul-2019 09:04:56 [INFO]
12-Jul-2019 09:04:56 [INFO] --- jacoco-maven-plugin:0.7.9:prepare-agent (agent) @ spring-cloud-dataflow-registry ---
12-Jul-2019 09:04:56 [INFO] argLine set to -javaagent:/home/bamboo/.m2/repository/org/jacoco/org.jacoco.agent/0.7.9/org.jacoco.agent-0.7.9-runtime.jar=destfile=/opt/bamboo-home/xml-data/build-dir/SCD-BMASTER-JOB1/spring-cloud-dataflow-registry/target/jacoco.exec
12-Jul-2019 09:04:56 [INFO]
12-Jul-2019 09:04:56 [INFO] --- maven-resources-plugin:3.1.0:resources (default-resources) @ spring-cloud-dataflow-registry ---
12-Jul-2019 09:04:56 [INFO] Using 'UTF-8' encoding to copy filtered resources.
12-Jul-2019 09:04:56 [INFO] skip non existing resourceDirectory /opt/bamboo-home/xml-data/build-dir/SCD-BMASTER-JOB1/spring-cloud-dataflow-registry/src/main/resources
12-Jul-2019 09:04:56 [INFO] skip non existing resourceDirectory /opt/bamboo-home/xml-data/build-dir/SCD-BMASTER-JOB1/spring-cloud-dataflow-registry/src/main/resources
12-Jul-2019 09:04:56 [INFO]
12-Jul-2019 09:04:56 [INFO] --- maven-compiler-plugin:3.8.0:compile (default-compile) @ spring-cloud-dataflow-registry ---
12-Jul-2019 09:04:56 [INFO] Changes detected - recompiling the module!
12-Jul-2019 09:04:56 [INFO] Compiling 10 source files to /opt/bamboo-home/xml-data/build-dir/SCD-BMASTER-JOB1/spring-cloud-dataflow-registry/target/classes
12-Jul-2019 09:04:56 [INFO]
12-Jul-2019 09:04:56 [INFO] --- maven-resources-plugin:3.1.0:testResources (default-testResources) @ spring-cloud-dataflow-registry ---
12-Jul-2019 09:04:56 [INFO] Using 'UTF-8' encoding to copy filtered resources.
12-Jul-2019 09:04:56 [INFO] Copying 8 resources
12-Jul-2019 09:04:56 [INFO]
12-Jul-2019 09:04:56 [INFO] --- maven-compiler-plugin:3.8.0:testCompile (default-testCompile) @ spring-cloud-dataflow-registry ---
12-Jul-2019 09:04:56 [INFO] Changes detected - recompiling the module!
12-Jul-2019 09:04:56 [INFO] Compiling 3 source files to /opt/bamboo-home/xml-data/build-dir/SCD-BMASTER-JOB1/spring-cloud-dataflow-registry/target/test-classes
12-Jul-2019 09:04:57 [INFO] /opt/bamboo-home/xml-data/build-dir/SCD-BMASTER-JOB1/spring-cloud-dataflow-registry/src/test/java/org/springframework/cloud/dataflow/registry/service/DefaultAppRegistryServiceTests.java: /opt/bamboo-home/xml-data/build-dir/SCD-BMASTER-JOB1/spring-cloud-dataflow-registry/src/test/java/org/springframework/cloud/dataflow/registry/service/DefaultAppRegistryServiceTests.java uses unchecked or unsafe operations.
12-Jul-2019 09:04:57 [INFO] /opt/bamboo-home/xml-data/build-dir/SCD-BMASTER-JOB1/spring-cloud-dataflow-registry/src/test/java/org/springframework/cloud/dataflow/registry/service/DefaultAppRegistryServiceTests.java: Recompile with -Xlint:unchecked for details.
12-Jul-2019 09:04:57 [INFO]
12-Jul-2019 09:04:57 [INFO] --- maven-surefire-plugin:2.22.0:test (default-test) @ spring-cloud-dataflow-registry ---
12-Jul-2019 09:04:57 [INFO]
12-Jul-2019 09:04:57 [INFO] -------------------------------------------------------
12-Jul-2019 09:04:57 [INFO]  T E S T S
12-Jul-2019 09:04:57 [INFO] -------------------------------------------------------
12-Jul-2019 09:04:58 [INFO] Running org.springframework.cloud.dataflow.registry.service.DefaultAppRegistryServiceTests
12-Jul-2019 09:04:58 09:04:58.903 [main] DEBUG org.springframework.cloud.deployer.resource.maven.MavenArtifactResolver - Local repository: /home/bamboo/.m2/repository
12-Jul-2019 09:04:58 09:04:58.907 [main] DEBUG org.springframework.cloud.deployer.resource.maven.MavenArtifactResolver - Remote repositories:
12-Jul-2019 09:04:59 09:04:59.048 [main] DEBUG org.springframework.cloud.deployer.resource.maven.MavenArtifactResolver - Local repository: /home/bamboo/.m2/repository
12-Jul-2019 09:04:59 09:04:59.048 [main] DEBUG org.springframework.cloud.deployer.resource.maven.MavenArtifactResolver - Remote repositories:
12-Jul-2019 09:04:59 09:04:59.049 [main] DEBUG org.springframework.cloud.deployer.resource.maven.MavenArtifactResolver - Local repository: /home/bamboo/.m2/repository
12-Jul-2019 09:04:59 09:04:59.050 [main] DEBUG org.springframework.cloud.deployer.resource.maven.MavenArtifactResolver - Remote repositories:
12-Jul-2019 09:04:59 09:04:59.051 [main] DEBUG org.springframework.cloud.deployer.resource.maven.MavenArtifactResolver - Local repository: /home/bamboo/.m2/repository
12-Jul-2019 09:04:59 09:04:59.051 [main] DEBUG org.springframework.cloud.deployer.resource.maven.MavenArtifactResolver - Remote repositories:
12-Jul-2019 09:04:59 09:04:59.052 [main] DEBUG org.springframework.cloud.deployer.resource.maven.MavenArtifactResolver - Local repository: /home/bamboo/.m2/repository
12-Jul-2019 09:04:59 09:04:59.052 [main] DEBUG org.springframework.cloud.deployer.resource.maven.MavenArtifactResolver - Remote repositories:
12-Jul-2019 09:04:59 09:04:59.053 [main] DEBUG org.springframework.cloud.deployer.resource.maven.MavenArtifactResolver - Local repository: /home/bamboo/.m2/repository
12-Jul-2019 09:04:59 09:04:59.053 [main] DEBUG org.springframework.cloud.deployer.resource.maven.MavenArtifactResolver - Remote repositories:
12-Jul-2019 09:04:59 09:04:59.054 [main] DEBUG org.springframework.cloud.deployer.resource.maven.MavenArtifactResolver - Local repository: /home/bamboo/.m2/repository
12-Jul-2019 09:04:59 09:04:59.054 [main] DEBUG org.springframework.cloud.deployer.resource.maven.MavenArtifactResolver - Remote repositories:
12-Jul-2019 09:04:59 09:04:59.055 [main] DEBUG org.springframework.cloud.deployer.resource.maven.MavenArtifactResolver - Local repository: /home/bamboo/.m2/repository
12-Jul-2019 09:04:59 09:04:59.055 [main] DEBUG org.springframework.cloud.deployer.resource.maven.MavenArtifactResolver - Remote repositories:
12-Jul-2019 09:04:59 09:04:59.062 [main] ERROR org.springframework.cloud.dataflow.registry.service.DefaultAppRegistryService - App registration failed, app not saved into database!
12-Jul-2019 09:04:59 09:04:59.062 [main] ERROR org.springframework.cloud.dataflow.registry.service.DefaultAppRegistryService - App registration failed, app not saved into database!
12-Jul-2019 09:04:59 09:04:59.063 [main] ERROR org.springframework.cloud.dataflow.registry.service.DefaultAppRegistryService - App registration failed, app not saved into database!
12-Jul-2019 09:04:59 09:04:59.063 [main] ERROR org.springframework.cloud.dataflow.registry.service.DefaultAppRegistryService - App registration failed, app not saved into database!
12-Jul-2019 09:04:59 09:04:59.090 [main] DEBUG org.springframework.cloud.deployer.resource.maven.MavenArtifactResolver - Local repository: /home/bamboo/.m2/repository
12-Jul-2019 09:04:59 09:04:59.090 [main] DEBUG org.springframework.cloud.deployer.resource.maven.MavenArtifactResolver - Remote repositories:
12-Jul-2019 09:04:59 09:04:59.091 [main] DEBUG org.springframework.cloud.deployer.resource.maven.MavenArtifactResolver - Local repository: /home/bamboo/.m2/repository
12-Jul-2019 09:04:59 09:04:59.092 [main] DEBUG org.springframework.cloud.deployer.resource.maven.MavenArtifactResolver - Remote repositories:
12-Jul-2019 09:04:59 09:04:59.092 [main] DEBUG org.springframework.cloud.deployer.resource.maven.MavenArtifactResolver - Local repository: /home/bamboo/.m2/repository
12-Jul-2019 09:04:59 09:04:59.093 [main] DEBUG org.springframework.cloud.deployer.resource.maven.MavenArtifactResolver - Remote repositories:
12-Jul-2019 09:04:59 09:04:59.093 [main] DEBUG org.springframework.cloud.deployer.resource.maven.MavenArtifactResolver - Local repository: /home/bamboo/.m2/repository
12-Jul-2019 09:04:59 09:04:59.093 [main] DEBUG org.springframework.cloud.deployer.resource.maven.MavenArtifactResolver - Remote repositories:
12-Jul-2019 09:04:59 09:04:59.094 [main] DEBUG org.springframework.cloud.deployer.resource.maven.MavenArtifactResolver - Local repository: /home/bamboo/.m2/repository
12-Jul-2019 09:04:59 09:04:59.094 [main] DEBUG org.springframework.cloud.deployer.resource.maven.MavenArtifactResolver - Remote repositories:
12-Jul-2019 09:04:59 09:04:59.095 [main] DEBUG org.springframework.cloud.deployer.resource.maven.MavenArtifactResolver - Local repository: /home/bamboo/.m2/repository
12-Jul-2019 09:04:59 09:04:59.095 [main] DEBUG org.springframework.cloud.deployer.resource.maven.MavenArtifactResolver - Remote repositories:
12-Jul-2019 09:04:59 09:04:59.096 [main] DEBUG org.springframework.cloud.deployer.resource.maven.MavenArtifactResolver - Local repository: /home/bamboo/.m2/repository
12-Jul-2019 09:04:59 09:04:59.096 [main] DEBUG org.springframework.cloud.deployer.resource.maven.MavenArtifactResolver - Remote repositories:
12-Jul-2019 09:04:59 09:04:59.097 [main] DEBUG org.springframework.cloud.deployer.resource.maven.MavenArtifactResolver - Local repository: /home/bamboo/.m2/repository
12-Jul-2019 09:04:59 09:04:59.097 [main] DEBUG org.springframework.cloud.deployer.resource.maven.MavenArtifactResolver - Remote repositories:
12-Jul-2019 09:04:59 09:04:59.102 [main] ERROR org.springframework.cloud.dataflow.registry.service.DefaultAppRegistryService - App registration failed, app not saved into database!
12-Jul-2019 09:04:59 09:04:59.102 [main] ERROR org.springframework.cloud.dataflow.registry.service.DefaultAppRegistryService - App registration failed, app not saved into database!
12-Jul-2019 09:04:59 09:04:59.103 [main] ERROR org.springframework.cloud.dataflow.registry.service.DefaultAppRegistryService - App registration failed, app not saved into database!
12-Jul-2019 09:04:59 09:04:59.103 [main] ERROR org.springframework.cloud.dataflow.registry.service.DefaultAppRegistryService - App registration failed, app not saved into database!
12-Jul-2019 09:04:59 09:04:59.106 [main] ERROR org.springframework.cloud.dataflow.registry.service.DefaultAppRegistryService - App registration failed, app not saved into database!
12-Jul-2019 09:04:59 09:04:59.109 [main] DEBUG org.springframework.cloud.deployer.resource.maven.MavenArtifactResolver - Local repository: /home/bamboo/.m2/repository
12-Jul-2019 09:04:59 09:04:59.109 [main] DEBUG org.springframework.cloud.deployer.resource.maven.MavenArtifactResolver - Remote repositories:
12-Jul-2019 09:04:59 09:04:59.110 [main] DEBUG org.springframework.cloud.deployer.resource.maven.MavenArtifactResolver - Local repository: /home/bamboo/.m2/repository
12-Jul-2019 09:04:59 09:04:59.110 [main] DEBUG org.springframework.cloud.deployer.resource.maven.MavenArtifactResolver - Remote repositories:
12-Jul-2019 09:04:59 09:04:59.110 [main] DEBUG org.springframework.cloud.deployer.resource.maven.MavenArtifactResolver - Local repository: /home/bamboo/.m2/repository
12-Jul-2019 09:04:59 09:04:59.110 [main] DEBUG org.springframework.cloud.deployer.resource.maven.MavenArtifactResolver - Remote repositories:
12-Jul-2019 09:04:59 09:04:59.111 [main] DEBUG org.springframework.cloud.deployer.resource.maven.MavenArtifactResolver - Local repository: /home/bamboo/.m2/repository
12-Jul-2019 09:04:59 09:04:59.111 [main] DEBUG org.springframework.cloud.deployer.resource.maven.MavenArtifactResolver - Remote repositories:
12-Jul-2019 09:04:59 09:04:59.111 [main] DEBUG org.springframework.cloud.deployer.resource.maven.MavenArtifactResolver - Local repository: /home/bamboo/.m2/repository
12-Jul-2019 09:04:59 09:04:59.111 [main] DEBUG org.springframework.cloud.deployer.resource.maven.MavenArtifactResolver - Remote repositories:
12-Jul-2019 09:04:59 09:04:59.112 [main] DEBUG org.springframework.cloud.deployer.resource.maven.MavenArtifactResolver - Local repository: /home/bamboo/.m2/repository
12-Jul-2019 09:04:59 09:04:59.112 [main] DEBUG org.springframework.cloud.deployer.resource.maven.MavenArtifactResolver - Remote repositories:
12-Jul-2019 09:04:59 09:04:59.112 [main] DEBUG org.springframework.cloud.deployer.resource.maven.MavenArtifactResolver - Local repository: /home/bamboo/.m2/repository
12-Jul-2019 09:04:59 09:04:59.112 [main] DEBUG org.springframework.cloud.deployer.resource.maven.MavenArtifactResolver - Remote repositories:
12-Jul-2019 09:04:59 09:04:59.113 [main] DEBUG org.springframework.cloud.deployer.resource.maven.MavenArtifactResolver - Local repository: /home/bamboo/.m2/repository
12-Jul-2019 09:04:59 09:04:59.113 [main] DEBUG org.springframework.cloud.deployer.resource.maven.MavenArtifactResolver - Remote repositories:
12-Jul-2019 09:04:59 09:04:59.113 [main] ERROR org.springframework.cloud.dataflow.registry.service.DefaultAppRegistryService - App registration failed, app not saved into database!
12-Jul-2019 09:04:59 09:04:59.113 [main] ERROR org.springframework.cloud.dataflow.registry.service.DefaultAppRegistryService - App registration failed, app not saved into database!
12-Jul-2019 09:04:59 09:04:59.114 [main] ERROR org.springframework.cloud.dataflow.registry.service.DefaultAppRegistryService - App registration failed, app not saved into database!
12-Jul-2019 09:04:59 09:04:59.114 [main] ERROR org.springframework.cloud.dataflow.registry.service.DefaultAppRegistryService - App registration failed, app not saved into database!
12-Jul-2019 09:04:59 09:04:59.121 [main] DEBUG org.springframework.cloud.deployer.resource.maven.MavenArtifactResolver - Local repository: /home/bamboo/.m2/repository
12-Jul-2019 09:04:59 09:04:59.121 [main] DEBUG org.springframework.cloud.deployer.resource.maven.MavenArtifactResolver - Remote repositories:
12-Jul-2019 09:04:59 09:04:59.122 [main] DEBUG org.springframework.cloud.deployer.resource.maven.MavenArtifactResolver - Local repository: /home/bamboo/.m2/repository
12-Jul-2019 09:04:59 09:04:59.122 [main] DEBUG org.springframework.cloud.deployer.resource.maven.MavenArtifactResolver - Remote repositories:
12-Jul-2019 09:04:59 09:04:59.123 [main] DEBUG org.springframework.cloud.deployer.resource.maven.MavenArtifactResolver - Local repository: /home/bamboo/.m2/repository
12-Jul-2019 09:04:59 09:04:59.123 [main] DEBUG org.springframework.cloud.deployer.resource.maven.MavenArtifactResolver - Remote repositories:
12-Jul-2019 09:04:59 09:04:59.124 [main] DEBUG org.springframework.cloud.deployer.resource.maven.MavenArtifactResolver - Local repository: /home/bamboo/.m2/repository
12-Jul-2019 09:04:59 09:04:59.124 [main] DEBUG org.springframework.cloud.deployer.resource.maven.MavenArtifactResolver - Remote repositories:
12-Jul-2019 09:04:59 09:04:59.125 [main] DEBUG org.springframework.cloud.deployer.resource.maven.MavenArtifactResolver - Local repository: /home/bamboo/.m2/repository
12-Jul-2019 09:04:59 09:04:59.125 [main] DEBUG org.springframework.cloud.deployer.resource.maven.MavenArtifactResolver - Remote repositories:
12-Jul-2019 09:04:59 09:04:59.126 [main] DEBUG org.springframework.cloud.deployer.resource.maven.MavenArtifactResolver - Local repository: /home/bamboo/.m2/repository
12-Jul-2019 09:04:59 09:04:59.126 [main] DEBUG org.springframework.cloud.deployer.resource.maven.MavenArtifactResolver - Remote repositories:
12-Jul-2019 09:04:59 09:04:59.127 [main] ERROR org.springframework.cloud.dataflow.registry.service.DefaultAppRegistryService - App registration failed, app not saved into database!
12-Jul-2019 09:04:59 09:04:59.127 [main] ERROR org.springframework.cloud.dataflow.registry.service.DefaultAppRegistryService - App registration failed, app not saved into database!
12-Jul-2019 09:04:59 09:04:59.127 [main] ERROR org.springframework.cloud.dataflow.registry.service.DefaultAppRegistryService - App registration failed, app not saved into database!
12-Jul-2019 09:04:59 09:04:59.130 [main] DEBUG org.springframework.cloud.deployer.resource.maven.MavenArtifactResolver - Local repository: /home/bamboo/.m2/repository
12-Jul-2019 09:04:59 09:04:59.130 [main] DEBUG org.springframework.cloud.deployer.resource.maven.MavenArtifactResolver - Remote repositories:
12-Jul-2019 09:04:59 09:04:59.130 [main] DEBUG org.springframework.cloud.deployer.resource.maven.MavenArtifactResolver - Local repository: /home/bamboo/.m2/repository
12-Jul-2019 09:04:59 09:04:59.131 [main] DEBUG org.springframework.cloud.deployer.resource.maven.MavenArtifactResolver - Remote repositories:
12-Jul-2019 09:04:59 09:04:59.131 [main] DEBUG org.springframework.cloud.deployer.resource.maven.MavenArtifactResolver - Local repository: /home/bamboo/.m2/repository
12-Jul-2019 09:04:59 09:04:59.131 [main] DEBUG org.springframework.cloud.deployer.resource.maven.MavenArtifactResolver - Remote repositories:
12-Jul-2019 09:04:59 09:04:59.132 [main] DEBUG org.springframework.cloud.deployer.resource.maven.MavenArtifactResolver - Local repository: /home/bamboo/.m2/repository
12-Jul-2019 09:04:59 09:04:59.132 [main] DEBUG org.springframework.cloud.deployer.resource.maven.MavenArtifactResolver - Remote repositories:
12-Jul-2019 09:04:59 09:04:59.133 [main] DEBUG org.springframework.cloud.deployer.resource.maven.MavenArtifactResolver - Local repository: /home/bamboo/.m2/repository
12-Jul-2019 09:04:59 09:04:59.133 [main] DEBUG org.springframework.cloud.deployer.resource.maven.MavenArtifactResolver - Remote repositories:
12-Jul-2019 09:04:59 09:04:59.134 [main] DEBUG org.springframework.cloud.deployer.resource.maven.MavenArtifactResolver - Local repository: /home/bamboo/.m2/repository
12-Jul-2019 09:04:59 09:04:59.134 [main] DEBUG org.springframework.cloud.deployer.resource.maven.MavenArtifactResolver - Remote repositories:
12-Jul-2019 09:04:59 09:04:59.135 [main] DEBUG org.springframework.cloud.deployer.resource.maven.MavenArtifactResolver - Local repository: /home/bamboo/.m2/repository
12-Jul-2019 09:04:59 09:04:59.135 [main] DEBUG org.springframework.cloud.deployer.resource.maven.MavenArtifactResolver - Remote repositories:
12-Jul-2019 09:04:59 09:04:59.135 [main] DEBUG org.springframework.cloud.deployer.resource.maven.MavenArtifactResolver - Local repository: /home/bamboo/.m2/repository
12-Jul-2019 09:04:59 09:04:59.135 [main] DEBUG org.springframework.cloud.deployer.resource.maven.MavenArtifactResolver - Remote repositories:
12-Jul-2019 09:04:59 09:04:59.136 [main] ERROR org.springframework.cloud.dataflow.registry.service.DefaultAppRegistryService - App registration failed, app not saved into database!
12-Jul-2019 09:04:59 09:04:59.137 [main] ERROR org.springframework.cloud.dataflow.registry.service.DefaultAppRegistryService - App registration failed, app not saved into database!
12-Jul-2019 09:04:59 09:04:59.137 [main] ERROR org.springframework.cloud.dataflow.registry.service.DefaultAppRegistryService - App registration failed, app not saved into database!
12-Jul-2019 09:04:59 09:04:59.138 [main] ERROR org.springframework.cloud.dataflow.registry.service.DefaultAppRegistryService - App registration failed, app not saved into database!
12-Jul-2019 09:04:59 09:04:59.144 [main] ERROR org.springframework.cloud.dataflow.registry.service.DefaultAppRegistryService - App registration failed, app not saved into database!
12-Jul-2019 09:04:59 09:04:59.145 [main] ERROR org.springframework.cloud.dataflow.registry.service.DefaultAppRegistryService - App registration failed, app not saved into database!
12-Jul-2019 09:04:59 09:04:59.147 [main] ERROR org.springframework.cloud.dataflow.registry.service.DefaultAppRegistryService - App registration failed, app not saved into database!
12-Jul-2019 09:04:59 09:04:59.147 [main] ERROR org.springframework.cloud.dataflow.registry.service.DefaultAppRegistryService - App registration failed, app not saved into database!
12-Jul-2019 09:04:59 09:04:59.147 [main] ERROR org.springframework.cloud.dataflow.registry.service.DefaultAppRegistryService - App registration failed, app not saved into database!
12-Jul-2019 09:04:59 09:04:59.151 [main] ERROR org.springframework.cloud.dataflow.registry.service.DefaultAppRegistryService - App registration failed, app not saved into database!
12-Jul-2019 09:04:59 09:04:59.152 [main] ERROR org.springframework.cloud.dataflow.registry.service.DefaultAppRegistryService - App registration failed, app not saved into database!
12-Jul-2019 09:04:59 [INFO] Tests run: 17, Failures: 0, Errors: 0, Skipped: 0, Time elapsed: 1.031 s - in org.springframework.cloud.dataflow.registry.service.DefaultAppRegistryServiceTests
12-Jul-2019 09:04:59 [INFO] Running org.springframework.cloud.dataflow.registry.support.AppResourceCommonTests
12-Jul-2019 09:04:59 09:04:59.168 [main] DEBUG org.springframework.cloud.deployer.resource.maven.MavenArtifactResolver - Local repository: /home/bamboo/.m2/repository
12-Jul-2019 09:04:59 09:04:59.168 [main] DEBUG org.springframework.cloud.deployer.resource.maven.MavenArtifactResolver - Remote repositories:
12-Jul-2019 09:04:59 09:04:59.264 [main] DEBUG org.springframework.cloud.deployer.resource.maven.MavenArtifactResolver - Local repository: /home/bamboo/.m2/repository
12-Jul-2019 09:04:59 09:04:59.264 [main] DEBUG org.springframework.cloud.deployer.resource.maven.MavenArtifactResolver - Remote repositories:
12-Jul-2019 09:04:59 09:04:59.265 [main] DEBUG org.springframework.cloud.deployer.resource.maven.MavenArtifactResolver - Local repository: /home/bamboo/.m2/repository
12-Jul-2019 09:04:59 09:04:59.265 [main] DEBUG org.springframework.cloud.deployer.resource.maven.MavenArtifactResolver - Remote repositories:
12-Jul-2019 09:04:59 09:04:59.267 [main] DEBUG org.springframework.cloud.deployer.resource.maven.MavenArtifactResolver - Local repository: /home/bamboo/.m2/repository
12-Jul-2019 09:04:59 09:04:59.267 [main] DEBUG org.springframework.cloud.deployer.resource.maven.MavenArtifactResolver - Remote repositories:
12-Jul-2019 09:04:59 09:04:59.272 [main] DEBUG org.springframework.cloud.deployer.resource.maven.MavenArtifactResolver - Local repository: /home/bamboo/.m2/repository
12-Jul-2019 09:04:59 09:04:59.273 [main] DEBUG org.springframework.cloud.deployer.resource.maven.MavenArtifactResolver - Remote repositories:
12-Jul-2019 09:04:59 [INFO] Tests run: 15, Failures: 0, Errors: 0, Skipped: 0, Time elapsed: 0.121 s - in org.springframework.cloud.dataflow.registry.support.AppResourceCommonTests
12-Jul-2019 09:04:59 [INFO] Running org.springframework.cloud.dataflow.registry.support.DockerImageTests
12-Jul-2019 09:04:59 [INFO] Tests run: 14, Failures: 0, Errors: 0, Skipped: 0, Time elapsed: 0.012 s - in org.springframework.cloud.dataflow.registry.support.DockerImageTests
12-Jul-2019 09:04:59 [INFO]
12-Jul-2019 09:04:59 [INFO] Results:
12-Jul-2019 09:04:59 [INFO]
12-Jul-2019 09:04:59 [INFO] Tests run: 46, Failures: 0, Errors: 0, Skipped: 0
12-Jul-2019 09:04:59 [INFO]
12-Jul-2019 09:04:59 [INFO]
12-Jul-2019 09:04:59 [INFO] --- jacoco-maven-plugin:0.7.9:report (report) @ spring-cloud-dataflow-registry ---
12-Jul-2019 09:04:59 [INFO] Loading execution data file /opt/bamboo-home/xml-data/build-dir/SCD-BMASTER-JOB1/spring-cloud-dataflow-registry/target/jacoco.exec
12-Jul-2019 09:04:59 [INFO] Analyzed bundle 'spring-cloud-dataflow-registry' with 5 classes
12-Jul-2019 09:04:59 [INFO]
12-Jul-2019 09:04:59 [INFO] --- maven-jar-plugin:3.0.2:jar (default-jar) @ spring-cloud-dataflow-registry ---
12-Jul-2019 09:04:59 [INFO] Building jar: /opt/bamboo-home/xml-data/build-dir/SCD-BMASTER-JOB1/spring-cloud-dataflow-registry/target/spring-cloud-dataflow-registry-2.2.0.BUILD-SNAPSHOT.jar
12-Jul-2019 09:04:59 [INFO]
12-Jul-2019 09:04:59 [INFO] --- maven-javadoc-plugin:3.0.1:jar (attach-javadocs) @ spring-cloud-dataflow-registry ---
12-Jul-2019 09:05:00 [INFO] Building jar: /opt/bamboo-home/xml-data/build-dir/SCD-BMASTER-JOB1/spring-cloud-dataflow-registry/target/spring-cloud-dataflow-registry-2.2.0.BUILD-SNAPSHOT-javadoc.jar
12-Jul-2019 09:05:00 [INFO]
12-Jul-2019 09:05:00 [INFO] --- maven-javadoc-plugin:3.0.1:jar (javadoc) @ spring-cloud-dataflow-registry ---
12-Jul-2019 09:05:01 [INFO] Building jar: /opt/bamboo-home/xml-data/build-dir/SCD-BMASTER-JOB1/spring-cloud-dataflow-registry/target/spring-cloud-dataflow-registry-2.2.0.BUILD-SNAPSHOT-javadoc.jar
12-Jul-2019 09:05:01 [INFO]
12-Jul-2019 09:05:01 [INFO] >>> maven-source-plugin:3.0.1:jar (attach-sources) > generate-sources @ spring-cloud-dataflow-registry >>>
12-Jul-2019 09:05:01 [INFO]
12-Jul-2019 09:05:01 [INFO] --- maven-checkstyle-plugin:3.0.0:check (checkstyle-validation) @ spring-cloud-dataflow-registry ---
12-Jul-2019 09:05:01 [INFO] Starting audit...
12-Jul-2019 09:05:01 Audit done.
12-Jul-2019 09:05:01 [INFO]
12-Jul-2019 09:05:01 [INFO] --- jacoco-maven-plugin:0.7.9:prepare-agent (agent) @ spring-cloud-dataflow-registry ---
12-Jul-2019 09:05:01 [INFO] argLine set to -javaagent:/home/bamboo/.m2/repository/org/jacoco/org.jacoco.agent/0.7.9/org.jacoco.agent-0.7.9-runtime.jar=destfile=/opt/bamboo-home/xml-data/build-dir/SCD-BMASTER-JOB1/spring-cloud-dataflow-registry/target/jacoco.exec
12-Jul-2019 09:05:01 [INFO]
12-Jul-2019 09:05:01 [INFO] <<< maven-source-plugin:3.0.1:jar (attach-sources) < generate-sources @ spring-cloud-dataflow-registry <<<
12-Jul-2019 09:05:01 [INFO]
12-Jul-2019 09:05:01 [INFO]
12-Jul-2019 09:05:01 [INFO] --- maven-source-plugin:3.0.1:jar (attach-sources) @ spring-cloud-dataflow-registry ---
12-Jul-2019 09:05:01 [INFO] Building jar: /opt/bamboo-home/xml-data/build-dir/SCD-BMASTER-JOB1/spring-cloud-dataflow-registry/target/spring-cloud-dataflow-registry-2.2.0.BUILD-SNAPSHOT-sources.jar
12-Jul-2019 09:05:01 [INFO]
12-Jul-2019 09:05:01 [INFO] --- maven-install-plugin:2.4:install (default-install) @ spring-cloud-dataflow-registry ---
12-Jul-2019 09:05:01 [INFO] Installing /opt/bamboo-home/xml-data/build-dir/SCD-BMASTER-JOB1/spring-cloud-dataflow-registry/target/spring-cloud-dataflow-registry-2.2.0.BUILD-SNAPSHOT.jar to /home/bamboo/.m2/repository/org/springframework/cloud/spring-cloud-dataflow-registry/2.2.0.BUILD-SNAPSHOT/spring-cloud-dataflow-registry-2.2.0.BUILD-SNAPSHOT.jar
12-Jul-2019 09:05:01 [INFO] Installing /opt/bamboo-home/xml-data/build-dir/SCD-BMASTER-JOB1/spring-cloud-dataflow-registry/pom.xml to /home/bamboo/.m2/repository/org/springframework/cloud/spring-cloud-dataflow-registry/2.2.0.BUILD-SNAPSHOT/spring-cloud-dataflow-registry-2.2.0.BUILD-SNAPSHOT.pom
12-Jul-2019 09:05:01 [INFO] Installing /opt/bamboo-home/xml-data/build-dir/SCD-BMASTER-JOB1/spring-cloud-dataflow-registry/target/spring-cloud-dataflow-registry-2.2.0.BUILD-SNAPSHOT-javadoc.jar to /home/bamboo/.m2/repository/org/springframework/cloud/spring-cloud-dataflow-registry/2.2.0.BUILD-SNAPSHOT/spring-cloud-dataflow-registry-2.2.0.BUILD-SNAPSHOT-javadoc.jar
12-Jul-2019 09:05:01 [INFO] Installing /opt/bamboo-home/xml-data/build-dir/SCD-BMASTER-JOB1/spring-cloud-dataflow-registry/target/spring-cloud-dataflow-registry-2.2.0.BUILD-SNAPSHOT-javadoc.jar to /home/bamboo/.m2/repository/org/springframework/cloud/spring-cloud-dataflow-registry/2.2.0.BUILD-SNAPSHOT/spring-cloud-dataflow-registry-2.2.0.BUILD-SNAPSHOT-javadoc.jar
12-Jul-2019 09:05:01 [INFO] Installing /opt/bamboo-home/xml-data/build-dir/SCD-BMASTER-JOB1/spring-cloud-dataflow-registry/target/spring-cloud-dataflow-registry-2.2.0.BUILD-SNAPSHOT-sources.jar to /home/bamboo/.m2/repository/org/springframework/cloud/spring-cloud-dataflow-registry/2.2.0.BUILD-SNAPSHOT/spring-cloud-dataflow-registry-2.2.0.BUILD-SNAPSHOT-sources.jar
12-Jul-2019 09:05:02 [INFO]
12-Jul-2019 09:05:02 [INFO] -----< org.springframework.cloud:spring-cloud-dataflow-completion >-----
12-Jul-2019 09:05:02 [INFO] Building spring-cloud-dataflow-completion 2.2.0.BUILD-SNAPSHOT    [8/20]
12-Jul-2019 09:05:02 [INFO] --------------------------------[ jar ]---------------------------------
12-Jul-2019 09:05:02 [INFO]
12-Jul-2019 09:05:02 [INFO] --- maven-clean-plugin:2.5:clean (default-clean) @ spring-cloud-dataflow-completion ---
12-Jul-2019 09:05:02 [INFO]
12-Jul-2019 09:05:02 [INFO] --- maven-checkstyle-plugin:3.0.0:check (checkstyle-validation) @ spring-cloud-dataflow-completion ---
12-Jul-2019 09:05:02 [INFO] Starting audit...
12-Jul-2019 09:05:02 Audit done.
12-Jul-2019 09:05:02 [INFO]
12-Jul-2019 09:05:02 [INFO] --- jacoco-maven-plugin:0.7.9:prepare-agent (agent) @ spring-cloud-dataflow-completion ---
12-Jul-2019 09:05:02 [INFO] argLine set to -javaagent:/home/bamboo/.m2/repository/org/jacoco/org.jacoco.agent/0.7.9/org.jacoco.agent-0.7.9-runtime.jar=destfile=/opt/bamboo-home/xml-data/build-dir/SCD-BMASTER-JOB1/spring-cloud-dataflow-completion/target/jacoco.exec
12-Jul-2019 09:05:02 [INFO]
12-Jul-2019 09:05:02 [INFO] --- maven-resources-plugin:3.1.0:resources (default-resources) @ spring-cloud-dataflow-completion ---
12-Jul-2019 09:05:02 [INFO] Using 'UTF-8' encoding to copy filtered resources.
12-Jul-2019 09:05:02 [INFO] skip non existing resourceDirectory /opt/bamboo-home/xml-data/build-dir/SCD-BMASTER-JOB1/spring-cloud-dataflow-completion/src/main/resources
12-Jul-2019 09:05:02 [INFO] skip non existing resourceDirectory /opt/bamboo-home/xml-data/build-dir/SCD-BMASTER-JOB1/spring-cloud-dataflow-completion/src/main/resources
12-Jul-2019 09:05:02 [INFO]
12-Jul-2019 09:05:02 [INFO] --- maven-compiler-plugin:3.8.0:compile (default-compile) @ spring-cloud-dataflow-completion ---
12-Jul-2019 09:05:02 [INFO] Changes detected - recompiling the module!
12-Jul-2019 09:05:02 [INFO] Compiling 36 source files to /opt/bamboo-home/xml-data/build-dir/SCD-BMASTER-JOB1/spring-cloud-dataflow-completion/target/classes
12-Jul-2019 09:05:02 [INFO]
12-Jul-2019 09:05:02 [INFO] --- maven-resources-plugin:3.1.0:testResources (default-testResources) @ spring-cloud-dataflow-completion ---
12-Jul-2019 09:05:02 [INFO] Using 'UTF-8' encoding to copy filtered resources.
12-Jul-2019 09:05:02 [INFO] Copying 17 resources
12-Jul-2019 09:05:02 [INFO]
12-Jul-2019 09:05:02 [INFO] --- maven-compiler-plugin:3.8.0:testCompile (default-testCompile) @ spring-cloud-dataflow-completion ---
12-Jul-2019 09:05:02 [INFO] Changes detected - recompiling the module!
12-Jul-2019 09:05:02 [INFO] Compiling 7 source files to /opt/bamboo-home/xml-data/build-dir/SCD-BMASTER-JOB1/spring-cloud-dataflow-completion/target/test-classes
12-Jul-2019 09:05:02 [INFO]
12-Jul-2019 09:05:02 [INFO] --- maven-surefire-plugin:2.22.0:test (default-test) @ spring-cloud-dataflow-completion ---
12-Jul-2019 09:05:02 [INFO]
12-Jul-2019 09:05:02 [INFO] -------------------------------------------------------
12-Jul-2019 09:05:02 [INFO]  T E S T S
12-Jul-2019 09:05:02 [INFO] -------------------------------------------------------
12-Jul-2019 09:05:03 [INFO] Running org.springframework.cloud.dataflow.completion.BootVersionsCompletionProviderTests
12-Jul-2019 09:05:03 09:05:03.232 [main] DEBUG org.springframework.test.context.junit4.SpringJUnit4ClassRunner - SpringJUnit4ClassRunner constructor called with [class org.springframework.cloud.dataflow.completion.BootVersionsCompletionProviderTests]
12-Jul-2019 09:05:03 09:05:03.240 [main] DEBUG org.springframework.test.context.BootstrapUtils - Instantiating CacheAwareContextLoaderDelegate from class [org.springframework.test.context.cache.DefaultCacheAwareContextLoaderDelegate]
12-Jul-2019 09:05:03 09:05:03.252 [main] DEBUG org.springframework.test.context.BootstrapUtils - Instantiating BootstrapContext using constructor [public org.springframework.test.context.support.DefaultBootstrapContext(java.lang.Class,org.springframework.test.context.CacheAwareContextLoaderDelegate)]
12-Jul-2019 09:05:03 09:05:03.281 [main] DEBUG org.springframework.test.context.BootstrapUtils - Instantiating TestContextBootstrapper for test class [org.springframework.cloud.dataflow.completion.BootVersionsCompletionProviderTests] from class [org.springframework.boot.test.context.SpringBootTestContextBootstrapper]
12-Jul-2019 09:05:03 09:05:03.298 [main] INFO org.springframework.boot.test.context.SpringBootTestContextBootstrapper - Neither @ContextConfiguration nor @ContextHierarchy found for test class [org.springframework.cloud.dataflow.completion.BootVersionsCompletionProviderTests], using SpringBootContextLoader
12-Jul-2019 09:05:03 09:05:03.303 [main] DEBUG org.springframework.test.context.support.AbstractContextLoader - Did not detect default resource location for test class [org.springframework.cloud.dataflow.completion.BootVersionsCompletionProviderTests]: class path resource [org/springframework/cloud/dataflow/completion/BootVersionsCompletionProviderTests-context.xml] does not exist
12-Jul-2019 09:05:03 09:05:03.304 [main] DEBUG org.springframework.test.context.support.AbstractContextLoader - Did not detect default resource location for test class [org.springframework.cloud.dataflow.completion.BootVersionsCompletionProviderTests]: class path resource [org/springframework/cloud/dataflow/completion/BootVersionsCompletionProviderTestsContext.groovy] does not exist
12-Jul-2019 09:05:03 09:05:03.305 [main] INFO org.springframework.test.context.support.AbstractContextLoader - Could not detect default resource locations for test class [org.springframework.cloud.dataflow.completion.BootVersionsCompletionProviderTests]: no resource found for suffixes {-context.xml, Context.groovy}.
12-Jul-2019 09:05:03 09:05:03.354 [main] DEBUG org.springframework.test.context.support.ActiveProfilesUtils - Could not find an 'annotation declaring class' for annotation type [org.springframework.test.context.ActiveProfiles] and class [org.springframework.cloud.dataflow.completion.BootVersionsCompletionProviderTests]
12-Jul-2019 09:05:03 09:05:03.492 [main] DEBUG org.springframework.boot.test.context.SpringBootTestContextBootstrapper - @TestExecutionListeners is not present for class [org.springframework.cloud.dataflow.completion.BootVersionsCompletionProviderTests]: using defaults.
12-Jul-2019 09:05:03 09:05:03.493 [main] INFO org.springframework.boot.test.context.SpringBootTestContextBootstrapper - Loaded default TestExecutionListener class names from location [META-INF/spring.factories]: [org.springframework.boot.test.mock.mockito.MockitoTestExecutionListener, org.springframework.boot.test.mock.mockito.ResetMocksTestExecutionListener, org.springframework.boot.test.autoconfigure.restdocs.RestDocsTestExecutionListener, org.springframework.boot.test.autoconfigure.web.client.MockRestServiceServerResetTestExecutionListener, org.springframework.boot.test.autoconfigure.web.servlet.MockMvcPrintOnlyOnFailureTestExecutionListener, org.springframework.boot.test.autoconfigure.web.servlet.WebDriverTestExecutionListener, org.springframework.test.context.web.ServletTestExecutionListener, org.springframework.test.context.support.DirtiesContextBeforeModesTestExecutionListener, org.springframework.test.context.support.DependencyInjectionTestExecutionListener, org.springframework.test.context.support.DirtiesContextTestExecutionListener, org.springframework.test.context.transaction.TransactionalTestExecutionListener, org.springframework.test.context.jdbc.SqlScriptsTestExecutionListener]
12-Jul-2019 09:05:03 09:05:03.514 [main] DEBUG org.springframework.boot.test.context.SpringBootTestContextBootstrapper - Skipping candidate TestExecutionListener [org.springframework.test.context.web.ServletTestExecutionListener] due to a missing dependency. Specify custom listener classes or make the default listener classes and their required dependencies available. Offending class: [javax/servlet/ServletContext]
12-Jul-2019 09:05:03 09:05:03.524 [main] INFO org.springframework.boot.test.context.SpringBootTestContextBootstrapper - Using TestExecutionListeners: [org.springframework.test.context.support.DirtiesContextBeforeModesTestExecutionListener@228bda54, org.springframework.boot.test.mock.mockito.MockitoTestExecutionListener@75b6dd5b, org.springframework.boot.test.autoconfigure.SpringBootDependencyInjectionTestExecutionListener@b3e86d5, org.springframework.test.context.support.DirtiesContextTestExecutionListener@72b43104, org.springframework.test.context.transaction.TransactionalTestExecutionListener@e111c7c, org.springframework.test.context.jdbc.SqlScriptsTestExecutionListener@4d0e54e0, org.springframework.boot.test.mock.mockito.ResetMocksTestExecutionListener@32f96bba, org.springframework.boot.test.autoconfigure.restdocs.RestDocsTestExecutionListener@611640f0, org.springframework.boot.test.autoconfigure.web.client.MockRestServiceServerResetTestExecutionListener@67e25252, org.springframework.boot.test.autoconfigure.web.servlet.MockMvcPrintOnlyOnFailureTestExecutionListener@58f4b31a, org.springframework.boot.test.autoconfigure.web.servlet.WebDriverTestExecutionListener@21a9a705]
12-Jul-2019 09:05:03 09:05:03.528 [main] DEBUG org.springframework.test.annotation.ProfileValueUtils - Retrieved @ProfileValueSourceConfiguration [null] for test class [org.springframework.cloud.dataflow.completion.BootVersionsCompletionProviderTests]
12-Jul-2019 09:05:03 09:05:03.529 [main] DEBUG org.springframework.test.annotation.ProfileValueUtils - Retrieved ProfileValueSource type [class org.springframework.test.annotation.SystemProfileValueSource] for class [org.springframework.cloud.dataflow.completion.BootVersionsCompletionProviderTests]
12-Jul-2019 09:05:03 09:05:03.531 [main] DEBUG org.springframework.test.annotation.ProfileValueUtils - Retrieved @ProfileValueSourceConfiguration [null] for test class [org.springframework.cloud.dataflow.completion.BootVersionsCompletionProviderTests]
12-Jul-2019 09:05:03 09:05:03.531 [main] DEBUG org.springframework.test.annotation.ProfileValueUtils - Retrieved ProfileValueSource type [class org.springframework.test.annotation.SystemProfileValueSource] for class [org.springframework.cloud.dataflow.completion.BootVersionsCompletionProviderTests]
12-Jul-2019 09:05:03 09:05:03.532 [main] DEBUG org.springframework.test.annotation.ProfileValueUtils - Retrieved @ProfileValueSourceConfiguration [null] for test class [org.springframework.cloud.dataflow.completion.BootVersionsCompletionProviderTests]
12-Jul-2019 09:05:03 09:05:03.533 [main] DEBUG org.springframework.test.annotation.ProfileValueUtils - Retrieved ProfileValueSource type [class org.springframework.test.annotation.SystemProfileValueSource] for class [org.springframework.cloud.dataflow.completion.BootVersionsCompletionProviderTests]
12-Jul-2019 09:05:03 09:05:03.538 [main] DEBUG org.springframework.test.context.support.AbstractDirtiesContextTestExecutionListener - Before test class: context [DefaultTestContext@4c6b4ed7 testClass = BootVersionsCompletionProviderTests, testInstance = [null], testMethod = [null], testException = [null], mergedContextConfiguration = [MergedContextConfiguration@21263314 testClass = BootVersionsCompletionProviderTests, locations = '{}', classes = '{class org.springframework.cloud.dataflow.completion.CompletionConfiguration, class org.springframework.cloud.dataflow.completion.BootVersionsCompletionProviderTests$Mocks, class org.springframework.cloud.dataflow.completion.CompletionConfiguration, class org.springframework.cloud.dataflow.completion.BootVersionsCompletionProviderTests$Mocks}', contextInitializerClasses = '[]', activeProfiles = '{}', propertySourceLocations = '{}', propertySourceProperties = '{spring.main.allow-bean-definition-overriding=true, org.springframework.boot.test.context.SpringBootTestContextBootstrapper=true}', contextCustomizers = set[org.springframework.boot.test.context.filter.ExcludeFilterContextCustomizer@1436a7ab, org.springframework.boot.test.json.DuplicateJsonObjectContextCustomizerFactory$DuplicateJsonObjectContextCustomizer@1a35993f, org.springframework.boot.test.mock.mockito.MockitoContextCustomizer@0, org.springframework.boot.test.web.client.TestRestTemplateContextCustomizer@7bbbb6a8, org.springframework.boot.test.autoconfigure.properties.PropertyMappingContextCustomizer@0, org.springframework.boot.test.autoconfigure.web.servlet.WebDriverContextCustomizerFactory$Customizer@17740dae], contextLoader = 'org.springframework.boot.test.context.SpringBootContextLoader', parent = [null]], attributes = map[[empty]]], class annotated with @DirtiesContext [false] with mode [null].
12-Jul-2019 09:05:03 09:05:03.540 [main] DEBUG org.springframework.test.annotation.ProfileValueUtils - Retrieved @ProfileValueSourceConfiguration [null] for test class [org.springframework.cloud.dataflow.completion.BootVersionsCompletionProviderTests]
12-Jul-2019 09:05:03 09:05:03.541 [main] DEBUG org.springframework.test.annotation.ProfileValueUtils - Retrieved ProfileValueSource type [class org.springframework.test.annotation.SystemProfileValueSource] for class [org.springframework.cloud.dataflow.completion.BootVersionsCompletionProviderTests]
12-Jul-2019 09:05:03 09:05:03.547 [main] DEBUG org.springframework.test.context.support.DependencyInjectionTestExecutionListener - Performing dependency injection for test context [[DefaultTestContext@4c6b4ed7 testClass = BootVersionsCompletionProviderTests, testInstance = org.springframework.cloud.dataflow.completion.BootVersionsCompletionProviderTests@6cd15072, testMethod = [null], testException = [null], mergedContextConfiguration = [MergedContextConfiguration@21263314 testClass = BootVersionsCompletionProviderTests, locations = '{}', classes = '{class org.springframework.cloud.dataflow.completion.CompletionConfiguration, class org.springframework.cloud.dataflow.completion.BootVersionsCompletionProviderTests$Mocks, class org.springframework.cloud.dataflow.completion.CompletionConfiguration, class org.springframework.cloud.dataflow.completion.BootVersionsCompletionProviderTests$Mocks}', contextInitializerClasses = '[]', activeProfiles = '{}', propertySourceLocations = '{}', propertySourceProperties = '{spring.main.allow-bean-definition-overriding=true, org.springframework.boot.test.context.SpringBootTestContextBootstrapper=true}', contextCustomizers = set[org.springframework.boot.test.context.filter.ExcludeFilterContextCustomizer@1436a7ab, org.springframework.boot.test.json.DuplicateJsonObjectContextCustomizerFactory$DuplicateJsonObjectContextCustomizer@1a35993f, org.springframework.boot.test.mock.mockito.MockitoContextCustomizer@0, org.springframework.boot.test.web.client.TestRestTemplateContextCustomizer@7bbbb6a8, org.springframework.boot.test.autoconfigure.properties.PropertyMappingContextCustomizer@0, org.springframework.boot.test.autoconfigure.web.servlet.WebDriverContextCustomizerFactory$Customizer@17740dae], contextLoader = 'org.springframework.boot.test.context.SpringBootContextLoader', parent = [null]], attributes = map[[empty]]]].
12-Jul-2019 09:05:03 09:05:03.585 [main] DEBUG org.springframework.test.context.support.TestPropertySourceUtils - Adding inlined properties to environment: {spring.jmx.enabled=false, spring.main.allow-bean-definition-overriding=true, org.springframework.boot.test.context.SpringBootTestContextBootstrapper=true, server.port=-1}
12-Jul-2019 09:05:03
12-Jul-2019 09:05:03   .   ____          _            __ _ _
12-Jul-2019 09:05:03 /\\ / ___'_ __ _ _(_)_ __  __ _ \ \ \ \
12-Jul-2019 09:05:03 ( ( )\___ | '_ | '_| | '_ \/ _` | \ \ \ \
12-Jul-2019 09:05:03 \\/  ___)| |_)| | | | | || (_| |  ) ) ) )
12-Jul-2019 09:05:03   '  |____| .__|_| |_|_| |_\__, | / / / /
12-Jul-2019 09:05:03 =========|_|==============|___/=/_/_/_/
12-Jul-2019 09:05:03 :: Spring Boot ::        (v2.1.5.RELEASE)
12-Jul-2019 09:05:03
12-Jul-2019 09:05:03 2019-07-12 09:05:03.956  INFO 32418 --- [           main] .d.c.BootVersionsCompletionProviderTests : Starting BootVersionsCompletionProviderTests on bamboo-17 with PID 32418 (started by bamboo in /opt/bamboo-home/xml-data/build-dir/SCD-BMASTER-JOB1/spring-cloud-dataflow-completion)
12-Jul-2019 09:05:03 2019-07-12 09:05:03.958  INFO 32418 --- [           main] .d.c.BootVersionsCompletionProviderTests : No active profile set, falling back to default profiles: default
12-Jul-2019 09:05:05 2019-07-12 09:05:05.186  INFO 32418 --- [           main] .d.c.BootVersionsCompletionProviderTests : Started BootVersionsCompletionProviderTests in 1.597 seconds (JVM running for 2.638)
12-Jul-2019 09:05:05 [INFO] Tests run: 2, Failures: 0, Errors: 0, Skipped: 0, Time elapsed: 2.711 s - in org.springframework.cloud.dataflow.completion.BootVersionsCompletionProviderTests
12-Jul-2019 09:05:05 [INFO] Running org.springframework.cloud.dataflow.completion.TaskCompletionProviderTests
12-Jul-2019 09:05:05 2019-07-12 09:05:05.788  INFO 32418 --- [           main] .b.t.c.SpringBootTestContextBootstrapper : Neither @ContextConfiguration nor @ContextHierarchy found for test class [org.springframework.cloud.dataflow.completion.TaskCompletionProviderTests], using SpringBootContextLoader
12-Jul-2019 09:05:05 2019-07-12 09:05:05.789  INFO 32418 --- [           main] o.s.t.c.support.AbstractContextLoader    : Could not detect default resource locations for test class [org.springframework.cloud.dataflow.completion.TaskCompletionProviderTests]: no resource found for suffixes {-context.xml, Context.groovy}.
12-Jul-2019 09:05:05 2019-07-12 09:05:05.792  INFO 32418 --- [           main] .b.t.c.SpringBootTestContextBootstrapper : Loaded default TestExecutionListener class names from location [META-INF/spring.factories]: [org.springframework.boot.test.mock.mockito.MockitoTestExecutionListener, org.springframework.boot.test.mock.mockito.ResetMocksTestExecutionListener, org.springframework.boot.test.autoconfigure.restdocs.RestDocsTestExecutionListener, org.springframework.boot.test.autoconfigure.web.client.MockRestServiceServerResetTestExecutionListener, org.springframework.boot.test.autoconfigure.web.servlet.MockMvcPrintOnlyOnFailureTestExecutionListener, org.springframework.boot.test.autoconfigure.web.servlet.WebDriverTestExecutionListener, org.springframework.test.context.web.ServletTestExecutionListener, org.springframework.test.context.support.DirtiesContextBeforeModesTestExecutionListener, org.springframework.test.context.support.DependencyInjectionTestExecutionListener, org.springframework.test.context.support.DirtiesContextTestExecutionListener, org.springframework.test.context.transaction.TransactionalTestExecutionListener, org.springframework.test.context.jdbc.SqlScriptsTestExecutionListener]
12-Jul-2019 09:05:05 2019-07-12 09:05:05.794  INFO 32418 --- [           main] .b.t.c.SpringBootTestContextBootstrapper : Using TestExecutionListeners: [org.springframework.test.context.support.DirtiesContextBeforeModesTestExecutionListener@7d3f7e4b, org.springframework.boot.test.mock.mockito.MockitoTestExecutionListener@633a6f00, org.springframework.boot.test.autoconfigure.SpringBootDependencyInjectionTestExecutionListener@6d6d9406, org.springframework.test.context.support.DirtiesContextTestExecutionListener@7645ced6, org.springframework.test.context.transaction.TransactionalTestExecutionListener@700e3b73, org.springframework.test.context.jdbc.SqlScriptsTestExecutionListener@40fc181d, org.springframework.boot.test.mock.mockito.ResetMocksTestExecutionListener@413069a0, org.springframework.boot.test.autoconfigure.restdocs.RestDocsTestExecutionListener@19db3c2e, org.springframework.boot.test.autoconfigure.web.client.MockRestServiceServerResetTestExecutionListener@180f49c5, org.springframework.boot.test.autoconfigure.web.servlet.MockMvcPrintOnlyOnFailureTestExecutionListener@38138629, org.springframework.boot.test.autoconfigure.web.servlet.WebDriverTestExecutionListener@7a2c95e2]
12-Jul-2019 09:05:05
12-Jul-2019 09:05:05   .   ____          _            __ _ _
12-Jul-2019 09:05:05 /\\ / ___'_ __ _ _(_)_ __  __ _ \ \ \ \
12-Jul-2019 09:05:05 ( ( )\___ | '_ | '_| | '_ \/ _` | \ \ \ \
12-Jul-2019 09:05:05 \\/  ___)| |_)| | | | | || (_| |  ) ) ) )
12-Jul-2019 09:05:05   '  |____| .__|_| |_|_| |_\__, | / / / /
12-Jul-2019 09:05:05 =========|_|==============|___/=/_/_/_/
12-Jul-2019 09:05:05 :: Spring Boot ::        (v2.1.5.RELEASE)
12-Jul-2019 09:05:05
12-Jul-2019 09:05:05 2019-07-12 09:05:05.824  INFO 32418 --- [           main] o.s.c.d.c.TaskCompletionProviderTests    : Starting TaskCompletionProviderTests on bamboo-17 with PID 32418 (started by bamboo in /opt/bamboo-home/xml-data/build-dir/SCD-BMASTER-JOB1/spring-cloud-dataflow-completion)
12-Jul-2019 09:05:05 2019-07-12 09:05:05.825  INFO 32418 --- [           main] o.s.c.d.c.TaskCompletionProviderTests    : No active profile set, falling back to default profiles: default
12-Jul-2019 09:05:05 2019-07-12 09:05:05.914  INFO 32418 --- [           main] o.s.c.d.c.TaskCompletionProviderTests    : Started TaskCompletionProviderTests in 0.116 seconds (JVM running for 3.365)
12-Jul-2019 09:05:06 [INFO] Tests run: 11, Failures: 0, Errors: 0, Skipped: 0, Time elapsed: 0.405 s - in org.springframework.cloud.dataflow.completion.TaskCompletionProviderTests
12-Jul-2019 09:05:06 [INFO] Running org.springframework.cloud.dataflow.completion.StreamCompletionProviderTests
12-Jul-2019 09:05:06 2019-07-12 09:05:06.196  INFO 32418 --- [           main] .b.t.c.SpringBootTestContextBootstrapper : Neither @ContextConfiguration nor @ContextHierarchy found for test class [org.springframework.cloud.dataflow.completion.StreamCompletionProviderTests], using SpringBootContextLoader
12-Jul-2019 09:05:06 2019-07-12 09:05:06.197  INFO 32418 --- [           main] o.s.t.c.support.AbstractContextLoader    : Could not detect default resource locations for test class [org.springframework.cloud.dataflow.completion.StreamCompletionProviderTests]: no resource found for suffixes {-context.xml, Context.groovy}.
12-Jul-2019 09:05:06 2019-07-12 09:05:06.201  INFO 32418 --- [           main] .b.t.c.SpringBootTestContextBootstrapper : Loaded default TestExecutionListener class names from location [META-INF/spring.factories]: [org.springframework.boot.test.mock.mockito.MockitoTestExecutionListener, org.springframework.boot.test.mock.mockito.ResetMocksTestExecutionListener, org.springframework.boot.test.autoconfigure.restdocs.RestDocsTestExecutionListener, org.springframework.boot.test.autoconfigure.web.client.MockRestServiceServerResetTestExecutionListener, org.springframework.boot.test.autoconfigure.web.servlet.MockMvcPrintOnlyOnFailureTestExecutionListener, org.springframework.boot.test.autoconfigure.web.servlet.WebDriverTestExecutionListener, org.springframework.test.context.web.ServletTestExecutionListener, org.springframework.test.context.support.DirtiesContextBeforeModesTestExecutionListener, org.springframework.test.context.support.DependencyInjectionTestExecutionListener, org.springframework.test.context.support.DirtiesContextTestExecutionListener, org.springframework.test.context.transaction.TransactionalTestExecutionListener, org.springframework.test.context.jdbc.SqlScriptsTestExecutionListener]
12-Jul-2019 09:05:06 2019-07-12 09:05:06.203  INFO 32418 --- [           main] .b.t.c.SpringBootTestContextBootstrapper : Using TestExecutionListeners: [org.springframework.test.context.support.DirtiesContextBeforeModesTestExecutionListener@6d6f7412, org.springframework.boot.test.mock.mockito.MockitoTestExecutionListener@4c110f87, org.springframework.boot.test.autoconfigure.SpringBootDependencyInjectionTestExecutionListener@1919b5b0, org.springframework.test.context.support.DirtiesContextTestExecutionListener@60a07d77, org.springframework.test.context.transaction.TransactionalTestExecutionListener@76795a95, org.springframework.test.context.jdbc.SqlScriptsTestExecutionListener@32d00eea, org.springframework.boot.test.mock.mockito.ResetMocksTestExecutionListener@66b09935, org.springframework.boot.test.autoconfigure.restdocs.RestDocsTestExecutionListener@5981b51, org.springframework.boot.test.autoconfigure.web.client.MockRestServiceServerResetTestExecutionListener@39894485, org.springframework.boot.test.autoconfigure.web.servlet.MockMvcPrintOnlyOnFailureTestExecutionListener@b1caa00, org.springframework.boot.test.autoconfigure.web.servlet.WebDriverTestExecutionListener@6987f367]
12-Jul-2019 09:05:06 [INFO] Tests run: 18, Failures: 0, Errors: 0, Skipped: 0, Time elapsed: 0.4 s - in org.springframework.cloud.dataflow.completion.StreamCompletionProviderTests
12-Jul-2019 09:05:06 [INFO] Running org.springframework.cloud.dataflow.completion.CompletionUtilsTests
12-Jul-2019 09:05:06 [INFO] Tests run: 1, Failures: 0, Errors: 0, Skipped: 0, Time elapsed: 0.002 s - in org.springframework.cloud.dataflow.completion.CompletionUtilsTests
12-Jul-2019 09:05:06 [INFO]
12-Jul-2019 09:05:06 [INFO] Results:
12-Jul-2019 09:05:06 [INFO]
12-Jul-2019 09:05:06 [INFO] Tests run: 32, Failures: 0, Errors: 0, Skipped: 0
12-Jul-2019 09:05:06 [INFO]
12-Jul-2019 09:05:06 [INFO]
12-Jul-2019 09:05:06 [INFO] --- jacoco-maven-plugin:0.7.9:report (report) @ spring-cloud-dataflow-completion ---
12-Jul-2019 09:05:06 [INFO] Loading execution data file /opt/bamboo-home/xml-data/build-dir/SCD-BMASTER-JOB1/spring-cloud-dataflow-completion/target/jacoco.exec
12-Jul-2019 09:05:07 [INFO] Analyzed bundle 'spring-cloud-dataflow-completion' with 32 classes
12-Jul-2019 09:05:07 [INFO]
12-Jul-2019 09:05:07 [INFO] --- maven-jar-plugin:3.0.2:jar (default-jar) @ spring-cloud-dataflow-completion ---
12-Jul-2019 09:05:07 [INFO] Building jar: /opt/bamboo-home/xml-data/build-dir/SCD-BMASTER-JOB1/spring-cloud-dataflow-completion/target/spring-cloud-dataflow-completion-2.2.0.BUILD-SNAPSHOT.jar
12-Jul-2019 09:05:07 [INFO]
12-Jul-2019 09:05:07 [INFO] --- maven-javadoc-plugin:3.0.1:jar (attach-javadocs) @ spring-cloud-dataflow-completion ---
12-Jul-2019 09:05:08 [INFO] Building jar: /opt/bamboo-home/xml-data/build-dir/SCD-BMASTER-JOB1/spring-cloud-dataflow-completion/target/spring-cloud-dataflow-completion-2.2.0.BUILD-SNAPSHOT-javadoc.jar
12-Jul-2019 09:05:08 [INFO]
12-Jul-2019 09:05:08 [INFO] --- maven-javadoc-plugin:3.0.1:jar (javadoc) @ spring-cloud-dataflow-completion ---
12-Jul-2019 09:05:09 [INFO] Building jar: /opt/bamboo-home/xml-data/build-dir/SCD-BMASTER-JOB1/spring-cloud-dataflow-completion/target/spring-cloud-dataflow-completion-2.2.0.BUILD-SNAPSHOT-javadoc.jar
12-Jul-2019 09:05:09 [INFO]
12-Jul-2019 09:05:09 [INFO] >>> maven-source-plugin:3.0.1:jar (attach-sources) > generate-sources @ spring-cloud-dataflow-completion >>>
12-Jul-2019 09:05:09 [INFO]
12-Jul-2019 09:05:09 [INFO] --- maven-checkstyle-plugin:3.0.0:check (checkstyle-validation) @ spring-cloud-dataflow-completion ---
12-Jul-2019 09:05:09 [INFO] Starting audit...
12-Jul-2019 09:05:09 Audit done.
12-Jul-2019 09:05:09 [INFO]
12-Jul-2019 09:05:09 [INFO] --- jacoco-maven-plugin:0.7.9:prepare-agent (agent) @ spring-cloud-dataflow-completion ---
12-Jul-2019 09:05:09 [INFO] argLine set to -javaagent:/home/bamboo/.m2/repository/org/jacoco/org.jacoco.agent/0.7.9/org.jacoco.agent-0.7.9-runtime.jar=destfile=/opt/bamboo-home/xml-data/build-dir/SCD-BMASTER-JOB1/spring-cloud-dataflow-completion/target/jacoco.exec
12-Jul-2019 09:05:09 [INFO]
12-Jul-2019 09:05:09 [INFO] <<< maven-source-plugin:3.0.1:jar (attach-sources) < generate-sources @ spring-cloud-dataflow-completion <<<
12-Jul-2019 09:05:09 [INFO]
12-Jul-2019 09:05:09 [INFO]
12-Jul-2019 09:05:09 [INFO] --- maven-source-plugin:3.0.1:jar (attach-sources) @ spring-cloud-dataflow-completion ---
12-Jul-2019 09:05:09 [INFO] Building jar: /opt/bamboo-home/xml-data/build-dir/SCD-BMASTER-JOB1/spring-cloud-dataflow-completion/target/spring-cloud-dataflow-completion-2.2.0.BUILD-SNAPSHOT-sources.jar
12-Jul-2019 09:05:09 [INFO]
12-Jul-2019 09:05:09 [INFO] --- maven-install-plugin:2.4:install (default-install) @ spring-cloud-dataflow-completion ---
12-Jul-2019 09:05:09 [INFO] Installing /opt/bamboo-home/xml-data/build-dir/SCD-BMASTER-JOB1/spring-cloud-dataflow-completion/target/spring-cloud-dataflow-completion-2.2.0.BUILD-SNAPSHOT.jar to /home/bamboo/.m2/repository/org/springframework/cloud/spring-cloud-dataflow-completion/2.2.0.BUILD-SNAPSHOT/spring-cloud-dataflow-completion-2.2.0.BUILD-SNAPSHOT.jar
12-Jul-2019 09:05:09 [INFO] Installing /opt/bamboo-home/xml-data/build-dir/SCD-BMASTER-JOB1/spring-cloud-dataflow-completion/pom.xml to /home/bamboo/.m2/repository/org/springframework/cloud/spring-cloud-dataflow-completion/2.2.0.BUILD-SNAPSHOT/spring-cloud-dataflow-completion-2.2.0.BUILD-SNAPSHOT.pom
12-Jul-2019 09:05:09 [INFO] Installing /opt/bamboo-home/xml-data/build-dir/SCD-BMASTER-JOB1/spring-cloud-dataflow-completion/target/spring-cloud-dataflow-completion-2.2.0.BUILD-SNAPSHOT-javadoc.jar to /home/bamboo/.m2/repository/org/springframework/cloud/spring-cloud-dataflow-completion/2.2.0.BUILD-SNAPSHOT/spring-cloud-dataflow-completion-2.2.0.BUILD-SNAPSHOT-javadoc.jar
12-Jul-2019 09:05:09 [INFO] Installing /opt/bamboo-home/xml-data/build-dir/SCD-BMASTER-JOB1/spring-cloud-dataflow-completion/target/spring-cloud-dataflow-completion-2.2.0.BUILD-SNAPSHOT-javadoc.jar to /home/bamboo/.m2/repository/org/springframework/cloud/spring-cloud-dataflow-completion/2.2.0.BUILD-SNAPSHOT/spring-cloud-dataflow-completion-2.2.0.BUILD-SNAPSHOT-javadoc.jar
12-Jul-2019 09:05:09 [INFO] Installing /opt/bamboo-home/xml-data/build-dir/SCD-BMASTER-JOB1/spring-cloud-dataflow-completion/target/spring-cloud-dataflow-completion-2.2.0.BUILD-SNAPSHOT-sources.jar to /home/bamboo/.m2/repository/org/springframework/cloud/spring-cloud-dataflow-completion/2.2.0.BUILD-SNAPSHOT/spring-cloud-dataflow-completion-2.2.0.BUILD-SNAPSHOT-sources.jar
12-Jul-2019 09:05:09 [INFO]
12-Jul-2019 09:05:09 [INFO] ----< org.springframework.cloud:spring-cloud-dataflow-server-core >-----
12-Jul-2019 09:05:09 [INFO] Building spring-cloud-dataflow-server-core 2.2.0.BUILD-SNAPSHOT   [9/20]
12-Jul-2019 09:05:09 [INFO] --------------------------------[ jar ]---------------------------------
12-Jul-2019 09:05:09 [INFO] Downloading from spring-snapshots: https://repo.spring.io/libs-snapshot-local/org/springframework/cloud/spring-cloud-deployer-local/2.0.4.BUILD-SNAPSHOT/maven-metadata.xml
12-Jul-2019 09:05:09 [INFO] Downloaded from spring-snapshots: https://repo.spring.io/libs-snapshot-local/org/springframework/cloud/spring-cloud-deployer-local/2.0.4.BUILD-SNAPSHOT/maven-metadata.xml (1.3 kB at 8.1 kB/s)
12-Jul-2019 09:05:09 [INFO] Downloading from spring-snapshots: https://repo.spring.io/libs-snapshot-local/org/springframework/cloud/spring-cloud-deployer-local-parent/2.0.4.BUILD-SNAPSHOT/maven-metadata.xml
12-Jul-2019 09:05:10 [INFO] Downloaded from spring-snapshots: https://repo.spring.io/libs-snapshot-local/org/springframework/cloud/spring-cloud-deployer-local-parent/2.0.4.BUILD-SNAPSHOT/maven-metadata.xml (648 B at 4.3 kB/s)
12-Jul-2019 09:05:10 [INFO] Downloading from spring-snapshots: https://repo.spring.io/libs-snapshot-local/org/springframework/cloud/spring-cloud-dataflow-ui/2.2.0.BUILD-SNAPSHOT/maven-metadata.xml
12-Jul-2019 09:05:10 [INFO] Downloaded from spring-snapshots: https://repo.spring.io/libs-snapshot-local/org/springframework/cloud/spring-cloud-dataflow-ui/2.2.0.BUILD-SNAPSHOT/maven-metadata.xml (817 B at 3.8 kB/s)
12-Jul-2019 09:05:10 [INFO] Downloading from spring-snapshots: https://repo.spring.io/libs-snapshot-local/org/springframework/cloud/spring-cloud-skipper-client/2.1.0.BUILD-SNAPSHOT/maven-metadata.xml
12-Jul-2019 09:05:10 [INFO] Downloaded from spring-snapshots: https://repo.spring.io/libs-snapshot-local/org/springframework/cloud/spring-cloud-skipper-client/2.1.0.BUILD-SNAPSHOT/maven-metadata.xml (1.3 kB at 5.9 kB/s)
12-Jul-2019 09:05:10 [INFO] Downloading from spring-snapshots: https://repo.spring.io/libs-snapshot-local/org/springframework/cloud/spring-cloud-skipper-client/2.1.0.BUILD-SNAPSHOT/spring-cloud-skipper-client-2.1.0.BUILD-20190712.085227-30.pom
12-Jul-2019 09:05:10 [INFO] Downloaded from spring-snapshots: https://repo.spring.io/libs-snapshot-local/org/springframework/cloud/spring-cloud-skipper-client/2.1.0.BUILD-SNAPSHOT/spring-cloud-skipper-client-2.1.0.BUILD-20190712.085227-30.pom (1.6 kB at 7.3 kB/s)
12-Jul-2019 09:05:10 [INFO] Downloading from spring-snapshots: https://repo.spring.io/libs-snapshot-local/org/springframework/cloud/spring-cloud-skipper-client/2.1.0.BUILD-SNAPSHOT/spring-cloud-skipper-client-2.1.0.BUILD-20190712.085227-30.jar
12-Jul-2019 09:05:11 [INFO] Downloaded from spring-snapshots: https://repo.spring.io/libs-snapshot-local/org/springframework/cloud/spring-cloud-skipper-client/2.1.0.BUILD-SNAPSHOT/spring-cloud-skipper-client-2.1.0.BUILD-20190712.085227-30.jar (34 kB at 125 kB/s)
12-Jul-2019 09:05:11 [INFO]
12-Jul-2019 09:05:11 [INFO] --- maven-clean-plugin:2.5:clean (default-clean) @ spring-cloud-dataflow-server-core ---
12-Jul-2019 09:05:11 [INFO]
12-Jul-2019 09:05:11 [INFO] --- maven-checkstyle-plugin:3.0.0:check (checkstyle-validation) @ spring-cloud-dataflow-server-core ---
12-Jul-2019 09:05:11 [INFO] Starting audit...
12-Jul-2019 09:05:11 Audit done.
12-Jul-2019 09:05:11 [INFO]
12-Jul-2019 09:05:11 [INFO] --- jacoco-maven-plugin:0.7.9:prepare-agent (agent) @ spring-cloud-dataflow-server-core ---
12-Jul-2019 09:05:11 [INFO] argLine set to -javaagent:/home/bamboo/.m2/repository/org/jacoco/org.jacoco.agent/0.7.9/org.jacoco.agent-0.7.9-runtime.jar=destfile=/opt/bamboo-home/xml-data/build-dir/SCD-BMASTER-JOB1/spring-cloud-dataflow-server-core/target/jacoco.exec
12-Jul-2019 09:05:11 [INFO]
12-Jul-2019 09:05:11 [INFO] --- maven-resources-plugin:3.1.0:resources (default-resources) @ spring-cloud-dataflow-server-core ---
12-Jul-2019 09:05:11 [INFO] Using 'UTF-8' encoding to copy filtered resources.
12-Jul-2019 09:05:11 [INFO] Copying 4 resources
12-Jul-2019 09:05:11 [INFO]
12-Jul-2019 09:05:11 [INFO] --- maven-compiler-plugin:3.8.0:compile (default-compile) @ spring-cloud-dataflow-server-core ---
12-Jul-2019 09:05:11 [INFO] Changes detected - recompiling the module!
12-Jul-2019 09:05:11 [INFO] Compiling 207 source files to /opt/bamboo-home/xml-data/build-dir/SCD-BMASTER-JOB1/spring-cloud-dataflow-server-core/target/classes
12-Jul-2019 09:05:13 [INFO] /opt/bamboo-home/xml-data/build-dir/SCD-BMASTER-JOB1/spring-cloud-dataflow-server-core/src/main/java/org/springframework/cloud/dataflow/server/service/impl/TaskAppDeploymentRequestCreator.java: /opt/bamboo-home/xml-data/build-dir/SCD-BMASTER-JOB1/spring-cloud-dataflow-server-core/src/main/java/org/springframework/cloud/dataflow/server/service/impl/TaskAppDeploymentRequestCreator.java uses unchecked or unsafe operations.
12-Jul-2019 09:05:13 [INFO] /opt/bamboo-home/xml-data/build-dir/SCD-BMASTER-JOB1/spring-cloud-dataflow-server-core/src/main/java/org/springframework/cloud/dataflow/server/service/impl/TaskAppDeploymentRequestCreator.java: Recompile with -Xlint:unchecked for details.
12-Jul-2019 09:05:13 [INFO] -------------------------------------------------------------
12-Jul-2019 09:05:13 [ERROR] COMPILATION ERROR :
12-Jul-2019 09:05:13 [INFO] -------------------------------------------------------------
12-Jul-2019 09:05:13 [ERROR] /opt/bamboo-home/xml-data/build-dir/SCD-BMASTER-JOB1/spring-cloud-dataflow-server-core/src/main/java/org/springframework/cloud/dataflow/server/stream/SkipperStreamDeployer.java:[493,49] incompatible types: org.springframework.cloud.skipper.domain.LogInfo cannot be converted to java.lang.String
12-Jul-2019 09:05:13 [ERROR] /opt/bamboo-home/xml-data/build-dir/SCD-BMASTER-JOB1/spring-cloud-dataflow-server-core/src/main/java/org/springframework/cloud/dataflow/server/stream/SkipperStreamDeployer.java:[498,49] incompatible types: org.springframework.cloud.skipper.domain.LogInfo cannot be converted to java.lang.String
12-Jul-2019 09:05:13 [INFO] 2 errors
12-Jul-2019 09:05:13 [INFO] -------------------------------------------------------------
12-Jul-2019 09:05:13 [INFO] ------------------------------------------------------------------------
12-Jul-2019 09:05:13 [INFO] Reactor Summary:
12-Jul-2019 09:05:13 [INFO]
12-Jul-2019 09:05:13 [INFO] spring-cloud-dataflow-parent 2.2.0.BUILD-SNAPSHOT .. SUCCESS [  1.418 s]
12-Jul-2019 09:05:13 [INFO] spring-cloud-dataflow-configuration-metadata ....... SUCCESS [  4.312 s]
12-Jul-2019 09:05:13 [INFO] spring-cloud-dataflow-core-dsl ..................... SUCCESS [  4.499 s]
12-Jul-2019 09:05:13 [INFO] spring-cloud-dataflow-core ......................... SUCCESS [  3.874 s]
12-Jul-2019 09:05:13 [INFO] spring-cloud-dataflow-rest-resource ................ SUCCESS [  7.019 s]
12-Jul-2019 09:05:13 [INFO] spring-cloud-dataflow-audit ........................ SUCCESS [  4.453 s]
12-Jul-2019 09:05:13 [INFO] spring-cloud-dataflow-registry ..................... SUCCESS [  5.094 s]
12-Jul-2019 09:05:13 [INFO] spring-cloud-dataflow-completion ................... SUCCESS [  7.254 s]
12-Jul-2019 09:05:13 [INFO] spring-cloud-dataflow-server-core .................. FAILURE [  3.347 s]
12-Jul-2019 09:05:13 [INFO] spring-cloud-dataflow-platform-kubernetes .......... SKIPPED
12-Jul-2019 09:05:13 [INFO] spring-cloud-dataflow-platform-cloudfoundry ........ SKIPPED
12-Jul-2019 09:05:13 [INFO] spring-cloud-dataflow-autoconfigure ................ SKIPPED
12-Jul-2019 09:05:13 [INFO] spring-cloud-starter-dataflow-server ............... SKIPPED
12-Jul-2019 09:05:13 [INFO] spring-cloud-dataflow-rest-client .................. SKIPPED
12-Jul-2019 09:05:13 [INFO] Spring Cloud Data Flow Server ...................... SKIPPED
12-Jul-2019 09:05:13 [INFO] spring-cloud-dataflow-shell-core ................... SKIPPED
12-Jul-2019 09:05:13 [INFO] spring-cloud-dataflow-shell ........................ SKIPPED
12-Jul-2019 09:05:13 [INFO] Spring Cloud Data Flow Docs for Classic mode ....... SKIPPED
12-Jul-2019 09:05:13 [INFO] Spring Cloud Data Flow Docs ........................ SKIPPED
12-Jul-2019 09:05:13 [INFO] spring-cloud-dataflow-dependencies 2.2.0.BUILD-SNAPSHOT SKIPPED
12-Jul-2019 09:05:13 [INFO] ------------------------------------------------------------------------
12-Jul-2019 09:05:13 [INFO] BUILD FAILURE
12-Jul-2019 09:05:13 [INFO] ------------------------------------------------------------------------
12-Jul-2019 09:05:13 [INFO] Total time: 44.571 s
12-Jul-2019 09:05:13 [INFO] Finished at: 2019-07-12T09:05:13Z
12-Jul-2019 09:05:13 [INFO] ------------------------------------------------------------------------
12-Jul-2019 09:05:13 [ERROR] Failed to execute goal org.apache.maven.plugins:maven-compiler-plugin:3.8.0:compile (default-compile) on project spring-cloud-dataflow-server-core: Compilation failure: Compilation failure:
12-Jul-2019 09:05:13 [ERROR] /opt/bamboo-home/xml-data/build-dir/SCD-BMASTER-JOB1/spring-cloud-dataflow-server-core/src/main/java/org/springframework/cloud/dataflow/server/stream/SkipperStreamDeployer.java:[493,49] incompatible types: org.springframework.cloud.skipper.domain.LogInfo cannot be converted to java.lang.String
12-Jul-2019 09:05:13 [ERROR] /opt/bamboo-home/xml-data/build-dir/SCD-BMASTER-JOB1/spring-cloud-dataflow-server-core/src/main/java/org/springframework/cloud/dataflow/server/stream/SkipperStreamDeployer.java:[498,49] incompatible types: org.springframework.cloud.skipper.domain.LogInfo cannot be converted to java.lang.String
12-Jul-2019 09:05:13 [ERROR] -> [Help 1]
12-Jul-2019 09:05:13 [ERROR]
12-Jul-2019 09:05:13 [ERROR] To see the full stack trace of the errors, re-run Maven with the -e switch.
12-Jul-2019 09:05:13 [ERROR] Re-run Maven using the -X switch to enable full debug logging.
12-Jul-2019 09:05:13 [ERROR]
12-Jul-2019 09:05:13 [ERROR] For more information about the errors and possible solutions, please read the following articles:
12-Jul-2019 09:05:13 [ERROR] [Help 1] http://cwiki.apache.org/confluence/display/MAVEN/MojoFailureException
12-Jul-2019 09:05:13 [ERROR]
12-Jul-2019 09:05:13 [ERROR] After correcting the problems, you can resume the build with the command
12-Jul-2019 09:05:13 [ERROR]   mvn <goals> -rf :spring-cloud-dataflow-server-core
12-Jul-2019 09:05:13
12-Jul-2019 09:05:13 Failing task since return code of [/opt/jdk-8/bin/java -cp /opt/maven-3.5/boot/plexus-classworlds-2.5.2.jar -Dclassworlds.conf=/tmp/artifactoryM28664493094346058798conf -DbuildInfoConfig.propertiesFile=/tmp/buildInfo2633639621996894453.properties -Xmx2048m -XX:MaxPermSize=1024m -Dmaven.home=/opt/maven-3.5 -Dmaven.multiModuleProjectDirectory=/opt/bamboo-home/xml-data/build-dir/SCD-BMASTER-JOB1 org.codehaus.plexus.classworlds.launcher.Launcher -s .settings.xml clean install -Pfull --batch-mode -U -Dartifactory.publish.password=********] was 1 while expected 0
12-Jul-2019 09:05:13 Parsing test results under /opt/bamboo-home/xml-data/build-dir/SCD-BMASTER-JOB1...
12-Jul-2019 09:05:13 Finished task 'Build and publish Spring Cloud Data' with result: Failed
12-Jul-2019 09:05:13 Running post build plugin 'Docker Container Cleanup'
12-Jul-2019 09:05:13 Running post build plugin 'NCover Results Collector'
12-Jul-2019 09:05:13 Running post build plugin 'Artifactory Release Management Staging'
12-Jul-2019 09:05:13 Running post build plugin 'Artifactory Build Info Copier'
12-Jul-2019 09:05:13 Running post build plugin 'Artifactory Gradle Properties Info Copier'
12-Jul-2019 09:05:13 Running post build plugin 'Clover Results Collector'
12-Jul-2019 09:05:13 Running post build plugin 'npm Cache Cleanup'
12-Jul-2019 09:05:13 Running post build plugin 'Artifact Copier'
12-Jul-2019 09:05:13 Publishing an artifact: scdf-server
12-Jul-2019 09:05:13 Unable to publish artifact [scdf-server]: the source directory /opt/bamboo-home/xml-data/build-dir/SCD-BMASTER-JOB1/spring-cloud-dataflow-server/target does not exist.
12-Jul-2019 09:05:13 The artifact hasn't been successfully published after 410.5 μs
12-Jul-2019 09:05:13 Publishing an artifact: Test Results
12-Jul-2019 09:05:13 Finished publishing of artifact Non required shared artifact: [Test Results], pattern: [**/target/surefire-reports/**/*.*] in 129.7 ms
12-Jul-2019 09:05:13 Successfully removed working directory at '/opt/bamboo-home/xml-data/build-dir/SCD-BMASTER-JOB1'
12-Jul-2019 09:05:13 Finalising the build...
12-Jul-2019 09:05:13 Stopping timer.
12-Jul-2019 09:05:13 Build SCD-BMASTER-JOB1-3048 completed.
12-Jul-2019 09:05:13 Running on server: post build plugin 'NCover Results Collector'
12-Jul-2019 09:05:13 Running on server: post build plugin 'Build Hanging Detection Configuration'
12-Jul-2019 09:05:13 Running on server: post build plugin 'Clover Delta Calculator'
12-Jul-2019 09:05:13 Running on server: post build plugin 'Maven Dependencies Postprocessor'
12-Jul-2019 09:05:13 All post build plugins have finished
12-Jul-2019 09:05:13 Generating build results summary...
12-Jul-2019 09:05:13 Saving build results to disk...
12-Jul-2019 09:05:13 Logging substituted variables...
12-Jul-2019 09:05:13 Indexing build results...
12-Jul-2019 09:05:13 Finished building SCD-BMASTER-JOB1-3048.