Build Spring Cloud Data Flow

Build: #3478 failed

Job: Build and install SCDF failed

Stages & jobs

  1. Default Stage

Job result summary

Completed
Duration
4 minutes
Agent
bamboo-23.af.pivotal.io
Revision
a2986830f505355f1ed049633a6712f7c78cc73d a2986830f505355f1ed049633a6712f7c78cc73d
Total tests
744
Fixed in
#3481 (Manual run by Janne Valkealahti)

Tests

  • 744 tests in total
  • 311 tests failed
  • 311 failures are new
  • 5 tests were quarantined / skipped
  • 21 seconds taken in total.
New test failures 311
Status Test Duration
Collapse Failed TabOnTapCompletionProviderTests testAppNamesAfterStreamName History
< 1 sec
java.lang.IllegalStateException: Failed to load ApplicationContext
Caused by: org.springframework.beans.factory.UnsatisfiedDependencyException: Error creating bean with name 'taskService' defined in org.springframework.cloud.dataflow.server.configuration.TestDependencies: Unsatisfied dependency expressed through method 'taskService' parameter 0; nested exception is org.springframework.beans.factory.NoSuchBeanDefinitionException: No qualifying bean of type 'org.springframework.cloud.dataflow.server.job.LauncherRepository' available: expected at least 1 bean which qualifies as autowire candidate. Dependency annotations: {}
Caused by: org.springframework.beans.factory.NoSuchBeanDefinitionException: No qualifying bean of type 'org.springframework.cloud.dataflow.server.job.LauncherRepository' available: expected at least 1 bean which qualifies as autowire candidate. Dependency annotations: {}
Collapse Failed TabOnTapCompletionProviderTests testAppNamesAfterStreamNameWithDotAfterStreamName History
< 1 sec
java.lang.IllegalStateException: Failed to load ApplicationContext
Caused by: org.springframework.beans.factory.UnsatisfiedDependencyException: Error creating bean with name 'taskService' defined in org.springframework.cloud.dataflow.server.configuration.TestDependencies: Unsatisfied dependency expressed through method 'taskService' parameter 0; nested exception is org.springframework.beans.factory.NoSuchBeanDefinitionException: No qualifying bean of type 'org.springframework.cloud.dataflow.server.job.LauncherRepository' available: expected at least 1 bean which qualifies as autowire candidate. Dependency annotations: {}
Caused by: org.springframework.beans.factory.NoSuchBeanDefinitionException: No qualifying bean of type 'org.springframework.cloud.dataflow.server.job.LauncherRepository' available: expected at least 1 bean which qualifies as autowire candidate. Dependency annotations: {}
Collapse Failed TabOnTapCompletionProviderTests testStreamNameAfterColon History
< 1 sec
java.lang.IllegalStateException: Failed to load ApplicationContext
Caused by: org.springframework.beans.factory.UnsatisfiedDependencyException: Error creating bean with name 'taskService' defined in org.springframework.cloud.dataflow.server.configuration.TestDependencies: Unsatisfied dependency expressed through method 'taskService' parameter 0; nested exception is org.springframework.beans.factory.NoSuchBeanDefinitionException: No qualifying bean of type 'org.springframework.cloud.dataflow.server.job.LauncherRepository' available: expected at least 1 bean which qualifies as autowire candidate. Dependency annotations: {}
Caused by: org.springframework.beans.factory.NoSuchBeanDefinitionException: No qualifying bean of type 'org.springframework.cloud.dataflow.server.job.LauncherRepository' available: expected at least 1 bean which qualifies as autowire candidate. Dependency annotations: {}
Collapse Failed DataFlowServerConfigurationTests testNoServer History
< 1 sec
org.springframework.beans.factory.UnsatisfiedDependencyException: Error creating bean with name 'taskService' defined in org.springframework.cloud.dataflow.server.config.features.TaskConfiguration: Unsatisfied dependency expressed through method 'taskService' parameter 0; nested exception is org.springframework.beans.factory.NoSuchBeanDefinitionException: No qualifying bean of type 'org.springframework.cloud.dataflow.server.job.LauncherRepository' available: expected at least 1 bean which qualifies as autowire candidate. Dependency annotations: {}
	at org.springframework.cloud.dataflow.server.config.DataFlowServerConfigurationTests.testNoServer(DataFlowServerConfigurationTests.java:145)
Caused by: org.springframework.beans.factory.NoSuchBeanDefinitionException: No qualifying bean of type 'org.springframework.cloud.dataflow.server.job.LauncherRepository' available: expected at least 1 bean which qualifies as autowire candidate. Dependency annotations: {}
	at org.springframework.cloud.dataflow.server.config.DataFlowServerConfigurationTests.testNoServer(DataFlowServerConfigurationTests.java:145)
Collapse Failed DataFlowServerConfigurationTests testSkipperConfig History
< 1 sec
org.springframework.beans.factory.UnsatisfiedDependencyException: Error creating bean with name 'taskService' defined in org.springframework.cloud.dataflow.server.config.features.TaskConfiguration: Unsatisfied dependency expressed through method 'taskService' parameter 0; nested exception is org.springframework.beans.factory.NoSuchBeanDefinitionException: No qualifying bean of type 'org.springframework.cloud.dataflow.server.job.LauncherRepository' available: expected at least 1 bean which qualifies as autowire candidate. Dependency annotations: {}
	at org.springframework.cloud.dataflow.server.config.DataFlowServerConfigurationTests.testSkipperConfig(DataFlowServerConfigurationTests.java:152)
Caused by: org.springframework.beans.factory.NoSuchBeanDefinitionException: No qualifying bean of type 'org.springframework.cloud.dataflow.server.job.LauncherRepository' available: expected at least 1 bean which qualifies as autowire candidate. Dependency annotations: {}
	at org.springframework.cloud.dataflow.server.config.DataFlowServerConfigurationTests.testSkipperConfig(DataFlowServerConfigurationTests.java:152)
Collapse Failed DefaultEnvironmentPostProcessorTests testDefaultsBeingContributedByServerModule History
1 sec
org.springframework.beans.factory.UnsatisfiedDependencyException: Error creating bean with name 'taskService' defined in class path resource [org/springframework/cloud/dataflow/server/config/features/TaskConfiguration.class]: Unsatisfied dependency expressed through method 'taskService' parameter 0; nested exception is org.springframework.beans.factory.NoSuchBeanDefinitionException: No qualifying bean of type 'org.springframework.cloud.dataflow.server.job.LauncherRepository' available: expected at least 1 bean which qualifies as autowire candidate. Dependency annotations: {}
	at org.springframework.cloud.dataflow.server.config.DefaultEnvironmentPostProcessorTests.testDefaultsBeingContributedByServerModule(DefaultEnvironmentPostProcessorTests.java:55)
Caused by: org.springframework.beans.factory.NoSuchBeanDefinitionException: No qualifying bean of type 'org.springframework.cloud.dataflow.server.job.LauncherRepository' available: expected at least 1 bean which qualifies as autowire candidate. Dependency annotations: {}
	at org.springframework.cloud.dataflow.server.config.DefaultEnvironmentPostProcessorTests.testDefaultsBeingContributedByServerModule(DefaultEnvironmentPostProcessorTests.java:55)
Collapse Failed DefaultEnvironmentPostProcessorTests testOverridingDefaultsWithAConfigFile History
2 secs
org.springframework.beans.factory.UnsatisfiedDependencyException: Error creating bean with name 'taskService' defined in class path resource [org/springframework/cloud/dataflow/server/config/features/TaskConfiguration.class]: Unsatisfied dependency expressed through method 'taskService' parameter 0; nested exception is org.springframework.beans.factory.NoSuchBeanDefinitionException: No qualifying bean of type 'org.springframework.cloud.dataflow.server.job.LauncherRepository' available: expected at least 1 bean which qualifies as autowire candidate. Dependency annotations: {}
	at org.springframework.cloud.dataflow.server.config.DefaultEnvironmentPostProcessorTests.testOverridingDefaultsWithAConfigFile(DefaultEnvironmentPostProcessorTests.java:65)
Caused by: org.springframework.beans.factory.NoSuchBeanDefinitionException: No qualifying bean of type 'org.springframework.cloud.dataflow.server.job.LauncherRepository' available: expected at least 1 bean which qualifies as autowire candidate. Dependency annotations: {}
	at org.springframework.cloud.dataflow.server.config.DefaultEnvironmentPostProcessorTests.testOverridingDefaultsWithAConfigFile(DefaultEnvironmentPostProcessorTests.java:65)
Collapse Failed LocalPlatformTests defaultLocalPlatform History
1 sec
org.springframework.beans.factory.UnsatisfiedDependencyException: Error creating bean with name 'taskService' defined in class path resource [org/springframework/cloud/dataflow/server/config/features/TaskConfiguration.class]: Unsatisfied dependency expressed through method 'taskService' parameter 0; nested exception is org.springframework.beans.factory.NoSuchBeanDefinitionException: No qualifying bean of type 'org.springframework.cloud.dataflow.server.job.LauncherRepository' available: expected at least 1 bean which qualifies as autowire candidate. Dependency annotations: {}
	at org.springframework.cloud.dataflow.server.config.LocalPlatformTests.defaultLocalPlatform(LocalPlatformTests.java:45)
Caused by: org.springframework.beans.factory.NoSuchBeanDefinitionException: No qualifying bean of type 'org.springframework.cloud.dataflow.server.job.LauncherRepository' available: expected at least 1 bean which qualifies as autowire candidate. Dependency annotations: {}
	at org.springframework.cloud.dataflow.server.config.LocalPlatformTests.defaultLocalPlatform(LocalPlatformTests.java:45)
Collapse Failed LocalPlatformTests multipleLocalPlatformAccounts History
5 secs
org.springframework.beans.factory.UnsatisfiedDependencyException: Error creating bean with name 'taskService' defined in class path resource [org/springframework/cloud/dataflow/server/config/features/TaskConfiguration.class]: Unsatisfied dependency expressed through method 'taskService' parameter 0; nested exception is org.springframework.beans.factory.NoSuchBeanDefinitionException: No qualifying bean of type 'org.springframework.cloud.dataflow.server.job.LauncherRepository' available: expected at least 1 bean which qualifies as autowire candidate. Dependency annotations: {}
	at org.springframework.cloud.dataflow.server.config.LocalPlatformTests.multipleLocalPlatformAccounts(LocalPlatformTests.java:64)
Caused by: org.springframework.beans.factory.NoSuchBeanDefinitionException: No qualifying bean of type 'org.springframework.cloud.dataflow.server.job.LauncherRepository' available: expected at least 1 bean which qualifies as autowire candidate. Dependency annotations: {}
	at org.springframework.cloud.dataflow.server.config.LocalPlatformTests.multipleLocalPlatformAccounts(LocalPlatformTests.java:64)
Collapse Failed AboutControllerTests testListApplications History
< 1 sec
java.lang.IllegalStateException: Failed to load ApplicationContext
Caused by: org.springframework.beans.factory.UnsatisfiedDependencyException: Error creating bean with name 'taskService' defined in org.springframework.cloud.dataflow.server.configuration.TestDependencies: Unsatisfied dependency expressed through method 'taskService' parameter 0; nested exception is org.springframework.beans.factory.NoSuchBeanDefinitionException: No qualifying bean of type 'org.springframework.cloud.dataflow.server.job.LauncherRepository' available: expected at least 1 bean which qualifies as autowire candidate. Dependency annotations: {}
Caused by: org.springframework.beans.factory.NoSuchBeanDefinitionException: No qualifying bean of type 'org.springframework.cloud.dataflow.server.job.LauncherRepository' available: expected at least 1 bean which qualifies as autowire candidate. Dependency annotations: {}
Collapse Failed AboutControllerTests$AboutTests testAbout History
< 1 sec
java.lang.IllegalStateException: Failed to load ApplicationContext
Caused by: org.springframework.beans.factory.UnsatisfiedDependencyException: Error creating bean with name 'taskService' defined in org.springframework.cloud.dataflow.server.configuration.TestDependencies: Unsatisfied dependency expressed through method 'taskService' parameter 0; nested exception is org.springframework.beans.factory.NoSuchBeanDefinitionException: No qualifying bean of type 'org.springframework.cloud.dataflow.server.job.LauncherRepository' available: expected at least 1 bean which qualifies as autowire candidate. Dependency annotations: {}
Caused by: org.springframework.beans.factory.NoSuchBeanDefinitionException: No qualifying bean of type 'org.springframework.cloud.dataflow.server.job.LauncherRepository' available: expected at least 1 bean which qualifies as autowire candidate. Dependency annotations: {}
Collapse Failed AboutControllerTests$AboutTests testAboutWithMissingSkipper History
< 1 sec
java.lang.IllegalStateException: Failed to load ApplicationContext
Caused by: org.springframework.beans.factory.UnsatisfiedDependencyException: Error creating bean with name 'taskService' defined in org.springframework.cloud.dataflow.server.configuration.TestDependencies: Unsatisfied dependency expressed through method 'taskService' parameter 0; nested exception is org.springframework.beans.factory.NoSuchBeanDefinitionException: No qualifying bean of type 'org.springframework.cloud.dataflow.server.job.LauncherRepository' available: expected at least 1 bean which qualifies as autowire candidate. Dependency annotations: {}
Caused by: org.springframework.beans.factory.NoSuchBeanDefinitionException: No qualifying bean of type 'org.springframework.cloud.dataflow.server.job.LauncherRepository' available: expected at least 1 bean which qualifies as autowire candidate. Dependency annotations: {}
Collapse Failed AboutControllerTests$ChecksumDisabledTests testChecksumDisabled History
< 1 sec
java.lang.IllegalStateException: Failed to load ApplicationContext
Caused by: org.springframework.beans.factory.UnsatisfiedDependencyException: Error creating bean with name 'taskService' defined in org.springframework.cloud.dataflow.server.configuration.TestDependencies: Unsatisfied dependency expressed through method 'taskService' parameter 0; nested exception is org.springframework.beans.factory.NoSuchBeanDefinitionException: No qualifying bean of type 'org.springframework.cloud.dataflow.server.job.LauncherRepository' available: expected at least 1 bean which qualifies as autowire candidate. Dependency annotations: {}
Caused by: org.springframework.beans.factory.NoSuchBeanDefinitionException: No qualifying bean of type 'org.springframework.cloud.dataflow.server.job.LauncherRepository' available: expected at least 1 bean which qualifies as autowire candidate. Dependency annotations: {}
Collapse Failed AboutControllerTests$ChecksumNoDefaultTests testChecksumNoDefaults History
< 1 sec
java.lang.IllegalStateException: Failed to load ApplicationContext
Caused by: org.springframework.beans.factory.UnsatisfiedDependencyException: Error creating bean with name 'taskService' defined in org.springframework.cloud.dataflow.server.configuration.TestDependencies: Unsatisfied dependency expressed through method 'taskService' parameter 0; nested exception is org.springframework.beans.factory.NoSuchBeanDefinitionException: No qualifying bean of type 'org.springframework.cloud.dataflow.server.job.LauncherRepository' available: expected at least 1 bean which qualifies as autowire candidate. Dependency annotations: {}
Caused by: org.springframework.beans.factory.NoSuchBeanDefinitionException: No qualifying bean of type 'org.springframework.cloud.dataflow.server.job.LauncherRepository' available: expected at least 1 bean which qualifies as autowire candidate. Dependency annotations: {}
Collapse Failed AboutControllerTests$GAUrlTests testGA History
< 1 sec
java.lang.IllegalStateException: Failed to load ApplicationContext
Caused by: org.springframework.beans.factory.UnsatisfiedDependencyException: Error creating bean with name 'taskService' defined in org.springframework.cloud.dataflow.server.configuration.TestDependencies: Unsatisfied dependency expressed through method 'taskService' parameter 0; nested exception is org.springframework.beans.factory.NoSuchBeanDefinitionException: No qualifying bean of type 'org.springframework.cloud.dataflow.server.job.LauncherRepository' available: expected at least 1 bean which qualifies as autowire candidate. Dependency annotations: {}
Caused by: org.springframework.beans.factory.NoSuchBeanDefinitionException: No qualifying bean of type 'org.springframework.cloud.dataflow.server.job.LauncherRepository' available: expected at least 1 bean which qualifies as autowire candidate. Dependency annotations: {}
Collapse Failed AboutControllerTests$MilestoneUrlTests testMilestone History
< 1 sec
java.lang.IllegalStateException: Failed to load ApplicationContext
Caused by: org.springframework.beans.factory.UnsatisfiedDependencyException: Error creating bean with name 'taskService' defined in org.springframework.cloud.dataflow.server.configuration.TestDependencies: Unsatisfied dependency expressed through method 'taskService' parameter 0; nested exception is org.springframework.beans.factory.NoSuchBeanDefinitionException: No qualifying bean of type 'org.springframework.cloud.dataflow.server.job.LauncherRepository' available: expected at least 1 bean which qualifies as autowire candidate. Dependency annotations: {}
Caused by: org.springframework.beans.factory.NoSuchBeanDefinitionException: No qualifying bean of type 'org.springframework.cloud.dataflow.server.job.LauncherRepository' available: expected at least 1 bean which qualifies as autowire candidate. Dependency annotations: {}
Collapse Failed AboutControllerTests$RCUrlTests testRC History
< 1 sec
java.lang.IllegalStateException: Failed to load ApplicationContext
Caused by: org.springframework.beans.factory.UnsatisfiedDependencyException: Error creating bean with name 'taskService' defined in org.springframework.cloud.dataflow.server.configuration.TestDependencies: Unsatisfied dependency expressed through method 'taskService' parameter 0; nested exception is org.springframework.beans.factory.NoSuchBeanDefinitionException: No qualifying bean of type 'org.springframework.cloud.dataflow.server.job.LauncherRepository' available: expected at least 1 bean which qualifies as autowire candidate. Dependency annotations: {}
Caused by: org.springframework.beans.factory.NoSuchBeanDefinitionException: No qualifying bean of type 'org.springframework.cloud.dataflow.server.job.LauncherRepository' available: expected at least 1 bean which qualifies as autowire candidate. Dependency annotations: {}
Collapse Failed AboutControllerTests$ReleaseUrlTests testRelease History
< 1 sec
java.lang.IllegalStateException: Failed to load ApplicationContext
Caused by: org.springframework.beans.factory.UnsatisfiedDependencyException: Error creating bean with name 'taskService' defined in org.springframework.cloud.dataflow.server.configuration.TestDependencies: Unsatisfied dependency expressed through method 'taskService' parameter 0; nested exception is org.springframework.beans.factory.NoSuchBeanDefinitionException: No qualifying bean of type 'org.springframework.cloud.dataflow.server.job.LauncherRepository' available: expected at least 1 bean which qualifies as autowire candidate. Dependency annotations: {}
Caused by: org.springframework.beans.factory.NoSuchBeanDefinitionException: No qualifying bean of type 'org.springframework.cloud.dataflow.server.job.LauncherRepository' available: expected at least 1 bean which qualifies as autowire candidate. Dependency annotations: {}
Collapse Failed AppRegistryControllerTests testAppInfoNonExistingApp History
< 1 sec
java.lang.IllegalStateException: Failed to load ApplicationContext
Caused by: org.springframework.beans.factory.UnsatisfiedDependencyException: Error creating bean with name 'taskService' defined in org.springframework.cloud.dataflow.server.configuration.TestDependencies: Unsatisfied dependency expressed through method 'taskService' parameter 0; nested exception is org.springframework.beans.factory.NoSuchBeanDefinitionException: No qualifying bean of type 'org.springframework.cloud.dataflow.server.job.LauncherRepository' available: expected at least 1 bean which qualifies as autowire candidate. Dependency annotations: {}
Caused by: org.springframework.beans.factory.NoSuchBeanDefinitionException: No qualifying bean of type 'org.springframework.cloud.dataflow.server.job.LauncherRepository' available: expected at least 1 bean which qualifies as autowire candidate. Dependency annotations: {}
Collapse Failed AppRegistryControllerTests testAppInfoNonExistingVersionedApp History
< 1 sec
java.lang.IllegalStateException: Failed to load ApplicationContext
Caused by: org.springframework.beans.factory.UnsatisfiedDependencyException: Error creating bean with name 'taskService' defined in org.springframework.cloud.dataflow.server.configuration.TestDependencies: Unsatisfied dependency expressed through method 'taskService' parameter 0; nested exception is org.springframework.beans.factory.NoSuchBeanDefinitionException: No qualifying bean of type 'org.springframework.cloud.dataflow.server.job.LauncherRepository' available: expected at least 1 bean which qualifies as autowire candidate. Dependency annotations: {}
Caused by: org.springframework.beans.factory.NoSuchBeanDefinitionException: No qualifying bean of type 'org.springframework.cloud.dataflow.server.job.LauncherRepository' available: expected at least 1 bean which qualifies as autowire candidate. Dependency annotations: {}
Collapse Failed AppRegistryControllerTests testDefaultVersion History
< 1 sec
java.lang.IllegalStateException: Failed to load ApplicationContext
Caused by: org.springframework.beans.factory.UnsatisfiedDependencyException: Error creating bean with name 'taskService' defined in org.springframework.cloud.dataflow.server.configuration.TestDependencies: Unsatisfied dependency expressed through method 'taskService' parameter 0; nested exception is org.springframework.beans.factory.NoSuchBeanDefinitionException: No qualifying bean of type 'org.springframework.cloud.dataflow.server.job.LauncherRepository' available: expected at least 1 bean which qualifies as autowire candidate. Dependency annotations: {}
Caused by: org.springframework.beans.factory.NoSuchBeanDefinitionException: No qualifying bean of type 'org.springframework.cloud.dataflow.server.job.LauncherRepository' available: expected at least 1 bean which qualifies as autowire candidate. Dependency annotations: {}
Collapse Failed AppRegistryControllerTests testFindNonExistentApp History
< 1 sec
java.lang.IllegalStateException: Failed to load ApplicationContext
Caused by: org.springframework.beans.factory.UnsatisfiedDependencyException: Error creating bean with name 'taskService' defined in org.springframework.cloud.dataflow.server.configuration.TestDependencies: Unsatisfied dependency expressed through method 'taskService' parameter 0; nested exception is org.springframework.beans.factory.NoSuchBeanDefinitionException: No qualifying bean of type 'org.springframework.cloud.dataflow.server.job.LauncherRepository' available: expected at least 1 bean which qualifies as autowire candidate. Dependency annotations: {}
Caused by: org.springframework.beans.factory.NoSuchBeanDefinitionException: No qualifying bean of type 'org.springframework.cloud.dataflow.server.job.LauncherRepository' available: expected at least 1 bean which qualifies as autowire candidate. Dependency annotations: {}
Collapse Failed AppRegistryControllerTests testListApplications History
< 1 sec
java.lang.IllegalStateException: Failed to load ApplicationContext
Caused by: org.springframework.beans.factory.UnsatisfiedDependencyException: Error creating bean with name 'taskService' defined in org.springframework.cloud.dataflow.server.configuration.TestDependencies: Unsatisfied dependency expressed through method 'taskService' parameter 0; nested exception is org.springframework.beans.factory.NoSuchBeanDefinitionException: No qualifying bean of type 'org.springframework.cloud.dataflow.server.job.LauncherRepository' available: expected at least 1 bean which qualifies as autowire candidate. Dependency annotations: {}
Caused by: org.springframework.beans.factory.NoSuchBeanDefinitionException: No qualifying bean of type 'org.springframework.cloud.dataflow.server.job.LauncherRepository' available: expected at least 1 bean which qualifies as autowire candidate. Dependency annotations: {}
Collapse Failed AppRegistryControllerTests testListApplicationsBySearch History
< 1 sec
java.lang.IllegalStateException: Failed to load ApplicationContext
Caused by: org.springframework.beans.factory.UnsatisfiedDependencyException: Error creating bean with name 'taskService' defined in org.springframework.cloud.dataflow.server.configuration.TestDependencies: Unsatisfied dependency expressed through method 'taskService' parameter 0; nested exception is org.springframework.beans.factory.NoSuchBeanDefinitionException: No qualifying bean of type 'org.springframework.cloud.dataflow.server.job.LauncherRepository' available: expected at least 1 bean which qualifies as autowire candidate. Dependency annotations: {}
Caused by: org.springframework.beans.factory.NoSuchBeanDefinitionException: No qualifying bean of type 'org.springframework.cloud.dataflow.server.job.LauncherRepository' available: expected at least 1 bean which qualifies as autowire candidate. Dependency annotations: {}
Collapse Failed AppRegistryControllerTests testListApplicationsByType History
< 1 sec
java.lang.IllegalStateException: Failed to load ApplicationContext
Caused by: org.springframework.beans.factory.UnsatisfiedDependencyException: Error creating bean with name 'taskService' defined in org.springframework.cloud.dataflow.server.configuration.TestDependencies: Unsatisfied dependency expressed through method 'taskService' parameter 0; nested exception is org.springframework.beans.factory.NoSuchBeanDefinitionException: No qualifying bean of type 'org.springframework.cloud.dataflow.server.job.LauncherRepository' available: expected at least 1 bean which qualifies as autowire candidate. Dependency annotations: {}
Caused by: org.springframework.beans.factory.NoSuchBeanDefinitionException: No qualifying bean of type 'org.springframework.cloud.dataflow.server.job.LauncherRepository' available: expected at least 1 bean which qualifies as autowire candidate. Dependency annotations: {}
Collapse Failed AppRegistryControllerTests testListApplicationsByTypeAndSearch History
< 1 sec
java.lang.IllegalStateException: Failed to load ApplicationContext
Caused by: org.springframework.beans.factory.UnsatisfiedDependencyException: Error creating bean with name 'taskService' defined in org.springframework.cloud.dataflow.server.configuration.TestDependencies: Unsatisfied dependency expressed through method 'taskService' parameter 0; nested exception is org.springframework.beans.factory.NoSuchBeanDefinitionException: No qualifying bean of type 'org.springframework.cloud.dataflow.server.job.LauncherRepository' available: expected at least 1 bean which qualifies as autowire candidate. Dependency annotations: {}
Caused by: org.springframework.beans.factory.NoSuchBeanDefinitionException: No qualifying bean of type 'org.springframework.cloud.dataflow.server.job.LauncherRepository' available: expected at least 1 bean which qualifies as autowire candidate. Dependency annotations: {}
Collapse Failed AppRegistryControllerTests testListSingleApplication History
< 1 sec
java.lang.IllegalStateException: Failed to load ApplicationContext
Caused by: org.springframework.beans.factory.UnsatisfiedDependencyException: Error creating bean with name 'taskService' defined in org.springframework.cloud.dataflow.server.configuration.TestDependencies: Unsatisfied dependency expressed through method 'taskService' parameter 0; nested exception is org.springframework.beans.factory.NoSuchBeanDefinitionException: No qualifying bean of type 'org.springframework.cloud.dataflow.server.job.LauncherRepository' available: expected at least 1 bean which qualifies as autowire candidate. Dependency annotations: {}
Caused by: org.springframework.beans.factory.NoSuchBeanDefinitionException: No qualifying bean of type 'org.springframework.cloud.dataflow.server.job.LauncherRepository' available: expected at least 1 bean which qualifies as autowire candidate. Dependency annotations: {}
Collapse Failed AppRegistryControllerTests testListSingleApplicationExhaustive History
< 1 sec
java.lang.IllegalStateException: Failed to load ApplicationContext
Caused by: org.springframework.beans.factory.UnsatisfiedDependencyException: Error creating bean with name 'taskService' defined in org.springframework.cloud.dataflow.server.configuration.TestDependencies: Unsatisfied dependency expressed through method 'taskService' parameter 0; nested exception is org.springframework.beans.factory.NoSuchBeanDefinitionException: No qualifying bean of type 'org.springframework.cloud.dataflow.server.job.LauncherRepository' available: expected at least 1 bean which qualifies as autowire candidate. Dependency annotations: {}
Caused by: org.springframework.beans.factory.NoSuchBeanDefinitionException: No qualifying bean of type 'org.springframework.cloud.dataflow.server.job.LauncherRepository' available: expected at least 1 bean which qualifies as autowire candidate. Dependency annotations: {}
Collapse Failed AppRegistryControllerTests testPagination History
< 1 sec
java.lang.IllegalStateException: Failed to load ApplicationContext
Caused by: org.springframework.beans.factory.UnsatisfiedDependencyException: Error creating bean with name 'taskService' defined in org.springframework.cloud.dataflow.server.configuration.TestDependencies: Unsatisfied dependency expressed through method 'taskService' parameter 0; nested exception is org.springframework.beans.factory.NoSuchBeanDefinitionException: No qualifying bean of type 'org.springframework.cloud.dataflow.server.job.LauncherRepository' available: expected at least 1 bean which qualifies as autowire candidate. Dependency annotations: {}
Caused by: org.springframework.beans.factory.NoSuchBeanDefinitionException: No qualifying bean of type 'org.springframework.cloud.dataflow.server.job.LauncherRepository' available: expected at least 1 bean which qualifies as autowire candidate. Dependency annotations: {}
Collapse Failed AppRegistryControllerTests testRegisterAll History
< 1 sec
java.lang.IllegalStateException: Failed to load ApplicationContext
Caused by: org.springframework.beans.factory.UnsatisfiedDependencyException: Error creating bean with name 'taskService' defined in org.springframework.cloud.dataflow.server.configuration.TestDependencies: Unsatisfied dependency expressed through method 'taskService' parameter 0; nested exception is org.springframework.beans.factory.NoSuchBeanDefinitionException: No qualifying bean of type 'org.springframework.cloud.dataflow.server.job.LauncherRepository' available: expected at least 1 bean which qualifies as autowire candidate. Dependency annotations: {}
Caused by: org.springframework.beans.factory.NoSuchBeanDefinitionException: No qualifying bean of type 'org.springframework.cloud.dataflow.server.job.LauncherRepository' available: expected at least 1 bean which qualifies as autowire candidate. Dependency annotations: {}
Collapse Failed AppRegistryControllerTests testRegisterAllFromFile History
< 1 sec
java.lang.IllegalStateException: Failed to load ApplicationContext
Caused by: org.springframework.beans.factory.UnsatisfiedDependencyException: Error creating bean with name 'taskService' defined in org.springframework.cloud.dataflow.server.configuration.TestDependencies: Unsatisfied dependency expressed through method 'taskService' parameter 0; nested exception is org.springframework.beans.factory.NoSuchBeanDefinitionException: No qualifying bean of type 'org.springframework.cloud.dataflow.server.job.LauncherRepository' available: expected at least 1 bean which qualifies as autowire candidate. Dependency annotations: {}
Caused by: org.springframework.beans.factory.NoSuchBeanDefinitionException: No qualifying bean of type 'org.springframework.cloud.dataflow.server.job.LauncherRepository' available: expected at least 1 bean which qualifies as autowire candidate. Dependency annotations: {}
Collapse Failed AppRegistryControllerTests testRegisterAllWithBadApplication History
< 1 sec
java.lang.IllegalStateException: Failed to load ApplicationContext
Caused by: org.springframework.beans.factory.UnsatisfiedDependencyException: Error creating bean with name 'taskService' defined in org.springframework.cloud.dataflow.server.configuration.TestDependencies: Unsatisfied dependency expressed through method 'taskService' parameter 0; nested exception is org.springframework.beans.factory.NoSuchBeanDefinitionException: No qualifying bean of type 'org.springframework.cloud.dataflow.server.job.LauncherRepository' available: expected at least 1 bean which qualifies as autowire candidate. Dependency annotations: {}
Caused by: org.springframework.beans.factory.NoSuchBeanDefinitionException: No qualifying bean of type 'org.springframework.cloud.dataflow.server.job.LauncherRepository' available: expected at least 1 bean which qualifies as autowire candidate. Dependency annotations: {}
Collapse Failed AppRegistryControllerTests testRegisterAllWithForce History
< 1 sec
java.lang.IllegalStateException: Failed to load ApplicationContext
Caused by: org.springframework.beans.factory.UnsatisfiedDependencyException: Error creating bean with name 'taskService' defined in org.springframework.cloud.dataflow.server.configuration.TestDependencies: Unsatisfied dependency expressed through method 'taskService' parameter 0; nested exception is org.springframework.beans.factory.NoSuchBeanDefinitionException: No qualifying bean of type 'org.springframework.cloud.dataflow.server.job.LauncherRepository' available: expected at least 1 bean which qualifies as autowire candidate. Dependency annotations: {}
Caused by: org.springframework.beans.factory.NoSuchBeanDefinitionException: No qualifying bean of type 'org.springframework.cloud.dataflow.server.job.LauncherRepository' available: expected at least 1 bean which qualifies as autowire candidate. Dependency annotations: {}
Collapse Failed AppRegistryControllerTests testRegisterAllWithoutForce History
< 1 sec
java.lang.IllegalStateException: Failed to load ApplicationContext
Caused by: org.springframework.beans.factory.UnsatisfiedDependencyException: Error creating bean with name 'taskService' defined in org.springframework.cloud.dataflow.server.configuration.TestDependencies: Unsatisfied dependency expressed through method 'taskService' parameter 0; nested exception is org.springframework.beans.factory.NoSuchBeanDefinitionException: No qualifying bean of type 'org.springframework.cloud.dataflow.server.job.LauncherRepository' available: expected at least 1 bean which qualifies as autowire candidate. Dependency annotations: {}
Caused by: org.springframework.beans.factory.NoSuchBeanDefinitionException: No qualifying bean of type 'org.springframework.cloud.dataflow.server.job.LauncherRepository' available: expected at least 1 bean which qualifies as autowire candidate. Dependency annotations: {}
Collapse Failed AppRegistryControllerTests testRegisterAndListApplications History
< 1 sec
java.lang.IllegalStateException: Failed to load ApplicationContext
Caused by: org.springframework.beans.factory.UnsatisfiedDependencyException: Error creating bean with name 'taskService' defined in org.springframework.cloud.dataflow.server.configuration.TestDependencies: Unsatisfied dependency expressed through method 'taskService' parameter 0; nested exception is org.springframework.beans.factory.NoSuchBeanDefinitionException: No qualifying bean of type 'org.springframework.cloud.dataflow.server.job.LauncherRepository' available: expected at least 1 bean which qualifies as autowire candidate. Dependency annotations: {}
Caused by: org.springframework.beans.factory.NoSuchBeanDefinitionException: No qualifying bean of type 'org.springframework.cloud.dataflow.server.job.LauncherRepository' available: expected at least 1 bean which qualifies as autowire candidate. Dependency annotations: {}
Collapse Failed AppRegistryControllerTests testRegisterApp History
< 1 sec
java.lang.IllegalStateException: Failed to load ApplicationContext
Caused by: org.springframework.beans.factory.UnsatisfiedDependencyException: Error creating bean with name 'taskService' defined in org.springframework.cloud.dataflow.server.configuration.TestDependencies: Unsatisfied dependency expressed through method 'taskService' parameter 0; nested exception is org.springframework.beans.factory.NoSuchBeanDefinitionException: No qualifying bean of type 'org.springframework.cloud.dataflow.server.job.LauncherRepository' available: expected at least 1 bean which qualifies as autowire candidate. Dependency annotations: {}
Caused by: org.springframework.beans.factory.NoSuchBeanDefinitionException: No qualifying bean of type 'org.springframework.cloud.dataflow.server.job.LauncherRepository' available: expected at least 1 bean which qualifies as autowire candidate. Dependency annotations: {}
Collapse Failed AppRegistryControllerTests testRegisterApplicationTwice History
< 1 sec
java.lang.IllegalStateException: Failed to load ApplicationContext
Caused by: org.springframework.beans.factory.UnsatisfiedDependencyException: Error creating bean with name 'taskService' defined in org.springframework.cloud.dataflow.server.configuration.TestDependencies: Unsatisfied dependency expressed through method 'taskService' parameter 0; nested exception is org.springframework.beans.factory.NoSuchBeanDefinitionException: No qualifying bean of type 'org.springframework.cloud.dataflow.server.job.LauncherRepository' available: expected at least 1 bean which qualifies as autowire candidate. Dependency annotations: {}
Caused by: org.springframework.beans.factory.NoSuchBeanDefinitionException: No qualifying bean of type 'org.springframework.cloud.dataflow.server.job.LauncherRepository' available: expected at least 1 bean which qualifies as autowire candidate. Dependency annotations: {}
Collapse Failed AppRegistryControllerTests testRegisterInvalidAppUri History
< 1 sec
java.lang.IllegalStateException: Failed to load ApplicationContext
Caused by: org.springframework.beans.factory.UnsatisfiedDependencyException: Error creating bean with name 'taskService' defined in org.springframework.cloud.dataflow.server.configuration.TestDependencies: Unsatisfied dependency expressed through method 'taskService' parameter 0; nested exception is org.springframework.beans.factory.NoSuchBeanDefinitionException: No qualifying bean of type 'org.springframework.cloud.dataflow.server.job.LauncherRepository' available: expected at least 1 bean which qualifies as autowire candidate. Dependency annotations: {}
Caused by: org.springframework.beans.factory.NoSuchBeanDefinitionException: No qualifying bean of type 'org.springframework.cloud.dataflow.server.job.LauncherRepository' available: expected at least 1 bean which qualifies as autowire candidate. Dependency annotations: {}
Collapse Failed AppRegistryControllerTests testRegisterVersionedApp History
< 1 sec
java.lang.IllegalStateException: Failed to load ApplicationContext
Caused by: org.springframework.beans.factory.UnsatisfiedDependencyException: Error creating bean with name 'taskService' defined in org.springframework.cloud.dataflow.server.configuration.TestDependencies: Unsatisfied dependency expressed through method 'taskService' parameter 0; nested exception is org.springframework.beans.factory.NoSuchBeanDefinitionException: No qualifying bean of type 'org.springframework.cloud.dataflow.server.job.LauncherRepository' available: expected at least 1 bean which qualifies as autowire candidate. Dependency annotations: {}
Caused by: org.springframework.beans.factory.NoSuchBeanDefinitionException: No qualifying bean of type 'org.springframework.cloud.dataflow.server.job.LauncherRepository' available: expected at least 1 bean which qualifies as autowire candidate. Dependency annotations: {}
Collapse Failed AppRegistryControllerTests testUnregisterAllApplications History
< 1 sec
java.lang.IllegalStateException: Failed to load ApplicationContext
Caused by: org.springframework.beans.factory.UnsatisfiedDependencyException: Error creating bean with name 'taskService' defined in org.springframework.cloud.dataflow.server.configuration.TestDependencies: Unsatisfied dependency expressed through method 'taskService' parameter 0; nested exception is org.springframework.beans.factory.NoSuchBeanDefinitionException: No qualifying bean of type 'org.springframework.cloud.dataflow.server.job.LauncherRepository' available: expected at least 1 bean which qualifies as autowire candidate. Dependency annotations: {}
Caused by: org.springframework.beans.factory.NoSuchBeanDefinitionException: No qualifying bean of type 'org.springframework.cloud.dataflow.server.job.LauncherRepository' available: expected at least 1 bean which qualifies as autowire candidate. Dependency annotations: {}
Collapse Failed AppRegistryControllerTests testUnregisterAllApplicationsWhenApplicationUsedInStream History
< 1 sec
java.lang.IllegalStateException: Failed to load ApplicationContext
Caused by: org.springframework.beans.factory.UnsatisfiedDependencyException: Error creating bean with name 'taskService' defined in org.springframework.cloud.dataflow.server.configuration.TestDependencies: Unsatisfied dependency expressed through method 'taskService' parameter 0; nested exception is org.springframework.beans.factory.NoSuchBeanDefinitionException: No qualifying bean of type 'org.springframework.cloud.dataflow.server.job.LauncherRepository' available: expected at least 1 bean which qualifies as autowire candidate. Dependency annotations: {}
Caused by: org.springframework.beans.factory.NoSuchBeanDefinitionException: No qualifying bean of type 'org.springframework.cloud.dataflow.server.job.LauncherRepository' available: expected at least 1 bean which qualifies as autowire candidate. Dependency annotations: {}
Collapse Failed AppRegistryControllerTests testUnregisterApplication History
< 1 sec
java.lang.IllegalStateException: Failed to load ApplicationContext
Caused by: org.springframework.beans.factory.UnsatisfiedDependencyException: Error creating bean with name 'taskService' defined in org.springframework.cloud.dataflow.server.configuration.TestDependencies: Unsatisfied dependency expressed through method 'taskService' parameter 0; nested exception is org.springframework.beans.factory.NoSuchBeanDefinitionException: No qualifying bean of type 'org.springframework.cloud.dataflow.server.job.LauncherRepository' available: expected at least 1 bean which qualifies as autowire candidate. Dependency annotations: {}
Caused by: org.springframework.beans.factory.NoSuchBeanDefinitionException: No qualifying bean of type 'org.springframework.cloud.dataflow.server.job.LauncherRepository' available: expected at least 1 bean which qualifies as autowire candidate. Dependency annotations: {}
Collapse Failed AppRegistryControllerTests testUnregisterApplicationNotFound History
< 1 sec
java.lang.IllegalStateException: Failed to load ApplicationContext
Caused by: org.springframework.beans.factory.UnsatisfiedDependencyException: Error creating bean with name 'taskService' defined in org.springframework.cloud.dataflow.server.configuration.TestDependencies: Unsatisfied dependency expressed through method 'taskService' parameter 0; nested exception is org.springframework.beans.factory.NoSuchBeanDefinitionException: No qualifying bean of type 'org.springframework.cloud.dataflow.server.job.LauncherRepository' available: expected at least 1 bean which qualifies as autowire candidate. Dependency annotations: {}
Caused by: org.springframework.beans.factory.NoSuchBeanDefinitionException: No qualifying bean of type 'org.springframework.cloud.dataflow.server.job.LauncherRepository' available: expected at least 1 bean which qualifies as autowire candidate. Dependency annotations: {}
Collapse Failed AppRegistryControllerTests testUnregisterApplicationUsedInStream History
< 1 sec
java.lang.IllegalStateException: Failed to load ApplicationContext
Caused by: org.springframework.beans.factory.UnsatisfiedDependencyException: Error creating bean with name 'taskService' defined in org.springframework.cloud.dataflow.server.configuration.TestDependencies: Unsatisfied dependency expressed through method 'taskService' parameter 0; nested exception is org.springframework.beans.factory.NoSuchBeanDefinitionException: No qualifying bean of type 'org.springframework.cloud.dataflow.server.job.LauncherRepository' available: expected at least 1 bean which qualifies as autowire candidate. Dependency annotations: {}
Caused by: org.springframework.beans.factory.NoSuchBeanDefinitionException: No qualifying bean of type 'org.springframework.cloud.dataflow.server.job.LauncherRepository' available: expected at least 1 bean which qualifies as autowire candidate. Dependency annotations: {}
Collapse Failed AppRegistryControllerTests testUnregisterApplicationUsedInStreamNotDeployed History
< 1 sec
java.lang.IllegalStateException: Failed to load ApplicationContext
Caused by: org.springframework.beans.factory.UnsatisfiedDependencyException: Error creating bean with name 'taskService' defined in org.springframework.cloud.dataflow.server.configuration.TestDependencies: Unsatisfied dependency expressed through method 'taskService' parameter 0; nested exception is org.springframework.beans.factory.NoSuchBeanDefinitionException: No qualifying bean of type 'org.springframework.cloud.dataflow.server.job.LauncherRepository' available: expected at least 1 bean which qualifies as autowire candidate. Dependency annotations: {}
Caused by: org.springframework.beans.factory.NoSuchBeanDefinitionException: No qualifying bean of type 'org.springframework.cloud.dataflow.server.job.LauncherRepository' available: expected at least 1 bean which qualifies as autowire candidate. Dependency annotations: {}
Collapse Failed AppRegistryControllerTests testUnregisterUnversionedApplicationNotFound History
< 1 sec
java.lang.IllegalStateException: Failed to load ApplicationContext
Caused by: org.springframework.beans.factory.UnsatisfiedDependencyException: Error creating bean with name 'taskService' defined in org.springframework.cloud.dataflow.server.configuration.TestDependencies: Unsatisfied dependency expressed through method 'taskService' parameter 0; nested exception is org.springframework.beans.factory.NoSuchBeanDefinitionException: No qualifying bean of type 'org.springframework.cloud.dataflow.server.job.LauncherRepository' available: expected at least 1 bean which qualifies as autowire candidate. Dependency annotations: {}
Caused by: org.springframework.beans.factory.NoSuchBeanDefinitionException: No qualifying bean of type 'org.springframework.cloud.dataflow.server.job.LauncherRepository' available: expected at least 1 bean which qualifies as autowire candidate. Dependency annotations: {}
Collapse Failed AppRegistryControllerTests testVersionOverride History
< 1 sec
java.lang.IllegalStateException: Failed to load ApplicationContext
Caused by: org.springframework.beans.factory.UnsatisfiedDependencyException: Error creating bean with name 'taskService' defined in org.springframework.cloud.dataflow.server.configuration.TestDependencies: Unsatisfied dependency expressed through method 'taskService' parameter 0; nested exception is org.springframework.beans.factory.NoSuchBeanDefinitionException: No qualifying bean of type 'org.springframework.cloud.dataflow.server.job.LauncherRepository' available: expected at least 1 bean which qualifies as autowire candidate. Dependency annotations: {}
Caused by: org.springframework.beans.factory.NoSuchBeanDefinitionException: No qualifying bean of type 'org.springframework.cloud.dataflow.server.job.LauncherRepository' available: expected at least 1 bean which qualifies as autowire candidate. Dependency annotations: {}
Collapse Failed AppRegistryControllerTests testVersionOverrideNonExistentApp History
< 1 sec
java.lang.IllegalStateException: Failed to load ApplicationContext
Caused by: org.springframework.beans.factory.UnsatisfiedDependencyException: Error creating bean with name 'taskService' defined in org.springframework.cloud.dataflow.server.configuration.TestDependencies: Unsatisfied dependency expressed through method 'taskService' parameter 0; nested exception is org.springframework.beans.factory.NoSuchBeanDefinitionException: No qualifying bean of type 'org.springframework.cloud.dataflow.server.job.LauncherRepository' available: expected at least 1 bean which qualifies as autowire candidate. Dependency annotations: {}
Caused by: org.springframework.beans.factory.NoSuchBeanDefinitionException: No qualifying bean of type 'org.springframework.cloud.dataflow.server.job.LauncherRepository' available: expected at least 1 bean which qualifies as autowire candidate. Dependency annotations: {}
Collapse Failed AppRegistryControllerTests testVersionWithMismatchBaseUri History
< 1 sec
java.lang.IllegalStateException: Failed to load ApplicationContext
Caused by: org.springframework.beans.factory.UnsatisfiedDependencyException: Error creating bean with name 'taskService' defined in org.springframework.cloud.dataflow.server.configuration.TestDependencies: Unsatisfied dependency expressed through method 'taskService' parameter 0; nested exception is org.springframework.beans.factory.NoSuchBeanDefinitionException: No qualifying bean of type 'org.springframework.cloud.dataflow.server.job.LauncherRepository' available: expected at least 1 bean which qualifies as autowire candidate. Dependency annotations: {}
Caused by: org.springframework.beans.factory.NoSuchBeanDefinitionException: No qualifying bean of type 'org.springframework.cloud.dataflow.server.job.LauncherRepository' available: expected at least 1 bean which qualifies as autowire candidate. Dependency annotations: {}
Collapse Failed AuditRecordControllerTests testRetrieveAllAuditRecords History
< 1 sec
java.lang.IllegalStateException: Failed to load ApplicationContext
Caused by: org.springframework.beans.factory.UnsatisfiedDependencyException: Error creating bean with name 'taskService' defined in org.springframework.cloud.dataflow.server.configuration.TestDependencies: Unsatisfied dependency expressed through method 'taskService' parameter 0; nested exception is org.springframework.beans.factory.NoSuchBeanDefinitionException: No qualifying bean of type 'org.springframework.cloud.dataflow.server.job.LauncherRepository' available: expected at least 1 bean which qualifies as autowire candidate. Dependency annotations: {}
Caused by: org.springframework.beans.factory.NoSuchBeanDefinitionException: No qualifying bean of type 'org.springframework.cloud.dataflow.server.job.LauncherRepository' available: expected at least 1 bean which qualifies as autowire candidate. Dependency annotations: {}

Error summary

The build generated some errors. See the full build log for more details.

OpenJDK 64-Bit Server VM warning: ignoring option MaxPermSize=1024m; support was removed in 8.0