Logs

The following logs have been generated by the jobs in this plan.
  • Expand all
  • Collapse all
Job Logs
Collapse Default Job Default Stage Download or View
23-May-2019 16:09:38 [INFO] spring-cloud-dataflow-shell ........................ SKIPPED
23-May-2019 16:09:38 [INFO] Spring Cloud Data Flow Docs for Classic mode ....... SKIPPED
23-May-2019 16:09:38 [INFO] Spring Cloud Data Flow Docs ........................ SKIPPED
23-May-2019 16:09:38 [INFO] spring-cloud-dataflow-dependencies ................. SKIPPED
23-May-2019 16:09:38 [INFO] ------------------------------------------------------------------------
23-May-2019 16:09:38 [INFO] BUILD FAILURE
23-May-2019 16:09:38 [INFO] ------------------------------------------------------------------------
23-May-2019 16:09:38 [INFO] Total time: 20:17 min
23-May-2019 16:09:38 [INFO] Finished at: 2019-05-23T16:09:38Z
23-May-2019 16:09:38 [INFO] Final Memory: 91M/463M
23-May-2019 16:09:38 [INFO] ------------------------------------------------------------------------
23-May-2019 16:09:38 [ERROR] Failed to execute goal org.apache.maven.plugins:maven-surefire-plugin:2.22.0:test (default-test) on project spring-cloud-dataflow-server-core: There are test failures.
23-May-2019 16:09:38 [ERROR]
23-May-2019 16:09:38 [ERROR] Please refer to C:\opt\bamboo-home\xml-data\build-dir\SCD-BMASTERWIN-JOB1\spring-cloud-dataflow-server-core\target\surefire-reports for the individual test results.
23-May-2019 16:09:38 [ERROR] Please refer to dump files (if any exist) [date]-jvmRun[N].dump, [date].dumpstream and [date]-jvmRun[N].dumpstream.
23-May-2019 16:09:38 [ERROR] -> [Help 1]
23-May-2019 16:09:38 [ERROR]
23-May-2019 16:09:38 [ERROR] To see the full stack trace of the errors, re-run Maven with the -e switch.
23-May-2019 16:09:38 [ERROR] Re-run Maven using the -X switch to enable full debug logging.
23-May-2019 16:09:38 [ERROR]
23-May-2019 16:09:38 [ERROR] For more information about the errors and possible solutions, please read the following articles:
23-May-2019 16:09:38 [ERROR] [Help 1] http://cwiki.apache.org/confluence/display/MAVEN/MojoFailureException
23-May-2019 16:09:38 [ERROR]
23-May-2019 16:09:38 [ERROR] After correcting the problems, you can resume the build with the command
23-May-2019 16:09:38 [ERROR]   mvn <goals> -rf :spring-cloud-dataflow-server-core