Build #171

DEPMASTER

Build: #171 failed Manual run by Thomas Risberg

Logs

The following logs have been generated by the jobs in this plan.
  • Expand all
  • Collapse all
Job Logs
Collapse Build Spring Cloud Deployer Default Stage Download or View
21-Mar-2017 16:21:15         at org.jfrog.build.extractor.maven.BuildInfoRecorder.sessionEnded(BuildInfoRecorder.java:183)
21-Mar-2017 16:21:15         at org.apache.maven.lifecycle.internal.DefaultExecutionEventCatapult.fire(DefaultExecutionEventCatapult.java:64)
21-Mar-2017 16:21:15         at org.apache.maven.lifecycle.internal.DefaultExecutionEventCatapult.fire(DefaultExecutionEventCatapult.java:42)
21-Mar-2017 16:21:15         at org.apache.maven.lifecycle.internal.LifecycleStarter.execute(LifecycleStarter.java:137)
21-Mar-2017 16:21:15         at org.apache.maven.DefaultMaven.doExecute(DefaultMaven.java:307)
21-Mar-2017 16:21:15         at org.apache.maven.DefaultMaven.doExecute(DefaultMaven.java:193)
21-Mar-2017 16:21:15         at org.apache.maven.DefaultMaven.execute(DefaultMaven.java:106)
21-Mar-2017 16:21:15         ... 11 more
21-Mar-2017 16:21:15 Caused by: java.lang.RuntimeException: Error occurred while publishing artifact to Artifactory: /opt/bamboo-home/xml-data/build-dir/SCD-DEPMASTER-BSCD/spring-cloud-deployer-resource-docker/target/spring-cloud-deployer-resource-docker-1.2.0.BUILD-SNAPSHOT-javadoc.jar.
21-Mar-2017 16:21:15 Skipping deployment of remaining artifacts (if any) and build info.
21-Mar-2017 16:21:15         at org.jfrog.build.extractor.maven.BuildDeploymentHelper.deployArtifacts(BuildDeploymentHelper.java:286)
21-Mar-2017 16:21:15         at org.jfrog.build.extractor.maven.BuildDeploymentHelper.deploy(BuildDeploymentHelper.java:107)
21-Mar-2017 16:21:15         at org.jfrog.build.extractor.maven.BuildInfoRecorder.sessionEnded(BuildInfoRecorder.java:174)
21-Mar-2017 16:21:15         ... 17 more
21-Mar-2017 16:21:15 Caused by: java.io.IOException: Failed to deploy file. Status code: 401
21-Mar-2017 16:21:15         at org.jfrog.build.extractor.clientConfiguration.client.ArtifactoryBuildInfoClient.uploadFile(ArtifactoryBuildInfoClient.java:571)
21-Mar-2017 16:21:15         at org.jfrog.build.extractor.clientConfiguration.client.ArtifactoryBuildInfoClient.deployArtifact(ArtifactoryBuildInfoClient.java:275)
21-Mar-2017 16:21:15         at org.jfrog.build.extractor.maven.BuildDeploymentHelper.deployArtifacts(BuildDeploymentHelper.java:284)
21-Mar-2017 16:21:15         ... 19 more
21-Mar-2017 16:21:15 [ERROR]
21-Mar-2017 16:21:15 [ERROR] To see the full stack trace of the errors, re-run Maven with the -e switch.
21-Mar-2017 16:21:15 [ERROR] Re-run Maven using the -X switch to enable full debug logging.
21-Mar-2017 16:21:15 [ERROR]
21-Mar-2017 16:21:15 [ERROR] For more information about the errors and possible solutions, please read the following articles:
21-Mar-2017 16:21:15 [ERROR] [Help 1] http://cwiki.apache.org/confluence/display/MAVEN/InternalErrorException
Collapse Build Test-App Docker Image and upload Default Stage Download or View
21-Mar-2017 16:20:55         at com.atlassian.bamboo.task.TaskExecutorImpl.execute(TaskExecutorImpl.java:118)
21-Mar-2017 16:20:55         at com.atlassian.bamboo.build.pipeline.tasks.ExecuteBuildTask.call(ExecuteBuildTask.java:74)
21-Mar-2017 16:20:55         at com.atlassian.bamboo.v2.build.agent.DefaultBuildAgent.build(DefaultBuildAgent.java:215)
21-Mar-2017 16:20:55         at com.atlassian.bamboo.v2.build.agent.BuildAgentControllerImpl$1.call(BuildAgentControllerImpl.java:139)
21-Mar-2017 16:20:55         at com.atlassian.bamboo.v2.build.agent.BuildAgentControllerImpl$1.call(BuildAgentControllerImpl.java:130)
21-Mar-2017 16:20:55         at com.atlassian.bamboo.variable.CustomVariableContextImpl.withVariableSubstitutor(CustomVariableContextImpl.java:221)
21-Mar-2017 16:20:55         at com.atlassian.bamboo.v2.build.agent.BuildAgentControllerImpl.waitAndPerformBuild(BuildAgentControllerImpl.java:129)
21-Mar-2017 16:20:55         at com.atlassian.bamboo.v2.build.agent.DefaultBuildAgent$1.run(DefaultBuildAgent.java:137)
21-Mar-2017 16:20:55         at com.atlassian.bamboo.utils.BambooRunnables$1.run(BambooRunnables.java:51)
21-Mar-2017 16:20:55         at com.atlassian.bamboo.security.ImpersonationHelper.runWith(ImpersonationHelper.java:31)
21-Mar-2017 16:20:55         at com.atlassian.bamboo.security.ImpersonationHelper.runWithSystemAuthority(ImpersonationHelper.java:20)
21-Mar-2017 16:20:55         at com.atlassian.bamboo.security.ImpersonationHelper$1.run(ImpersonationHelper.java:52)
21-Mar-2017 16:20:55         at java.lang.Thread.run(Thread.java:745)
21-Mar-2017 16:20:55 Caused by: com.atlassian.bamboo.plugins.docker.client.DockerException: Error running Docker push command. See messages above for details.
21-Mar-2017 16:20:55         at com.atlassian.bamboo.plugins.docker.client.DockerCmd.push(DockerCmd.java:253)
21-Mar-2017 16:20:55         at com.atlassian.bamboo.plugins.docker.service.PushService.execute(PushService.java:37)
21-Mar-2017 16:20:55         ... 17 more
21-Mar-2017 16:20:55 Caused by: com.atlassian.utils.process.ProcessException: Error executing '/usr/bin/docker login -u springbuildmaster -p ******** -e trisberg@pivotal.io', exit code: 1
21-Mar-2017 16:20:55         at com.atlassian.bamboo.plugins.docker.process.DefaultDockerProcessService.execute(DefaultDockerProcessService.java:53)
21-Mar-2017 16:20:55         at com.atlassian.bamboo.plugins.docker.process.DefaultDockerProcessService.executeSilently(DefaultDockerProcessService.java:63)
21-Mar-2017 16:20:55         at com.atlassian.bamboo.plugins.docker.process.DockerTaskProcessService.executeSilently(DockerTaskProcessService.java:75)
21-Mar-2017 16:20:55         at com.atlassian.bamboo.plugins.docker.client.DockerCmd$AuthorisedCommand.login(DockerCmd.java:346)
21-Mar-2017 16:20:55         at com.atlassian.bamboo.plugins.docker.client.DockerCmd$AuthorisedCommand.execute(DockerCmd.java:311)
21-Mar-2017 16:20:55         at com.atlassian.bamboo.plugins.docker.client.DockerCmd.push(DockerCmd.java:238)
21-Mar-2017 16:20:55         ... 18 more