DEPMASTER

Build: #97 failed Changes by Spencer Gibb <spencer@gibb.us>

Test results

  • 23 tests in total
  • 7 tests failed
  • 7 failures are new
  • 6 seconds taken in total.
New test failures 7
Status Test View job Duration
Collapse Failed LocalAppDeployerIntegrationTests testRedeploy History
Build Spring Cloud Deployer < 1 sec
java.lang.RuntimeException: Exception trying to deploy org.springframework.cloud.deployer.spi.core.AppDeploymentRequest@3b49ca31
	at org.springframework.cloud.deployer.spi.local.LocalAppDeployer.deploy(LocalAppDeployer.java:133)
	at org.springframework.cloud.deployer.spi.test.AbstractAppDeployerIntegrationTests.testRedeploy(AbstractAppDeployerIntegrationTests.java:157)
	at sun.reflect.NativeMethodAccessorImpl.invoke0(Native Method)
	at sun.reflect.NativeMethodAccessorImpl.invoke(NativeMethodAccessorImpl.java:57)
	at sun.reflect.DelegatingMethodAccessorImpl.invoke(DelegatingMethodAccessorImpl.java:43)
	at java.lang.reflect.Method.invoke(Method.java:606)
	at org.junit.runners.model.FrameworkMethod$1.runReflectiveCall(FrameworkMethod.java:50)
(44 more lines...)
Collapse Failed LocalAppDeployerIntegrationTests testDeployingStateCalculationAndCancel History
Build Spring Cloud Deployer < 1 sec
java.lang.RuntimeException: Exception trying to deploy org.springframework.cloud.deployer.spi.core.AppDeploymentRequest@3782a3ca
	at org.springframework.cloud.deployer.spi.local.LocalAppDeployer.deploy(LocalAppDeployer.java:133)
	at org.springframework.cloud.deployer.spi.test.AbstractAppDeployerIntegrationTests.testDeployingStateCalculationAndCancel(AbstractAppDeployerIntegrationTests.java:208)
	at sun.reflect.NativeMethodAccessorImpl.invoke0(Native Method)
	at sun.reflect.NativeMethodAccessorImpl.invoke(NativeMethodAccessorImpl.java:57)
	at sun.reflect.DelegatingMethodAccessorImpl.invoke(DelegatingMethodAccessorImpl.java:43)
	at java.lang.reflect.Method.invoke(Method.java:606)
	at org.junit.runners.model.FrameworkMethod$1.runReflectiveCall(FrameworkMethod.java:50)
(44 more lines...)
Collapse Failed LocalAppDeployerIntegrationTests testCommandLineArgumentsPassing History
Build Spring Cloud Deployer < 1 sec
java.lang.RuntimeException: Exception trying to deploy org.springframework.cloud.deployer.spi.core.AppDeploymentRequest@6231c70b
	at org.springframework.cloud.deployer.spi.local.LocalAppDeployer.deploy(LocalAppDeployer.java:133)
	at org.springframework.cloud.deployer.spi.test.AbstractAppDeployerIntegrationTests.testCommandLineArgumentsPassing(AbstractAppDeployerIntegrationTests.java:312)
	at sun.reflect.NativeMethodAccessorImpl.invoke0(Native Method)
	at sun.reflect.NativeMethodAccessorImpl.invoke(NativeMethodAccessorImpl.java:57)
	at sun.reflect.DelegatingMethodAccessorImpl.invoke(DelegatingMethodAccessorImpl.java:43)
	at java.lang.reflect.Method.invoke(Method.java:606)
	at org.junit.runners.model.FrameworkMethod$1.runReflectiveCall(FrameworkMethod.java:50)
(44 more lines...)
Collapse Failed LocalAppDeployerIntegrationTests testApplicationPropertiesPassing History
Build Spring Cloud Deployer < 1 sec
java.lang.RuntimeException: Exception trying to deploy org.springframework.cloud.deployer.spi.core.AppDeploymentRequest@ba33c71
	at org.springframework.cloud.deployer.spi.local.LocalAppDeployer.deploy(LocalAppDeployer.java:133)
	at org.springframework.cloud.deployer.spi.test.AbstractAppDeployerIntegrationTests.testApplicationPropertiesPassing(AbstractAppDeployerIntegrationTests.java:262)
	at sun.reflect.NativeMethodAccessorImpl.invoke0(Native Method)
	at sun.reflect.NativeMethodAccessorImpl.invoke(NativeMethodAccessorImpl.java:57)
	at sun.reflect.DelegatingMethodAccessorImpl.invoke(DelegatingMethodAccessorImpl.java:43)
	at java.lang.reflect.Method.invoke(Method.java:606)
	at org.junit.runners.model.FrameworkMethod$1.runReflectiveCall(FrameworkMethod.java:50)
(44 more lines...)
Collapse Failed LocalAppDeployerIntegrationTests testFailedDeployment History
Build Spring Cloud Deployer < 1 sec
java.lang.RuntimeException: Exception trying to deploy org.springframework.cloud.deployer.spi.core.AppDeploymentRequest@1028cfde
	at org.springframework.cloud.deployer.spi.local.LocalAppDeployer.deploy(LocalAppDeployer.java:133)
	at org.springframework.cloud.deployer.spi.test.AbstractAppDeployerIntegrationTests.testFailedDeployment(AbstractAppDeployerIntegrationTests.java:232)
	at sun.reflect.NativeMethodAccessorImpl.invoke0(Native Method)
	at sun.reflect.NativeMethodAccessorImpl.invoke(NativeMethodAccessorImpl.java:57)
	at sun.reflect.DelegatingMethodAccessorImpl.invoke(DelegatingMethodAccessorImpl.java:43)
	at java.lang.reflect.Method.invoke(Method.java:606)
	at org.junit.runners.model.FrameworkMethod$1.runReflectiveCall(FrameworkMethod.java:50)
(44 more lines...)
Collapse Failed LocalAppDeployerIntegrationTests testSimpleDeployment History
Build Spring Cloud Deployer < 1 sec
java.lang.RuntimeException: Exception trying to deploy org.springframework.cloud.deployer.spi.core.AppDeploymentRequest@e25044e
	at org.springframework.cloud.deployer.spi.local.LocalAppDeployer.deploy(LocalAppDeployer.java:133)
	at org.springframework.cloud.deployer.spi.test.AbstractAppDeployerIntegrationTests.testSimpleDeployment(AbstractAppDeployerIntegrationTests.java:123)
	at sun.reflect.NativeMethodAccessorImpl.invoke0(Native Method)
	at sun.reflect.NativeMethodAccessorImpl.invoke(NativeMethodAccessorImpl.java:57)
	at sun.reflect.DelegatingMethodAccessorImpl.invoke(DelegatingMethodAccessorImpl.java:43)
	at java.lang.reflect.Method.invoke(Method.java:606)
	at org.junit.runners.model.FrameworkMethod$1.runReflectiveCall(FrameworkMethod.java:50)
(44 more lines...)
Collapse Failed LocalAppDeployerIntegrationTests testMultipleInstancesDeploymentAndPartialState History
Build Spring Cloud Deployer < 1 sec
java.lang.RuntimeException: Exception trying to deploy org.springframework.cloud.deployer.spi.core.AppDeploymentRequest@56beb399
	at org.springframework.cloud.deployer.spi.local.LocalAppDeployer.deploy(LocalAppDeployer.java:133)
	at org.springframework.cloud.deployer.spi.test.AbstractAppDeployerIntegrationTests.testMultipleInstancesDeploymentAndPartialState(AbstractAppDeployerIntegrationTests.java:367)
	at sun.reflect.NativeMethodAccessorImpl.invoke0(Native Method)
	at sun.reflect.NativeMethodAccessorImpl.invoke(NativeMethodAccessorImpl.java:57)
	at sun.reflect.DelegatingMethodAccessorImpl.invoke(DelegatingMethodAccessorImpl.java:43)
	at java.lang.reflect.Method.invoke(Method.java:606)
	at org.junit.runners.model.FrameworkMethod$1.runReflectiveCall(FrameworkMethod.java:50)
(44 more lines...)