Build: #11 failed Changes by David Turanski <dturanski@pivotal.io>

Stages & jobs

  1. Default Stage

  2. Build Data Admin Docker Image and upload

Logs

The following logs have been generated by the jobs in this plan.
  • Expand all
  • Collapse all
Job Logs
Collapse Build File Ingest Default Stage Download or View
05-Nov-2018 19:15:55 [ERROR] Errors:
05-Nov-2018 19:15:55 [ERROR]   BatchApplicationTests.testBatchConfigurationFail » IllegalState Failed to load...
05-Nov-2018 19:15:55 [ERROR]   BatchApplicationTests.testBatchDataProcessing » IllegalState Failed to load Ap...
05-Nov-2018 19:15:55 [INFO]
05-Nov-2018 19:15:55 [ERROR] Tests run: 4, Failures: 0, Errors: 2, Skipped: 0
05-Nov-2018 19:15:55 [INFO]
05-Nov-2018 19:15:55 [INFO] ------------------------------------------------------------------------
05-Nov-2018 19:15:55 [INFO] BUILD FAILURE
05-Nov-2018 19:15:55 [INFO] ------------------------------------------------------------------------
05-Nov-2018 19:15:55 [INFO] Total time: 18.776s
05-Nov-2018 19:15:55 [INFO] Finished at: Mon Nov 05 19:15:55 UTC 2018
05-Nov-2018 19:15:55 [INFO] Final Memory: 27M/202M
05-Nov-2018 19:15:55 [INFO] ------------------------------------------------------------------------
05-Nov-2018 19:15:55 [WARNING] The requested profile "full" could not be activated because it does not exist.
05-Nov-2018 19:15:55 [ERROR] Failed to execute goal org.apache.maven.plugins:maven-surefire-plugin:2.22.1:test (default-test) on project ingest: There are test failures.
05-Nov-2018 19:15:55 [ERROR]
05-Nov-2018 19:15:55 [ERROR] Please refer to /opt/bamboo-home/xml-data/build-dir/SCD-FILEINGEST-BSCDL/batch/file-ingest/target/surefire-reports for the individual test results.
05-Nov-2018 19:15:55 [ERROR] Please refer to dump files (if any exist) [date].dump, [date]-jvmRun[N].dump and [date].dumpstream.
05-Nov-2018 19:15:55 [ERROR] -> [Help 1]
05-Nov-2018 19:15:55 [ERROR]
05-Nov-2018 19:15:55 [ERROR] To see the full stack trace of the errors, re-run Maven with the -e switch.
05-Nov-2018 19:15:55 [ERROR] Re-run Maven using the -X switch to enable full debug logging.
05-Nov-2018 19:15:55 [ERROR]
05-Nov-2018 19:15:55 [ERROR] For more information about the errors and possible solutions, please read the following articles:
05-Nov-2018 19:15:55 [ERROR] [Help 1] http://cwiki.apache.org/confluence/display/MAVEN/MojoFailureException