Build: #158 failed Changes by Ilayaperumal Gopinathan

Stages & jobs

  1. Default Stage

  2. Build Data Admin Docker Image and upload

Logs

The following logs have been generated by the jobs in this plan.
  • Expand all
  • Collapse all
Job Logs
Collapse Build File Ingest Default Stage Download or View
28-May-2021 22:23:21 OpenJDK 64-Bit Server VM warning: ignoring option MaxPermSize=768m; support was removed in 8.0
28-May-2021 22:23:22 [INFO] Scanning for projects...
28-May-2021 22:23:22 Downloading: https://repo.spring.io/milestone/org/springframework/boot/spring-boot-starter-parent/2.1.5.RELEASE/spring-boot-starter-parent-2.1.5.RELEASE.pom
28-May-2021 22:23:23 Downloading: https://repo.spring.io/snapshot/org/springframework/boot/spring-boot-starter-parent/2.1.5.RELEASE/spring-boot-starter-parent-2.1.5.RELEASE.pom
28-May-2021 22:23:23 Downloading: http://repo.maven.apache.org/maven2/org/springframework/boot/spring-boot-starter-parent/2.1.5.RELEASE/spring-boot-starter-parent-2.1.5.RELEASE.pom
28-May-2021 22:25:35 [ERROR] The build could not read 1 project -> [Help 1]
28-May-2021 22:25:35 [ERROR]   
28-May-2021 22:25:35 [ERROR]   The project io.spring.cloud.dataflow.ingest:ingest:1.0.0.BUILD-SNAPSHOT (/opt/bamboo-home/xml-data/build-dir/SCD-FILEINGEST-BSCDL/batch/file-ingest/pom.xml) has 1 error
28-May-2021 22:25:35 [ERROR]     Non-resolvable parent POM: Could not transfer artifact org.springframework.boot:spring-boot-starter-parent:pom:2.1.5.RELEASE from/to central (http://repo.maven.apache.org/maven2): Connection to http://repo.maven.apache.org refused and 'parent.relativePath' points at wrong local POM @ line 8, column 13: Connection timed out (Connection timed out) -> [Help 2]
28-May-2021 22:25:35 [ERROR]
28-May-2021 22:25:35 [ERROR] To see the full stack trace of the errors, re-run Maven with the -e switch.
28-May-2021 22:25:35 [ERROR] Re-run Maven using the -X switch to enable full debug logging.
28-May-2021 22:25:35 [ERROR]
28-May-2021 22:25:35 [ERROR] For more information about the errors and possible solutions, please read the following articles:
28-May-2021 22:25:35 [ERROR] [Help 1] http://cwiki.apache.org/confluence/display/MAVEN/ProjectBuildingException
28-May-2021 22:25:35 [ERROR] [Help 2] http://cwiki.apache.org/confluence/display/MAVEN/UnresolvableModelException
28-May-2021 22:25:35 Unable to publish artifact [Test Results]: