Build: #6 failed Manual run by David Turanski

Stages & jobs

  1. Default Stage

  2. Build Data Admin Docker Image and upload

Logs

The following logs have been generated by the jobs in this plan.
  • Expand all
  • Collapse all
Job Logs
Collapse Build File Ingest Default Stage Download or View
31-Oct-2018 20:06:22 Downloading: http://repo.spring.io/snapshot/org/springframework/cloud/spring-cloud-task-core/2.1.0.BUILD-SNAPSHOT/spring-cloud-task-core-2.1.0.BUILD-SNAPSHOT.jar
31-Oct-2018 20:06:23 Downloading: http://repo.spring.io/snapshot/org/springframework/cloud/spring-cloud-task-batch/2.1.0.BUILD-SNAPSHOT/spring-cloud-task-batch-2.1.0.BUILD-SNAPSHOT.jar
31-Oct-2018 20:06:23 Downloading: http://repo.maven.apache.org/maven2/com/zaxxer/HikariCP/3.2.0/HikariCP-3.2.0.jar
31-Oct-2018 20:06:23 Downloading: http://repo.maven.apache.org/maven2/javax/batch/javax.batch-api/1.0/javax.batch-api-1.0.jar
31-Oct-2018 20:06:23 Downloading: http://repo.maven.apache.org/maven2/org/codehaus/jettison/jettison/1.2/jettison-1.2.jar
31-Oct-2018 20:06:23 Downloading: http://repo.maven.apache.org/maven2/com/h2database/h2/1.4.197/h2-1.4.197.jar
31-Oct-2018 20:06:23 Downloaded: http://repo.maven.apache.org/maven2/javax/batch/javax.batch-api/1.0/javax.batch-api-1.0.jar (35 KB at 436.5 KB/sec)
31-Oct-2018 20:06:23 Downloaded: http://repo.maven.apache.org/maven2/org/codehaus/jettison/jettison/1.2/jettison-1.2.jar (71 KB at 626.4 KB/sec)
31-Oct-2018 20:06:23 Downloaded: http://repo.maven.apache.org/maven2/com/zaxxer/HikariCP/3.2.0/HikariCP-3.2.0.jar (141 KB at 664.5 KB/sec)
31-Oct-2018 20:06:24 Downloaded: http://repo.maven.apache.org/maven2/com/h2database/h2/1.4.197/h2-1.4.197.jar (1883 KB at 1374.0 KB/sec)
31-Oct-2018 20:06:24 [INFO] ------------------------------------------------------------------------
31-Oct-2018 20:06:24 [INFO] BUILD FAILURE
31-Oct-2018 20:06:24 [INFO] ------------------------------------------------------------------------
31-Oct-2018 20:06:24 [INFO] Total time: 20.085s
31-Oct-2018 20:06:24 [INFO] Finished at: Wed Oct 31 20:06:24 UTC 2018
31-Oct-2018 20:06:24 [INFO] Final Memory: 15M/351M
31-Oct-2018 20:06:24 [INFO] ------------------------------------------------------------------------
31-Oct-2018 20:06:24 [WARNING] The requested profile "full" could not be activated because it does not exist.
31-Oct-2018 20:06:24 [ERROR] Failed to execute goal on project ingest: Could not resolve dependencies for project io.spring.cloud.dataflow.ingest:ingest:jar:1.0.0.BUILD-SNAPSHOT: The following artifacts could not be resolved: org.springframework.cloud:spring-cloud-task-core:jar:2.1.0.BUILD-SNAPSHOT, org.springframework.cloud:spring-cloud-task-batch:jar:2.1.0.BUILD-SNAPSHOT: Could not find artifact org.springframework.cloud:spring-cloud-task-core:jar:2.1.0.BUILD-SNAPSHOT in repository.spring.milestone (http://repo.spring.io/milestone) -> [Help 1]
31-Oct-2018 20:06:24 [ERROR]
31-Oct-2018 20:06:24 [ERROR] To see the full stack trace of the errors, re-run Maven with the -e switch.
31-Oct-2018 20:06:24 [ERROR] Re-run Maven using the -X switch to enable full debug logging.
31-Oct-2018 20:06:24 [ERROR]
31-Oct-2018 20:06:24 [ERROR] For more information about the errors and possible solutions, please read the following articles:
31-Oct-2018 20:06:24 [ERROR] [Help 1] http://cwiki.apache.org/confluence/display/MAVEN/DependencyResolutionException