Build: #12 failed

Job: Build File Ingest failed

Stages & jobs

  1. Default Stage

  2. Build Data Admin Docker Image and upload

Build log

The build generated 374 lines of output. Download or view full build log

06-Nov-2018 15:15:30 Build Spring Cloud Data Flow - Spring Cloud Data Flow Samples - File Ingest - Build File Ingest #12 (SCD-FILEINGEST-BSCDL-12) started building on agent bamboo-08.af.pivotal.io
06-Nov-2018 15:15:30 Remote agent on host bamboo-08.af.pivotal.io
06-Nov-2018 15:15:30 Build working directory is /opt/bamboo-home/xml-data/build-dir/SCD-FILEINGEST-BSCDL
06-Nov-2018 15:15:30 Executing build Spring Cloud Data Flow - Spring Cloud Data Flow Samples - File Ingest - Build File Ingest #12 (SCD-FILEINGEST-BSCDL-12)
06-Nov-2018 15:15:30 Starting task 'Checkout Default Repository' of type 'com.atlassian.bamboo.plugins.vcs:task.vcs.checkout'
06-Nov-2018 15:15:30 Checking out into /opt/bamboo-home/xml-data/build-dir/SCD-FILEINGEST-BSCDL
06-Nov-2018 15:15:30 Updating source code to revision: f2b2f1f34dc89b9dbee1a9b5f9072a574a986ad1
06-Nov-2018 15:15:31 Fetching 'refs/heads/dataflow-tasklauncher' from 'https://github.com/dturanski/spring-cloud-dataflow-samples.git'.
06-Nov-2018 15:15:32 From https://github.com/dturanski/spring-cloud-dataflow-samples
06-Nov-2018 15:15:32    4a7b800..f2b2f1f  dataflow-tasklauncher -> dataflow-tasklauncher
06-Nov-2018 15:15:32 Checking out revision f2b2f1f34dc89b9dbee1a9b5f9072a574a986ad1.
06-Nov-2018 15:15:32 Creating local git repository in '/opt/bamboo-home/xml-data/build-dir/SCD-FILEINGEST-BSCDL/.git'.
06-Nov-2018 15:15:32 Cloning into '/opt/bamboo-home/xml-data/build-dir/SCD-FILEINGEST-BSCDL'...
06-Nov-2018 15:15:32 done.
06-Nov-2018 15:15:32 Switched to a new branch 'dataflow-tasklauncher'
06-Nov-2018 15:15:32 Branch dataflow-tasklauncher set up to track remote branch dataflow-tasklauncher from origin.
06-Nov-2018 15:15:32 Updated source code to revision: f2b2f1f34dc89b9dbee1a9b5f9072a574a986ad1
06-Nov-2018 15:15:32 Finished task 'Checkout Default Repository' with result: Success
06-Nov-2018 15:15:32 Running pre-build action: Artifactory Release Staging
06-Nov-2018 15:15:32 Running pre-build action: VCS Version Collector
06-Nov-2018 15:15:32 Starting task 'Build and publish Spring Cloud Data Flow Sample - File Ingest' of type 'org.jfrog.bamboo.bamboo-artifactory-plugin:maven3Task'
06-Nov-2018 15:15:32 Bamboo Artifactory Plugin version: 2.5.x-SNAPSHOT
06-Nov-2018 15:15:32
Beginning to execute external process for build 'Spring Cloud Data Flow - Spring Cloud Data Flow Samples - File Ingest - Build File Ingest #12 (SCD-FILEINGEST-BSCDL-12)'
... running command line:
/opt/jdk-8/bin/java -cp /opt/maven-3.0/boot/plexus-classworlds-2.4.jar -Dclassworlds.conf=/tmp/artifactoryM28139988754865809853conf -DbuildInfoConfig.propertiesFile=/tmp/buildInfo1366649788314850843.properties -Xmx2048m -XX:MaxPermSize=768m -Dmaven.home=/opt/maven-3.0 -Dmaven.multiModuleProjectDirectory=/opt/bamboo-home/xml-data/build-dir/SCD-FILEINGEST-BSCDL/batch/file-ingest org.codehaus.plexus.classworlds.launcher.Launcher clean install -Pfull --batch-mode -Dartifactory.publish.password=********
... in: /opt/bamboo-home/xml-data/build-dir/SCD-FILEINGEST-BSCDL/batch/file-ingest
... using extra environment variables:
bamboo_planRepository_1_branch=master
IRBRC=/home/bamboo/.rvm/rubies/ruby-2.3.0/.irbrc
bamboo_signing_store_password=********
bamboo_planRepository_2_branch=dataflow-tasklauncher
bamboo_capability_system_builder_ant_Ant_1_9=/opt/ant-1.9
bamboo_capability_system_builder_ant_Ant_1_8=/opt/ant-1.8
bamboo_planRepository_1_branchDisplayName=master
bamboo_capability_system_jdk_OpenJDK_7u181=/opt/openjdk-7
bamboo_repository_274694315_git_branch=dataflow-tasklauncher
bamboo_repository_revision_number=f2b2f1f34dc89b9dbee1a9b5f9072a574a986ad1
bamboo_capability_system_builder_node_Node_js_6=/usr/bin/node
bamboo_RIAK_BIN=/usr/sbin/riak
WRAPPER_BITS=32
bamboo_buildKey=SCD-FILEINGEST-BSCDL
rvm_loaded_flag=1
bamboo_sonar_token_password=********
rvm_version=1.27.0 (latest)
PWD=/opt/bamboo-home/bin
bamboo_planRepository_2_branchDisplayName=dataflow-tasklauncher
bamboo_shortJobName=Build File Ingest
bamboo_capability_system_builder_gradle___gradlew=./gradlew
bamboo_buildResultsUrl=https://build.spring.io/browse/SCD-FILEINGEST-BSCDL-12
bamboo_capability_system_builder_mvn3_Maven_3_3=/opt/maven-3.3
bamboo_capability_system_builder_mvn3_Maven_3_2=/opt/maven-3.2
bamboo_capability_system_builder_mvn3_Maven_3_1=/opt/maven-3.1
bamboo_planRepository_repositoryUrl=https://github.com/spring-cloud/spring-cloud-dataflow-samples.git
bamboo_agentId=208568332
bamboo_capability_system_builder_mvn3_Maven_3_5=/opt/maven-3.5
MY_RUBY_HOME=/home/bamboo/.rvm/rubies/ruby-2.3.0
bamboo_capability_system_builder_mvn3_Maven_3_0=/opt/maven-3.0
rvm_path=/home/bamboo/.rvm
bamboo_planRepository_revision=699f7856e472392ba2a977dd950357bdc8cc9f4b
bamboo_repository_274694310_revision_number=699f7856e472392ba2a977dd950357bdc8cc9f4b
bamboo_planRepository_previousRevision=4a8fbbd72391b47d7d4987afa84953c7ced3521c
bamboo_capability_remote_build=true
bamboo_repository_branch_name=dataflow-tasklauncher
bamboo_repository_274694315_git_repositoryUrl=https://github.com/dturanski/spring-cloud-dataflow-samples.git
SHLVL=1
bamboo_org_jfrog_bamboo_buildInfo_serverUrl=https://repo.spring.io
bamboo_scdf_acceptance_tests_password=********
WRAPPER_OS=linux
EC2_HOME=/opt/ec2-api-tools
XDG_SESSION_ID=c1
bamboo_capability_Agent=bamboo-08.af.pivotal.io
bamboo_planRepository_branch=master
bamboo_org_jfrog_bamboo_release_activated=false
bamboo_repository_274694310_previous_revision_number=4a8fbbd72391b47d7d4987afa84953c7ced3521c
bamboo_planRepository_1_type=gitv2
bamboo_planRepository_branchName=master
WRAPPER_FILE_SEPARATOR=/
_=/opt/bamboo-home/bin/bamboo-agent.sh
bamboo_repository_274694315_revision_number=f2b2f1f34dc89b9dbee1a9b5f9072a574a986ad1
WRAPPER_PATH_SEPARATOR=:
bamboo_sonar_password=********
bamboo_hg_cache_directory=/opt/bamboo-home/xml-data/build-dir/_hg-repositories-cache
bamboo_planRepository_1_username=spring-buildmaster
bamboo_planRepository_type=gitv2
bamboo_git_cache_directory=/opt/bamboo-home/xml-data/build-dir/_git-repositories-cache
bamboo_planRepository_2_branchName=dataflow-tasklauncher
bamboo_artifactory_username=buildmaster
rvm_stored_umask=0002
bamboo_tmp_directory=/opt/bamboo-home/temp
GEM_PATH=/home/bamboo/.rvm/gems/ruby-2.3.0:/home/bamboo/.rvm/gems/ruby-2.3.0@global
bamboo_repository_274694315_name=DTuranski
bamboo_planKey=SCD-FILEINGEST
bamboo_planRepository_username=spring-buildmaster
bamboo_JDK8_HOME=/opt/jdk-8
NLSPATH=/usr/dt/lib/nls/msg/%L/%N.cat
bamboo_planRepository_1_branchName=master
bamboo_repository_274694315_branch_name=dataflow-tasklauncher
bamboo_sonar_version=5.6.3
XDG_DATA_DIRS=/usr/local/share:/usr/share:/var/lib/snapd/desktop
bamboo_capability_system_jdk_JDK_1_11=/opt/jdk-11
bamboo_resultsUrl=https://build.spring.io/browse/SCD-FILEINGEST-BSCDL-12
bamboo_capability_system_jdk_JDK_1_10=/opt/jdk-10
bamboo_build_working_directory=/opt/bamboo-home/xml-data/build-dir/SCD-FILEINGEST-BSCDL
bamboo_planRepository_1_name=Git
bamboo_capability_system_os=ubuntu1604
bamboo_nexusPush_stagingProfile=buildmaster
bamboo_repository_274694310_branch_name=master
bamboo_shortPlanName=Spring Cloud Data Flow Samples - File Ingest
MAIL=/var/mail/bamboo
bamboo_planRepository_2_username=dturanski
bamboo_planRepository_name=Git
LOGNAME=bamboo
bamboo_buildNumber=12
rvm_user_install_flag=1
SHELL=/bin/bash
bamboo_repository_274694310_git_branch=master
bamboo_planName=Spring Cloud Data Flow - Spring Cloud Data Flow Samples - File Ingest
bamboo_JDK7_HOME=/opt/jdk-7
bamboo_shortPlanKey=FILEINGEST
OLDPWD=/opt/users/bamboo
GEM_HOME=/home/bamboo/.rvm/gems/ruby-2.3.0
bamboo_shortJobKey=BSCDL
bamboo_artifactory_password=********
bamboo_planRepository_2_name=DTuranski
bamboo_repository_274694315_previous_revision_number=f2b2f1f34dc89b9dbee1a9b5f9072a574a986ad1
bamboo_buildTimeStamp=2018-11-06T15:15:30.672Z
bamboo_repository_previous_revision_number=f2b2f1f34dc89b9dbee1a9b5f9072a574a986ad1
RUBY_VERSION=ruby-2.3.0
bamboo_sonar_username=buildmaster
_system_name=Ubuntu
bamboo_repository_274694310_git_username=spring-buildmaster
bamboo_repository_git_branch=dataflow-tasklauncher
bamboo_buildResultKey=SCD-FILEINGEST-BSCDL-12
bamboo_nexusPush_close=true
bamboo_buildPlanName=Spring Cloud Data Flow - Spring Cloud Data Flow Samples - File Ingest - Build File Ingest
bamboo_planRepository_1_revision=699f7856e472392ba2a977dd950357bdc8cc9f4b
_system_arch=x86_64
bamboo_repository_name=DTuranski
rvm_bin_path=/home/bamboo/.rvm/bin
bamboo_signing_key_password=********
bamboo_planRepository_2_previousRevision=f2b2f1f34dc89b9dbee1a9b5f9072a574a986ad1
XFILESEARCHPATH=/usr/dt/app-defaults/%L/Dt
rvm_prefix=/home/bamboo
LANG=en_US.UTF-8
bamboo_buildFailed=false
bamboo_repository_274694315_git_username=dturanski
bamboo_capability_system_docker_executable=/usr/bin/docker
DISPLAY=localhost:1.0
bamboo_capability_system_builder_groovy_Groovy_2_4=/opt/groovy-2.4
bamboo_capability_system_builder_command_Bash=/bin/bash
bamboo_artifactory_password_mask_a=********
bamboo_agentWorkingDirectory=/opt/bamboo-home/xml-data/build-dir
bamboo_planRepository_2_revision=f2b2f1f34dc89b9dbee1a9b5f9072a574a986ad1
bamboo_capability_system_git_executable=/usr/bin/git
bamboo_repository_git_username=dturanski
bamboo_planRepository_1_previousRevision=4a8fbbd72391b47d7d4987afa84953c7ced3521c
bamboo_capability_os_family=unix
bamboo_repository_274694310_git_repositoryUrl=https://github.com/spring-cloud/spring-cloud-dataflow-samples.git
NVM_NODEJS_ORG_MIRROR=http://nodejs.org/dist
bamboo_planRepository_branchDisplayName=master
NODE_PATH=/usr/lib/nodejs:/usr/lib/node_modules:/usr/share/javascript
bamboo_capability_system_builder_maven_Artifactory_Maven_3_5=/opt/maven-3.5
GIT_SSL_NO_VERIFY=true
bamboo_capability_system_builder_maven_Artifactory_Maven_3_3=/opt/maven-3.3
NVM_DIR=/home/bamboo/.nvm
bamboo_planRepository_2_type=gh2
bamboo_capability_system_builder_maven_Artifactory_Maven_3_2=/opt/maven-3.2
bamboo_s3_properties=/home/bamboo/tools/s3.properties
bamboo_capability_system_builder_maven_Artifactory_Maven_3_1=/opt/maven-3.1
bamboo_capability_system_builder_maven_Artifactory_Maven_3_0=/opt/maven-3.0
bamboo_repository_274694310_name=Git
_system_type=Linux
bamboo_plan_storageTag=plan-274497867
_system_version=16.04
bamboo_planRepository_2_repositoryUrl=https://github.com/dturanski/spring-cloud-dataflow-samples.git
USER=bamboo
bamboo_repository_git_repositoryUrl=https://github.com/dturanski/spring-cloud-dataflow-samples.git
bamboo_working_directory=/opt/bamboo-home/xml-data/build-dir/SCD-FILEINGEST-BSCDL
bamboo_org_jfrog_bamboo_buildInfo_activated=true
bamboo_planRepository_1_repositoryUrl=https://github.com/spring-cloud/spring-cloud-dataflow-samples.git
bamboo_capability_system_jdk_JDK_1_8=/opt/jdk-8
bamboo_capability_system_jdk_JDK_1_9=/opt/jdk-9
WRAPPER_ARCH=x86
bamboo_capability_system_jdk_JDK_1_6=/opt/jdk-6
bamboo_capability_system_jdk_JDK_1_7=/opt/jdk-7
bamboo_sonar_ip=10.194.6.9
XDG_RUNTIME_DIR=/run/user/505
HOME=/home/bamboo
PATH=/bin:/home/bamboo/.rvm/gems/ruby-2.3.0/bin:/home/bamboo/.rvm/gems/ruby-2.3.0@global/bin:/home/bamboo/.rvm/rubies/ruby-2.3.0/bin:/home/bamboo/bin:/usr/local/bin:/usr/bin:/bin:/usr/local/games:/usr/games:/snap/bin:/home/bamboo/bin:/usr/local/bin:/opt/ec2-api-tools/bin:/home/bamboo/.rvm/bin:/bin:/home/bamboo/.rvm/gems/ruby-2.3.0/bin:/home/bamboo/.rvm/gems/ruby-2.3.0@global/bin:/home/bamboo/.rvm/rubies/ruby-2.3.0/bin:/home/bamboo/bin:/usr/local/bin:/usr/bin:/bin:/usr/local/games:/usr/games:/snap/bin:/home/bamboo/bin:/usr/local/bin:/opt/ec2-api-tools/bin:/home/bamboo/.rvm/bin
06-Nov-2018 15:15:32 Java HotSpot(TM) 64-Bit Server VM warning: ignoring option MaxPermSize=768m; support was removed in 8.0
06-Nov-2018 15:15:34 [INFO] Scanning for projects...
06-Nov-2018 15:15:34 Downloading: http://repo.spring.io/snapshot/org/springframework/boot/spring-boot-starter-parent/2.1.0.BUILD-SNAPSHOT/maven-metadata.xml
06-Nov-2018 15:15:34 Downloading: http://repo.spring.io/milestone/org/springframework/boot/spring-boot-starter-parent/2.1.0.BUILD-SNAPSHOT/maven-metadata.xml
06-Nov-2018 15:15:34 Downloaded: http://repo.spring.io/snapshot/org/springframework/boot/spring-boot-starter-parent/2.1.0.BUILD-SNAPSHOT/maven-metadata.xml (643 B at 2.2 KB/sec)
06-Nov-2018 15:15:34 Downloading: http://repo.spring.io/milestone/org/springframework/boot/spring-boot-dependencies/2.1.0.BUILD-SNAPSHOT/maven-metadata.xml
06-Nov-2018 15:15:34 Downloading: http://repo.spring.io/snapshot/org/springframework/boot/spring-boot-dependencies/2.1.0.BUILD-SNAPSHOT/maven-metadata.xml
06-Nov-2018 15:15:34 Downloaded: http://repo.spring.io/snapshot/org/springframework/boot/spring-boot-dependencies/2.1.0.BUILD-SNAPSHOT/maven-metadata.xml (641 B at 3.6 KB/sec)
06-Nov-2018 15:15:35 [INFO] Initializing Artifactory Build-Info Recording
06-Nov-2018 15:15:35 [INFO]                                                                         
06-Nov-2018 15:15:35 [INFO] ------------------------------------------------------------------------
06-Nov-2018 15:15:35 [INFO] Building ingest 1.0.0.BUILD-SNAPSHOT
06-Nov-2018 15:15:35 [INFO] ------------------------------------------------------------------------
06-Nov-2018 15:15:35 Downloading: https://repo.spring.io/snapshot/org/springframework/boot/spring-boot-maven-plugin/2.1.0.BUILD-SNAPSHOT/maven-metadata.xml
06-Nov-2018 15:15:35 Downloaded: https://repo.spring.io/snapshot/org/springframework/boot/spring-boot-maven-plugin/2.1.0.BUILD-SNAPSHOT/maven-metadata.xml (2 KB at 4.1 KB/sec)
06-Nov-2018 15:15:35 Downloading: https://repo.spring.io/snapshot/org/springframework/boot/spring-boot-tools/2.1.0.BUILD-SNAPSHOT/maven-metadata.xml
06-Nov-2018 15:15:35 Downloaded: https://repo.spring.io/snapshot/org/springframework/boot/spring-boot-tools/2.1.0.BUILD-SNAPSHOT/maven-metadata.xml (634 B at 3.6 KB/sec)
06-Nov-2018 15:15:35 Downloading: https://repo.spring.io/snapshot/org/springframework/boot/spring-boot-parent/2.1.0.BUILD-SNAPSHOT/maven-metadata.xml
06-Nov-2018 15:15:36 Downloaded: https://repo.spring.io/snapshot/org/springframework/boot/spring-boot-parent/2.1.0.BUILD-SNAPSHOT/maven-metadata.xml (635 B at 3.5 KB/sec)
06-Nov-2018 15:15:36 Downloading: https://repo.spring.io/snapshot/org/springframework/boot/spring-boot-dependencies/2.1.0.BUILD-SNAPSHOT/maven-metadata.xml
06-Nov-2018 15:15:36 Downloaded: https://repo.spring.io/snapshot/org/springframework/boot/spring-boot-dependencies/2.1.0.BUILD-SNAPSHOT/maven-metadata.xml (641 B at 2.8 KB/sec)
06-Nov-2018 15:15:36 Downloading: http://repo.spring.io/milestone/org/springframework/boot/spring-boot-starter-batch/2.1.0.BUILD-SNAPSHOT/maven-metadata.xml
06-Nov-2018 15:15:36 Downloading: http://repo.spring.io/snapshot/org/springframework/boot/spring-boot-starter-batch/2.1.0.BUILD-SNAPSHOT/maven-metadata.xml
06-Nov-2018 15:15:36 Downloaded: http://repo.spring.io/snapshot/org/springframework/boot/spring-boot-starter-batch/2.1.0.BUILD-SNAPSHOT/maven-metadata.xml (2 KB at 4.4 KB/sec)
06-Nov-2018 15:15:36 Downloading: http://repo.spring.io/snapshot/org/springframework/boot/spring-boot-starters/2.1.0.BUILD-SNAPSHOT/maven-metadata.xml
06-Nov-2018 15:15:36 Downloading: http://repo.spring.io/milestone/org/springframework/boot/spring-boot-starters/2.1.0.BUILD-SNAPSHOT/maven-metadata.xml
06-Nov-2018 15:15:37 Downloaded: http://repo.spring.io/snapshot/org/springframework/boot/spring-boot-starters/2.1.0.BUILD-SNAPSHOT/maven-metadata.xml (864 B at 4.8 KB/sec)
06-Nov-2018 15:15:37 Downloading: http://repo.spring.io/snapshot/org/springframework/boot/spring-boot-starter/2.1.0.BUILD-SNAPSHOT/maven-metadata.xml
06-Nov-2018 15:15:37 Downloading: http://repo.spring.io/milestone/org/springframework/boot/spring-boot-starter/2.1.0.BUILD-SNAPSHOT/maven-metadata.xml
06-Nov-2018 15:15:37 Downloaded: http://repo.spring.io/snapshot/org/springframework/boot/spring-boot-starter/2.1.0.BUILD-SNAPSHOT/maven-metadata.xml (2 KB at 5.8 KB/sec)
06-Nov-2018 15:15:37 Downloading: http://repo.spring.io/milestone/org/springframework/boot/spring-boot/2.1.0.BUILD-SNAPSHOT/maven-metadata.xml
06-Nov-2018 15:15:37 Downloading: http://repo.spring.io/snapshot/org/springframework/boot/spring-boot/2.1.0.BUILD-SNAPSHOT/maven-metadata.xml
06-Nov-2018 15:15:37 Downloaded: http://repo.spring.io/snapshot/org/springframework/boot/spring-boot/2.1.0.BUILD-SNAPSHOT/maven-metadata.xml (2 KB at 7.0 KB/sec)
06-Nov-2018 15:15:37 Downloading: http://repo.spring.io/milestone/org/springframework/boot/spring-boot-autoconfigure/2.1.0.BUILD-SNAPSHOT/maven-metadata.xml
06-Nov-2018 15:15:37 Downloading: http://repo.spring.io/snapshot/org/springframework/boot/spring-boot-autoconfigure/2.1.0.BUILD-SNAPSHOT/maven-metadata.xml
06-Nov-2018 15:15:37 Downloaded: http://repo.spring.io/snapshot/org/springframework/boot/spring-boot-autoconfigure/2.1.0.BUILD-SNAPSHOT/maven-metadata.xml (2 KB at 6.7 KB/sec)
06-Nov-2018 15:15:37 Downloading: http://repo.spring.io/milestone/org/springframework/boot/spring-boot-starter-logging/2.1.0.BUILD-SNAPSHOT/maven-metadata.xml
06-Nov-2018 15:15:37 Downloading: http://repo.spring.io/snapshot/org/springframework/boot/spring-boot-starter-logging/2.1.0.BUILD-SNAPSHOT/maven-metadata.xml
06-Nov-2018 15:15:37 Downloaded: http://repo.spring.io/snapshot/org/springframework/boot/spring-boot-starter-logging/2.1.0.BUILD-SNAPSHOT/maven-metadata.xml (2 KB at 5.8 KB/sec)
06-Nov-2018 15:15:38 Downloading: http://repo.spring.io/snapshot/org/springframework/boot/spring-boot-starter-jdbc/2.1.0.BUILD-SNAPSHOT/maven-metadata.xml
06-Nov-2018 15:15:38 Downloading: http://repo.spring.io/milestone/org/springframework/boot/spring-boot-starter-jdbc/2.1.0.BUILD-SNAPSHOT/maven-metadata.xml
06-Nov-2018 15:15:38 Downloaded: http://repo.spring.io/snapshot/org/springframework/boot/spring-boot-starter-jdbc/2.1.0.BUILD-SNAPSHOT/maven-metadata.xml (2 KB at 5.7 KB/sec)
06-Nov-2018 15:15:38 Downloading: http://repo.spring.io/milestone/org/springframework/cloud/spring-cloud-task-core/2.1.0.BUILD-SNAPSHOT/maven-metadata.xml
06-Nov-2018 15:15:38 Downloading: http://repo.spring.io/snapshot/org/springframework/cloud/spring-cloud-task-core/2.1.0.BUILD-SNAPSHOT/maven-metadata.xml
06-Nov-2018 15:15:38 Downloaded: http://repo.spring.io/snapshot/org/springframework/cloud/spring-cloud-task-core/2.1.0.BUILD-SNAPSHOT/maven-metadata.xml (2 KB at 4.6 KB/sec)
06-Nov-2018 15:15:38 Downloading: http://repo.spring.io/milestone/org/springframework/cloud/spring-cloud-task-core/2.1.0.BUILD-SNAPSHOT/spring-cloud-task-core-2.1.0.BUILD-20181102.221200-15.pom
06-Nov-2018 15:15:38 Downloading: http://repo.spring.io/snapshot/org/springframework/cloud/spring-cloud-task-core/2.1.0.BUILD-SNAPSHOT/spring-cloud-task-core-2.1.0.BUILD-20181102.221200-15.pom
06-Nov-2018 15:15:38 [WARNING] The POM for org.springframework.cloud:spring-cloud-task-core:jar:2.1.0.BUILD-20181102.221200-15 is missing, no dependency information available
06-Nov-2018 15:15:38 Downloading: http://repo.spring.io/snapshot/org/springframework/cloud/spring-cloud-task-batch/2.1.0.BUILD-SNAPSHOT/maven-metadata.xml
06-Nov-2018 15:15:38 Downloading: http://repo.spring.io/milestone/org/springframework/cloud/spring-cloud-task-batch/2.1.0.BUILD-SNAPSHOT/maven-metadata.xml
06-Nov-2018 15:15:39 Downloaded: http://repo.spring.io/snapshot/org/springframework/cloud/spring-cloud-task-batch/2.1.0.BUILD-SNAPSHOT/maven-metadata.xml (2 KB at 4.1 KB/sec)
06-Nov-2018 15:15:39 Downloading: http://repo.spring.io/milestone/org/springframework/cloud/spring-cloud-task-batch/2.1.0.BUILD-SNAPSHOT/spring-cloud-task-batch-2.1.0.BUILD-20181102.221200-15.pom
06-Nov-2018 15:15:39 Downloading: http://repo.spring.io/snapshot/org/springframework/cloud/spring-cloud-task-batch/2.1.0.BUILD-SNAPSHOT/spring-cloud-task-batch-2.1.0.BUILD-20181102.221200-15.pom
06-Nov-2018 15:15:39 [WARNING] The POM for org.springframework.cloud:spring-cloud-task-batch:jar:2.1.0.BUILD-20181102.221200-15 is missing, no dependency information available
06-Nov-2018 15:15:39 Downloading: http://repo.spring.io/milestone/org/springframework/boot/spring-boot-starter-test/2.1.0.BUILD-SNAPSHOT/maven-metadata.xml
06-Nov-2018 15:15:39 Downloading: http://repo.spring.io/snapshot/org/springframework/boot/spring-boot-starter-test/2.1.0.BUILD-SNAPSHOT/maven-metadata.xml
06-Nov-2018 15:15:39 Downloaded: http://repo.spring.io/snapshot/org/springframework/boot/spring-boot-starter-test/2.1.0.BUILD-SNAPSHOT/maven-metadata.xml (2 KB at 5.2 KB/sec)
06-Nov-2018 15:15:39 Downloading: http://repo.spring.io/milestone/org/springframework/boot/spring-boot-test/2.1.0.BUILD-SNAPSHOT/maven-metadata.xml
06-Nov-2018 15:15:39 Downloading: http://repo.spring.io/snapshot/org/springframework/boot/spring-boot-test/2.1.0.BUILD-SNAPSHOT/maven-metadata.xml
06-Nov-2018 15:15:39 Downloaded: http://repo.spring.io/snapshot/org/springframework/boot/spring-boot-test/2.1.0.BUILD-SNAPSHOT/maven-metadata.xml (2 KB at 8.4 KB/sec)
06-Nov-2018 15:15:39 Downloading: http://repo.spring.io/milestone/org/springframework/boot/spring-boot-test-autoconfigure/2.1.0.BUILD-SNAPSHOT/maven-metadata.xml
06-Nov-2018 15:15:39 Downloading: http://repo.spring.io/snapshot/org/springframework/boot/spring-boot-test-autoconfigure/2.1.0.BUILD-SNAPSHOT/maven-metadata.xml
06-Nov-2018 15:15:39 Downloaded: http://repo.spring.io/snapshot/org/springframework/boot/spring-boot-test-autoconfigure/2.1.0.BUILD-SNAPSHOT/maven-metadata.xml (2 KB at 7.0 KB/sec)
06-Nov-2018 15:15:40 Downloading: http://repo.spring.io/snapshot/org/springframework/cloud/spring-cloud-task-core/2.1.0.BUILD-SNAPSHOT/spring-cloud-task-core-2.1.0.BUILD-20181102.221200-15.jar
06-Nov-2018 15:15:40 Downloading: http://repo.spring.io/snapshot/org/springframework/cloud/spring-cloud-task-batch/2.1.0.BUILD-SNAPSHOT/spring-cloud-task-batch-2.1.0.BUILD-20181102.221200-15.jar
06-Nov-2018 15:15:40 Downloaded: http://repo.spring.io/snapshot/org/springframework/cloud/spring-cloud-task-batch/2.1.0.BUILD-SNAPSHOT/spring-cloud-task-batch-2.1.0.BUILD-20181102.221200-15.jar (39 KB at 121.6 KB/sec)
06-Nov-2018 15:15:40 Downloaded: http://repo.spring.io/snapshot/org/springframework/cloud/spring-cloud-task-core/2.1.0.BUILD-SNAPSHOT/spring-cloud-task-core-2.1.0.BUILD-20181102.221200-15.jar (94 KB at 198.2 KB/sec)
06-Nov-2018 15:15:40 [INFO]
06-Nov-2018 15:15:40 [INFO] --- maven-clean-plugin:3.1.0:clean (default-clean) @ ingest ---
06-Nov-2018 15:15:40 [INFO]
06-Nov-2018 15:15:40 [INFO] --- maven-resources-plugin:3.1.0:resources (default-resources) @ ingest ---
06-Nov-2018 15:15:41 [INFO] Using 'UTF-8' encoding to copy filtered resources.
06-Nov-2018 15:15:41 [INFO] Copying 1 resource
06-Nov-2018 15:15:41 [INFO] Copying 2 resources
06-Nov-2018 15:15:41 [INFO]
06-Nov-2018 15:15:41 [INFO] --- maven-compiler-plugin:3.7.0:compile (default-compile) @ ingest ---
06-Nov-2018 15:15:41 [INFO] Changes detected - recompiling the module!
06-Nov-2018 15:15:41 [INFO] Compiling 5 source files to /opt/bamboo-home/xml-data/build-dir/SCD-FILEINGEST-BSCDL/batch/file-ingest/target/classes
06-Nov-2018 15:15:42 [INFO]
06-Nov-2018 15:15:42 [INFO] --- maven-resources-plugin:3.1.0:testResources (default-testResources) @ ingest ---
06-Nov-2018 15:15:42 [INFO] Using 'UTF-8' encoding to copy filtered resources.
06-Nov-2018 15:15:42 [INFO] skip non existing resourceDirectory /opt/bamboo-home/xml-data/build-dir/SCD-FILEINGEST-BSCDL/batch/file-ingest/src/test/resources
06-Nov-2018 15:15:42 [INFO]
06-Nov-2018 15:15:42 [INFO] --- maven-compiler-plugin:3.7.0:testCompile (default-testCompile) @ ingest ---
06-Nov-2018 15:15:42 [INFO] Changes detected - recompiling the module!
06-Nov-2018 15:15:42 [INFO] Compiling 3 source files to /opt/bamboo-home/xml-data/build-dir/SCD-FILEINGEST-BSCDL/batch/file-ingest/target/test-classes
06-Nov-2018 15:15:42 [INFO]
06-Nov-2018 15:15:42 [INFO] --- maven-surefire-plugin:2.22.1:test (default-test) @ ingest ---
06-Nov-2018 15:15:42 [INFO]
06-Nov-2018 15:15:42 [INFO] -------------------------------------------------------
06-Nov-2018 15:15:42 [INFO]  T E S T S
06-Nov-2018 15:15:42 [INFO] -------------------------------------------------------
06-Nov-2018 15:15:43 [INFO] Running io.spring.cloud.dataflow.ingest.mapper.fieldset.PersonFieldSetMapperTests
06-Nov-2018 15:15:43 [INFO] Tests run: 1, Failures: 0, Errors: 0, Skipped: 0, Time elapsed: 0.069 s - in io.spring.cloud.dataflow.ingest.mapper.fieldset.PersonFieldSetMapperTests
06-Nov-2018 15:15:43 [INFO] Running io.spring.cloud.dataflow.ingest.BatchApplicationTests
06-Nov-2018 15:15:43 15:15:43.430 [main] DEBUG org.springframework.test.context.junit4.SpringJUnit4ClassRunner - SpringJUnit4ClassRunner constructor called with [class io.spring.cloud.dataflow.ingest.BatchApplicationTests]
06-Nov-2018 15:15:43 15:15:43.436 [main] DEBUG org.springframework.test.context.BootstrapUtils - Instantiating CacheAwareContextLoaderDelegate from class [org.springframework.test.context.cache.DefaultCacheAwareContextLoaderDelegate]
06-Nov-2018 15:15:43 15:15:43.446 [main] DEBUG org.springframework.test.context.BootstrapUtils - Instantiating BootstrapContext using constructor [public org.springframework.test.context.support.DefaultBootstrapContext(java.lang.Class,org.springframework.test.context.CacheAwareContextLoaderDelegate)]
06-Nov-2018 15:15:43 15:15:43.458 [main] DEBUG org.springframework.test.context.BootstrapUtils - Instantiating TestContextBootstrapper for test class [io.spring.cloud.dataflow.ingest.BatchApplicationTests] from class [org.springframework.test.context.support.DefaultTestContextBootstrapper]
06-Nov-2018 15:15:43 15:15:43.494 [main] DEBUG org.springframework.test.context.support.AbstractDelegatingSmartContextLoader - Delegating to AnnotationConfigContextLoader to process context configuration [ContextConfigurationAttributes@2353b3e6 declaringClass = 'io.spring.cloud.dataflow.ingest.BatchApplicationTests', classes = '{class io.spring.cloud.dataflow.ingest.config.BatchConfiguration, class io.spring.cloud.dataflow.ingest.BatchApplicationTests$BatchTestConfiguration}', locations = '{}', inheritLocations = true, initializers = '{}', inheritInitializers = true, name = [null], contextLoaderClass = 'org.springframework.test.context.ContextLoader'].
06-Nov-2018 15:15:43 15:15:43.563 [main] DEBUG org.springframework.test.context.support.ActiveProfilesUtils - Could not find an 'annotation declaring class' for annotation type [org.springframework.test.context.ActiveProfiles] and class [io.spring.cloud.dataflow.ingest.BatchApplicationTests]
06-Nov-2018 15:15:43 15:15:43.564 [main] DEBUG org.springframework.test.context.support.DefaultTestContextBootstrapper - @TestExecutionListeners is not present for class [io.spring.cloud.dataflow.ingest.BatchApplicationTests]: using defaults.
06-Nov-2018 15:15:43 15:15:43.565 [main] INFO org.springframework.test.context.support.DefaultTestContextBootstrapper - Loaded default TestExecutionListener class names from location [META-INF/spring.factories]: [org.springframework.boot.test.mock.mockito.MockitoTestExecutionListener, org.springframework.boot.test.mock.mockito.ResetMocksTestExecutionListener, org.springframework.boot.test.autoconfigure.restdocs.RestDocsTestExecutionListener, org.springframework.boot.test.autoconfigure.web.client.MockRestServiceServerResetTestExecutionListener, org.springframework.boot.test.autoconfigure.web.servlet.MockMvcPrintOnlyOnFailureTestExecutionListener, org.springframework.boot.test.autoconfigure.web.servlet.WebDriverTestExecutionListener, org.springframework.test.context.web.ServletTestExecutionListener, org.springframework.test.context.support.DirtiesContextBeforeModesTestExecutionListener, org.springframework.test.context.support.DependencyInjectionTestExecutionListener, org.springframework.test.context.support.DirtiesContextTestExecutionListener, org.springframework.test.context.transaction.TransactionalTestExecutionListener, org.springframework.test.context.jdbc.SqlScriptsTestExecutionListener]
06-Nov-2018 15:15:43 15:15:43.587 [main] DEBUG org.springframework.test.context.support.DefaultTestContextBootstrapper - Skipping candidate TestExecutionListener [org.springframework.test.context.web.ServletTestExecutionListener] due to a missing dependency. Specify custom listener classes or make the default listener classes and their required dependencies available. Offending class: [javax/servlet/ServletContext]
06-Nov-2018 15:15:43 15:15:43.595 [main] INFO org.springframework.test.context.support.DefaultTestContextBootstrapper - Using TestExecutionListeners: [org.springframework.test.context.support.DirtiesContextBeforeModesTestExecutionListener@701fc37a, org.springframework.boot.test.mock.mockito.MockitoTestExecutionListener@4148db48, org.springframework.test.context.support.DependencyInjectionTestExecutionListener@282003e1, org.springframework.test.context.support.DirtiesContextTestExecutionListener@7fad8c79, org.springframework.test.context.transaction.TransactionalTestExecutionListener@71a794e5, org.springframework.test.context.jdbc.SqlScriptsTestExecutionListener@76329302, org.springframework.boot.test.mock.mockito.ResetMocksTestExecutionListener@5e25a92e, org.springframework.boot.test.autoconfigure.restdocs.RestDocsTestExecutionListener@4df828d7, org.springframework.boot.test.autoconfigure.web.client.MockRestServiceServerResetTestExecutionListener@b59d31, org.springframework.boot.test.autoconfigure.web.servlet.MockMvcPrintOnlyOnFailureTestExecutionListener@62fdb4a6, org.springframework.boot.test.autoconfigure.web.servlet.WebDriverTestExecutionListener@11e21d0e]
06-Nov-2018 15:15:43 15:15:43.598 [main] DEBUG org.springframework.test.annotation.ProfileValueUtils - Retrieved @ProfileValueSourceConfiguration [null] for test class [io.spring.cloud.dataflow.ingest.BatchApplicationTests]
06-Nov-2018 15:15:43 15:15:43.598 [main] DEBUG org.springframework.test.annotation.ProfileValueUtils - Retrieved ProfileValueSource type [class org.springframework.test.annotation.SystemProfileValueSource] for class [io.spring.cloud.dataflow.ingest.BatchApplicationTests]
06-Nov-2018 15:15:43 15:15:43.599 [main] DEBUG org.springframework.test.annotation.ProfileValueUtils - Retrieved @ProfileValueSourceConfiguration [null] for test class [io.spring.cloud.dataflow.ingest.BatchApplicationTests]
06-Nov-2018 15:15:43 15:15:43.599 [main] DEBUG org.springframework.test.annotation.ProfileValueUtils - Retrieved ProfileValueSource type [class org.springframework.test.annotation.SystemProfileValueSource] for class [io.spring.cloud.dataflow.ingest.BatchApplicationTests]
06-Nov-2018 15:15:43 15:15:43.599 [main] DEBUG org.springframework.test.annotation.ProfileValueUtils - Retrieved @ProfileValueSourceConfiguration [null] for test class [io.spring.cloud.dataflow.ingest.BatchApplicationTests]
06-Nov-2018 15:15:43 15:15:43.600 [main] DEBUG org.springframework.test.annotation.ProfileValueUtils - Retrieved ProfileValueSource type [class org.springframework.test.annotation.SystemProfileValueSource] for class [io.spring.cloud.dataflow.ingest.BatchApplicationTests]
06-Nov-2018 15:15:43 15:15:43.601 [main] DEBUG org.springframework.test.context.support.AbstractDirtiesContextTestExecutionListener - Before test class: context [DefaultTestContext@6a396c1e testClass = BatchApplicationTests, testInstance = [null], testMethod = [null], testException = [null], mergedContextConfiguration = [MergedContextConfiguration@6c3f5566 testClass = BatchApplicationTests, locations = '{}', classes = '{class io.spring.cloud.dataflow.ingest.config.BatchConfiguration, class io.spring.cloud.dataflow.ingest.BatchApplicationTests$BatchTestConfiguration}', contextInitializerClasses = '[]', activeProfiles = '{}', propertySourceLocations = '{}', propertySourceProperties = '{}', contextCustomizers = set[org.springframework.boot.test.context.filter.ExcludeFilterContextCustomizer@782663d3, org.springframework.boot.test.json.DuplicateJsonObjectContextCustomizerFactory$DuplicateJsonObjectContextCustomizer@25bbf683, org.springframework.boot.test.mock.mockito.MockitoContextCustomizer@0, org.springframework.boot.test.autoconfigure.properties.PropertyMappingContextCustomizer@0, org.springframework.boot.test.autoconfigure.web.servlet.WebDriverContextCustomizerFactory$Customizer@6dde5c8c], contextLoader = 'org.springframework.test.context.support.DelegatingSmartContextLoader', parent = [null]], attributes = map[[empty]]], class annotated with @DirtiesContext [false] with mode [null].
06-Nov-2018 15:15:43 15:15:43.602 [main] DEBUG org.springframework.test.annotation.ProfileValueUtils - Retrieved @ProfileValueSourceConfiguration [null] for test class [io.spring.cloud.dataflow.ingest.BatchApplicationTests]
06-Nov-2018 15:15:43 15:15:43.602 [main] DEBUG org.springframework.test.annotation.ProfileValueUtils - Retrieved ProfileValueSource type [class org.springframework.test.annotation.SystemProfileValueSource] for class [io.spring.cloud.dataflow.ingest.BatchApplicationTests]
06-Nov-2018 15:15:43 15:15:43.607 [main] DEBUG org.springframework.test.context.support.DependencyInjectionTestExecutionListener - Performing dependency injection for test context [[DefaultTestContext@6a396c1e testClass = BatchApplicationTests, testInstance = io.spring.cloud.dataflow.ingest.BatchApplicationTests@3c0a50da, testMethod = [null], testException = [null], mergedContextConfiguration = [MergedContextConfiguration@6c3f5566 testClass = BatchApplicationTests, locations = '{}', classes = '{class io.spring.cloud.dataflow.ingest.config.BatchConfiguration, class io.spring.cloud.dataflow.ingest.BatchApplicationTests$BatchTestConfiguration}', contextInitializerClasses = '[]', activeProfiles = '{}', propertySourceLocations = '{}', propertySourceProperties = '{}', contextCustomizers = set[org.springframework.boot.test.context.filter.ExcludeFilterContextCustomizer@782663d3, org.springframework.boot.test.json.DuplicateJsonObjectContextCustomizerFactory$DuplicateJsonObjectContextCustomizer@25bbf683, org.springframework.boot.test.mock.mockito.MockitoContextCustomizer@0, org.springframework.boot.test.autoconfigure.properties.PropertyMappingContextCustomizer@0, org.springframework.boot.test.autoconfigure.web.servlet.WebDriverContextCustomizerFactory$Customizer@6dde5c8c], contextLoader = 'org.springframework.test.context.support.DelegatingSmartContextLoader', parent = [null]], attributes = map[[empty]]]].
06-Nov-2018 15:15:43 15:15:43.609 [main] DEBUG org.springframework.test.context.support.AbstractDelegatingSmartContextLoader - Delegating to AnnotationConfigContextLoader to load context from [MergedContextConfiguration@6c3f5566 testClass = BatchApplicationTests, locations = '{}', classes = '{class io.spring.cloud.dataflow.ingest.config.BatchConfiguration, class io.spring.cloud.dataflow.ingest.BatchApplicationTests$BatchTestConfiguration}', contextInitializerClasses = '[]', activeProfiles = '{}', propertySourceLocations = '{}', propertySourceProperties = '{}', contextCustomizers = set[org.springframework.boot.test.context.filter.ExcludeFilterContextCustomizer@782663d3, org.springframework.boot.test.json.DuplicateJsonObjectContextCustomizerFactory$DuplicateJsonObjectContextCustomizer@25bbf683, org.springframework.boot.test.mock.mockito.MockitoContextCustomizer@0, org.springframework.boot.test.autoconfigure.properties.PropertyMappingContextCustomizer@0, org.springframework.boot.test.autoconfigure.web.servlet.WebDriverContextCustomizerFactory$Customizer@6dde5c8c], contextLoader = 'org.springframework.test.context.support.DelegatingSmartContextLoader', parent = [null]].
06-Nov-2018 15:15:43 15:15:43.609 [main] DEBUG org.springframework.test.context.support.AbstractGenericContextLoader - Loading ApplicationContext for merged context configuration [[MergedContextConfiguration@6c3f5566 testClass = BatchApplicationTests, locations = '{}', classes = '{class io.spring.cloud.dataflow.ingest.config.BatchConfiguration, class io.spring.cloud.dataflow.ingest.BatchApplicationTests$BatchTestConfiguration}', contextInitializerClasses = '[]', activeProfiles = '{}', propertySourceLocations = '{}', propertySourceProperties = '{}', contextCustomizers = set[org.springframework.boot.test.context.filter.ExcludeFilterContextCustomizer@782663d3, org.springframework.boot.test.json.DuplicateJsonObjectContextCustomizerFactory$DuplicateJsonObjectContextCustomizer@25bbf683, org.springframework.boot.test.mock.mockito.MockitoContextCustomizer@0, org.springframework.boot.test.autoconfigure.properties.PropertyMappingContextCustomizer@0, org.springframework.boot.test.autoconfigure.web.servlet.WebDriverContextCustomizerFactory$Customizer@6dde5c8c], contextLoader = 'org.springframework.test.context.support.DelegatingSmartContextLoader', parent = [null]]].
06-Nov-2018 15:15:43 15:15:43.653 [main] DEBUG org.springframework.core.env.StandardEnvironment - Activating profiles []
06-Nov-2018 15:15:43 15:15:43.653 [main] DEBUG org.springframework.test.context.support.AnnotationConfigContextLoader - Registering annotated classes: {class io.spring.cloud.dataflow.ingest.config.BatchConfiguration, class io.spring.cloud.dataflow.ingest.BatchApplicationTests$BatchTestConfiguration}
06-Nov-2018 15:15:43 15:15:43.711 [main] DEBUG org.springframework.context.support.GenericApplicationContext - Refreshing org.springframework.context.support.GenericApplicationContext@c8e4bb0
06-Nov-2018 15:15:43 15:15:43.729 [main] DEBUG org.springframework.beans.factory.support.DefaultListableBeanFactory - Creating shared instance of singleton bean 'org.springframework.context.annotation.internalConfigurationAnnotationProcessor'
06-Nov-2018 15:15:44 15:15:44.312 [main] DEBUG org.springframework.beans.factory.support.DefaultListableBeanFactory - Creating shared instance of singleton bean 'org.springframework.boot.autoconfigure.condition.BeanTypeRegistry'
06-Nov-2018 15:15:44 15:15:44.438 [main] ERROR org.springframework.test.context.TestContextManager - Caught exception while allowing TestExecutionListener [org.springframework.test.context.support.DependencyInjectionTestExecutionListener@282003e1] to prepare test instance [io.spring.cloud.dataflow.ingest.BatchApplicationTests@3c0a50da]
06-Nov-2018 15:15:44 java.lang.IllegalStateException: Failed to load ApplicationContext
06-Nov-2018 15:15:44         at org.springframework.test.context.cache.DefaultCacheAwareContextLoaderDelegate.loadContext(DefaultCacheAwareContextLoaderDelegate.java:125)
06-Nov-2018 15:15:44         at org.springframework.test.context.support.DefaultTestContext.getApplicationContext(DefaultTestContext.java:108)
06-Nov-2018 15:15:44         at org.springframework.test.context.support.DependencyInjectionTestExecutionListener.injectDependencies(DependencyInjectionTestExecutionListener.java:118)
06-Nov-2018 15:15:44         at org.springframework.test.context.support.DependencyInjectionTestExecutionListener.prepareTestInstance(DependencyInjectionTestExecutionListener.java:83)
06-Nov-2018 15:15:44         at org.springframework.test.context.TestContextManager.prepareTestInstance(TestContextManager.java:246)
06-Nov-2018 15:15:44         at org.springframework.test.context.junit4.SpringJUnit4ClassRunner.createTest(SpringJUnit4ClassRunner.java:227)
06-Nov-2018 15:15:44         at org.springframework.test.context.junit4.SpringJUnit4ClassRunner$1.runReflectiveCall(SpringJUnit4ClassRunner.java:289)
06-Nov-2018 15:15:44         at org.junit.internal.runners.model.ReflectiveCallable.run(ReflectiveCallable.java:12)
06-Nov-2018 15:15:44         at org.springframework.test.context.junit4.SpringJUnit4ClassRunner.methodBlock(SpringJUnit4ClassRunner.java:291)
06-Nov-2018 15:15:44         at org.springframework.test.context.junit4.SpringJUnit4ClassRunner.runChild(SpringJUnit4ClassRunner.java:246)
06-Nov-2018 15:15:44         at org.springframework.test.context.junit4.SpringJUnit4ClassRunner.runChild(SpringJUnit4ClassRunner.java:97)
06-Nov-2018 15:15:44         at org.junit.runners.ParentRunner$3.run(ParentRunner.java:290)
06-Nov-2018 15:15:44         at org.junit.runners.ParentRunner$1.schedule(ParentRunner.java:71)
06-Nov-2018 15:15:44         at org.junit.runners.ParentRunner.runChildren(ParentRunner.java:288)
06-Nov-2018 15:15:44         at org.junit.runners.ParentRunner.access$000(ParentRunner.java:58)
06-Nov-2018 15:15:44         at org.junit.runners.ParentRunner$2.evaluate(ParentRunner.java:268)
06-Nov-2018 15:15:44         at org.springframework.test.context.junit4.statements.RunBeforeTestClassCallbacks.evaluate(RunBeforeTestClassCallbacks.java:61)
06-Nov-2018 15:15:44         at org.springframework.test.context.junit4.statements.RunAfterTestClassCallbacks.evaluate(RunAfterTestClassCallbacks.java:70)
06-Nov-2018 15:15:44         at org.junit.runners.ParentRunner.run(ParentRunner.java:363)
06-Nov-2018 15:15:44         at org.springframework.test.context.junit4.SpringJUnit4ClassRunner.run(SpringJUnit4ClassRunner.java:190)
06-Nov-2018 15:15:44         at org.apache.maven.surefire.junit4.JUnit4Provider.execute(JUnit4Provider.java:365)
06-Nov-2018 15:15:44         at org.apache.maven.surefire.junit4.JUnit4Provider.executeWithRerun(JUnit4Provider.java:273)
06-Nov-2018 15:15:44         at org.apache.maven.surefire.junit4.JUnit4Provider.executeTestSet(JUnit4Provider.java:238)
06-Nov-2018 15:15:44         at org.apache.maven.surefire.junit4.JUnit4Provider.invoke(JUnit4Provider.java:159)
06-Nov-2018 15:15:44         at org.apache.maven.surefire.booter.ForkedBooter.invokeProviderInSameClassLoader(ForkedBooter.java:384)
06-Nov-2018 15:15:44         at org.apache.maven.surefire.booter.ForkedBooter.runSuitesInProcess(ForkedBooter.java:345)
06-Nov-2018 15:15:44         at org.apache.maven.surefire.booter.ForkedBooter.execute(ForkedBooter.java:126)
06-Nov-2018 15:15:44         at org.apache.maven.surefire.booter.ForkedBooter.main(ForkedBooter.java:418)
06-Nov-2018 15:15:44 Caused by: java.lang.IllegalStateException: Error processing condition on org.springframework.cloud.task.configuration.ResourceLoadingAutoConfiguration$LocalResourceLoadingAutoConfiguration.delegatingResourceLoader
06-Nov-2018 15:15:44         at org.springframework.boot.autoconfigure.condition.SpringBootCondition.matches(SpringBootCondition.java:64)
06-Nov-2018 15:15:44         at org.springframework.context.annotation.ConditionEvaluator.shouldSkip(ConditionEvaluator.java:108)
06-Nov-2018 15:15:44         at org.springframework.context.annotation.ConfigurationClassBeanDefinitionReader.loadBeanDefinitionsForBeanMethod(ConfigurationClassBeanDefinitionReader.java:181)
06-Nov-2018 15:15:44         at org.springframework.context.annotation.ConfigurationClassBeanDefinitionReader.loadBeanDefinitionsForConfigurationClass(ConfigurationClassBeanDefinitionReader.java:141)
06-Nov-2018 15:15:44         at org.springframework.context.annotation.ConfigurationClassBeanDefinitionReader.loadBeanDefinitions(ConfigurationClassBeanDefinitionReader.java:117)
06-Nov-2018 15:15:44         at org.springframework.context.annotation.ConfigurationClassPostProcessor.processConfigBeanDefinitions(ConfigurationClassPostProcessor.java:327)
06-Nov-2018 15:15:44         at org.springframework.context.annotation.ConfigurationClassPostProcessor.postProcessBeanDefinitionRegistry(ConfigurationClassPostProcessor.java:232)
06-Nov-2018 15:15:44         at org.springframework.context.support.PostProcessorRegistrationDelegate.invokeBeanDefinitionRegistryPostProcessors(PostProcessorRegistrationDelegate.java:275)
06-Nov-2018 15:15:44         at org.springframework.context.support.PostProcessorRegistrationDelegate.invokeBeanFactoryPostProcessors(PostProcessorRegistrationDelegate.java:95)
06-Nov-2018 15:15:44         at org.springframework.context.support.AbstractApplicationContext.invokeBeanFactoryPostProcessors(AbstractApplicationContext.java:691)
06-Nov-2018 15:15:44         at org.springframework.context.support.AbstractApplicationContext.refresh(AbstractApplicationContext.java:528)
06-Nov-2018 15:15:44         at org.springframework.test.context.support.AbstractGenericContextLoader.loadContext(AbstractGenericContextLoader.java:128)
06-Nov-2018 15:15:44         at org.springframework.test.context.support.AbstractGenericContextLoader.loadContext(AbstractGenericContextLoader.java:60)
06-Nov-2018 15:15:44         at org.springframework.test.context.support.AbstractDelegatingSmartContextLoader.delegateLoading(AbstractDelegatingSmartContextLoader.java:275)
06-Nov-2018 15:15:44         at org.springframework.test.context.support.AbstractDelegatingSmartContextLoader.loadContext(AbstractDelegatingSmartContextLoader.java:243)
06-Nov-2018 15:15:44         at org.springframework.test.context.cache.DefaultCacheAwareContextLoaderDelegate.loadContextInternal(DefaultCacheAwareContextLoaderDelegate.java:99)
06-Nov-2018 15:15:44         at org.springframework.test.context.cache.DefaultCacheAwareContextLoaderDelegate.loadContext(DefaultCacheAwareContextLoaderDelegate.java:117)
06-Nov-2018 15:15:44         ... 27 common frames omitted
06-Nov-2018 15:15:44 Caused by: java.lang.IllegalStateException: @ConditionalOnMissingBean did not specify a bean using type, name or annotation and the attempt to deduce the bean's type failed
06-Nov-2018 15:15:44         at org.springframework.boot.autoconfigure.condition.OnBeanCondition$BeanSearchSpec.validate(OnBeanCondition.java:451)
06-Nov-2018 15:15:44         at org.springframework.boot.autoconfigure.condition.OnBeanCondition$BeanSearchSpec.<init>(OnBeanCondition.java:441)
06-Nov-2018 15:15:44         at org.springframework.boot.autoconfigure.condition.OnBeanCondition$BeanSearchSpec.<init>(OnBeanCondition.java:416)
06-Nov-2018 15:15:44         at org.springframework.boot.autoconfigure.condition.OnBeanCondition.getMatchOutcome(OnBeanCondition.java:158)
06-Nov-2018 15:15:44         at org.springframework.boot.autoconfigure.condition.SpringBootCondition.matches(SpringBootCondition.java:47)
06-Nov-2018 15:15:44         ... 43 common frames omitted
06-Nov-2018 15:15:44 Caused by: org.springframework.boot.autoconfigure.condition.OnBeanCondition$BeanTypeDeductionException: Failed to deduce bean type for org.springframework.cloud.task.configuration.ResourceLoadingAutoConfiguration$LocalResourceLoadingAutoConfiguration.delegatingResourceLoader
06-Nov-2018 15:15:44         at org.springframework.boot.autoconfigure.condition.OnBeanCondition$BeanSearchSpec.addDeducedBeanTypeForBeanMethod(OnBeanCondition.java:496)
06-Nov-2018 15:15:44         at org.springframework.boot.autoconfigure.condition.OnBeanCondition$BeanSearchSpec.addDeducedBeanType(OnBeanCondition.java:483)
06-Nov-2018 15:15:44         at org.springframework.boot.autoconfigure.condition.OnBeanCondition$BeanSearchSpec.<init>(OnBeanCondition.java:435)
06-Nov-2018 15:15:44         ... 46 common frames omitted
06-Nov-2018 15:15:44 Caused by: java.lang.ClassNotFoundException: org.springframework.cloud.deployer.resource.support.DelegatingResourceLoader
06-Nov-2018 15:15:44         at java.net.URLClassLoader.findClass(URLClassLoader.java:381)
06-Nov-2018 15:15:44         at java.lang.ClassLoader.loadClass(ClassLoader.java:424)
06-Nov-2018 15:15:44         at sun.misc.Launcher$AppClassLoader.loadClass(Launcher.java:335)
06-Nov-2018 15:15:44         at java.lang.ClassLoader.loadClass(ClassLoader.java:357)
06-Nov-2018 15:15:44         at java.lang.Class.forName0(Native Method)
06-Nov-2018 15:15:44         at java.lang.Class.forName(Class.java:348)
06-Nov-2018 15:15:44         at org.springframework.util.ClassUtils.forName(ClassUtils.java:275)
06-Nov-2018 15:15:44         at org.springframework.boot.autoconfigure.condition.OnBeanCondition$BeanSearchSpec.getReturnType(OnBeanCondition.java:505)
06-Nov-2018 15:15:44         at org.springframework.boot.autoconfigure.condition.OnBeanCondition$BeanSearchSpec.addDeducedBeanTypeForBeanMethod(OnBeanCondition.java:491)
06-Nov-2018 15:15:44         ... 48 common frames omitted
06-Nov-2018 15:15:44 15:15:44.443 [main] DEBUG org.springframework.test.annotation.ProfileValueUtils - Retrieved @ProfileValueSourceConfiguration [null] for test class [io.spring.cloud.dataflow.ingest.BatchApplicationTests]
06-Nov-2018 15:15:44 15:15:44.444 [main] DEBUG org.springframework.test.annotation.ProfileValueUtils - Retrieved ProfileValueSource type [class org.springframework.test.annotation.SystemProfileValueSource] for class [io.spring.cloud.dataflow.ingest.BatchApplicationTests]
06-Nov-2018 15:15:44 15:15:44.444 [main] DEBUG org.springframework.test.context.support.DependencyInjectionTestExecutionListener - Performing dependency injection for test context [[DefaultTestContext@6a396c1e testClass = BatchApplicationTests, testInstance = io.spring.cloud.dataflow.ingest.BatchApplicationTests@1b75c2e3, testMethod = [null], testException = [null], mergedContextConfiguration = [MergedContextConfiguration@6c3f5566 testClass = BatchApplicationTests, locations = '{}', classes = '{class io.spring.cloud.dataflow.ingest.config.BatchConfiguration, class io.spring.cloud.dataflow.ingest.BatchApplicationTests$BatchTestConfiguration}', contextInitializerClasses = '[]', activeProfiles = '{}', propertySourceLocations = '{}', propertySourceProperties = '{}', contextCustomizers = set[org.springframework.boot.test.context.filter.ExcludeFilterContextCustomizer@782663d3, org.springframework.boot.test.json.DuplicateJsonObjectContextCustomizerFactory$DuplicateJsonObjectContextCustomizer@25bbf683, org.springframework.boot.test.mock.mockito.MockitoContextCustomizer@0, org.springframework.boot.test.autoconfigure.properties.PropertyMappingContextCustomizer@0, org.springframework.boot.test.autoconfigure.web.servlet.WebDriverContextCustomizerFactory$Customizer@6dde5c8c], contextLoader = 'org.springframework.test.context.support.DelegatingSmartContextLoader', parent = [null]], attributes = map[[empty]]]].
06-Nov-2018 15:15:44 15:15:44.444 [main] DEBUG org.springframework.test.context.support.AbstractDelegatingSmartContextLoader - Delegating to AnnotationConfigContextLoader to load context from [MergedContextConfiguration@6c3f5566 testClass = BatchApplicationTests, locations = '{}', classes = '{class io.spring.cloud.dataflow.ingest.config.BatchConfiguration, class io.spring.cloud.dataflow.ingest.BatchApplicationTests$BatchTestConfiguration}', contextInitializerClasses = '[]', activeProfiles = '{}', propertySourceLocations = '{}', propertySourceProperties = '{}', contextCustomizers = set[org.springframework.boot.test.context.filter.ExcludeFilterContextCustomizer@782663d3, org.springframework.boot.test.json.DuplicateJsonObjectContextCustomizerFactory$DuplicateJsonObjectContextCustomizer@25bbf683, org.springframework.boot.test.mock.mockito.MockitoContextCustomizer@0, org.springframework.boot.test.autoconfigure.properties.PropertyMappingContextCustomizer@0, org.springframework.boot.test.autoconfigure.web.servlet.WebDriverContextCustomizerFactory$Customizer@6dde5c8c], contextLoader = 'org.springframework.test.context.support.DelegatingSmartContextLoader', parent = [null]].
06-Nov-2018 15:15:44 15:15:44.445 [main] DEBUG org.springframework.test.context.support.AbstractGenericContextLoader - Loading ApplicationContext for merged context configuration [[MergedContextConfiguration@6c3f5566 testClass = BatchApplicationTests, locations = '{}', classes = '{class io.spring.cloud.dataflow.ingest.config.BatchConfiguration, class io.spring.cloud.dataflow.ingest.BatchApplicationTests$BatchTestConfiguration}', contextInitializerClasses = '[]', activeProfiles = '{}', propertySourceLocations = '{}', propertySourceProperties = '{}', contextCustomizers = set[org.springframework.boot.test.context.filter.ExcludeFilterContextCustomizer@782663d3, org.springframework.boot.test.json.DuplicateJsonObjectContextCustomizerFactory$DuplicateJsonObjectContextCustomizer@25bbf683, org.springframework.boot.test.mock.mockito.MockitoContextCustomizer@0, org.springframework.boot.test.autoconfigure.properties.PropertyMappingContextCustomizer@0, org.springframework.boot.test.autoconfigure.web.servlet.WebDriverContextCustomizerFactory$Customizer@6dde5c8c], contextLoader = 'org.springframework.test.context.support.DelegatingSmartContextLoader', parent = [null]]].
06-Nov-2018 15:15:44 15:15:44.445 [main] DEBUG org.springframework.core.env.StandardEnvironment - Activating profiles []
06-Nov-2018 15:15:44 15:15:44.445 [main] DEBUG org.springframework.test.context.support.AnnotationConfigContextLoader - Registering annotated classes: {class io.spring.cloud.dataflow.ingest.config.BatchConfiguration, class io.spring.cloud.dataflow.ingest.BatchApplicationTests$BatchTestConfiguration}
06-Nov-2018 15:15:44 15:15:44.447 [main] DEBUG org.springframework.context.support.GenericApplicationContext - Refreshing org.springframework.context.support.GenericApplicationContext@1984b1f
06-Nov-2018 15:15:44 15:15:44.448 [main] DEBUG org.springframework.beans.factory.support.DefaultListableBeanFactory - Creating shared instance of singleton bean 'org.springframework.context.annotation.internalConfigurationAnnotationProcessor'
06-Nov-2018 15:15:44 15:15:44.603 [main] DEBUG org.springframework.beans.factory.support.DefaultListableBeanFactory - Creating shared instance of singleton bean 'org.springframework.boot.autoconfigure.condition.BeanTypeRegistry'
06-Nov-2018 15:15:44 15:15:44.657 [main] ERROR org.springframework.test.context.TestContextManager - Caught exception while allowing TestExecutionListener [org.springframework.test.context.support.DependencyInjectionTestExecutionListener@282003e1] to prepare test instance [io.spring.cloud.dataflow.ingest.BatchApplicationTests@1b75c2e3]
06-Nov-2018 15:15:44 java.lang.IllegalStateException: Failed to load ApplicationContext
06-Nov-2018 15:15:44         at org.springframework.test.context.cache.DefaultCacheAwareContextLoaderDelegate.loadContext(DefaultCacheAwareContextLoaderDelegate.java:125)
06-Nov-2018 15:15:44         at org.springframework.test.context.support.DefaultTestContext.getApplicationContext(DefaultTestContext.java:108)
06-Nov-2018 15:15:44         at org.springframework.test.context.support.DependencyInjectionTestExecutionListener.injectDependencies(DependencyInjectionTestExecutionListener.java:118)
06-Nov-2018 15:15:44         at org.springframework.test.context.support.DependencyInjectionTestExecutionListener.prepareTestInstance(DependencyInjectionTestExecutionListener.java:83)
06-Nov-2018 15:15:44         at org.springframework.test.context.TestContextManager.prepareTestInstance(TestContextManager.java:246)
06-Nov-2018 15:15:44         at org.springframework.test.context.junit4.SpringJUnit4ClassRunner.createTest(SpringJUnit4ClassRunner.java:227)
06-Nov-2018 15:15:44         at org.springframework.test.context.junit4.SpringJUnit4ClassRunner$1.runReflectiveCall(SpringJUnit4ClassRunner.java:289)
06-Nov-2018 15:15:44         at org.junit.internal.runners.model.ReflectiveCallable.run(ReflectiveCallable.java:12)
06-Nov-2018 15:15:44         at org.springframework.test.context.junit4.SpringJUnit4ClassRunner.methodBlock(SpringJUnit4ClassRunner.java:291)
06-Nov-2018 15:15:44         at org.springframework.test.context.junit4.SpringJUnit4ClassRunner.runChild(SpringJUnit4ClassRunner.java:246)
06-Nov-2018 15:15:44         at org.springframework.test.context.junit4.SpringJUnit4ClassRunner.runChild(SpringJUnit4ClassRunner.java:97)
06-Nov-2018 15:15:44         at org.junit.runners.ParentRunner$3.run(ParentRunner.java:290)
06-Nov-2018 15:15:44         at org.junit.runners.ParentRunner$1.schedule(ParentRunner.java:71)
06-Nov-2018 15:15:44         at org.junit.runners.ParentRunner.runChildren(ParentRunner.java:288)
06-Nov-2018 15:15:44         at org.junit.runners.ParentRunner.access$000(ParentRunner.java:58)
06-Nov-2018 15:15:44         at org.junit.runners.ParentRunner$2.evaluate(ParentRunner.java:268)
06-Nov-2018 15:15:44         at org.springframework.test.context.junit4.statements.RunBeforeTestClassCallbacks.evaluate(RunBeforeTestClassCallbacks.java:61)
06-Nov-2018 15:15:44         at org.springframework.test.context.junit4.statements.RunAfterTestClassCallbacks.evaluate(RunAfterTestClassCallbacks.java:70)
06-Nov-2018 15:15:44         at org.junit.runners.ParentRunner.run(ParentRunner.java:363)
06-Nov-2018 15:15:44         at org.springframework.test.context.junit4.SpringJUnit4ClassRunner.run(SpringJUnit4ClassRunner.java:190)
06-Nov-2018 15:15:44         at org.apache.maven.surefire.junit4.JUnit4Provider.execute(JUnit4Provider.java:365)
06-Nov-2018 15:15:44         at org.apache.maven.surefire.junit4.JUnit4Provider.executeWithRerun(JUnit4Provider.java:273)
06-Nov-2018 15:15:44         at org.apache.maven.surefire.junit4.JUnit4Provider.executeTestSet(JUnit4Provider.java:238)
06-Nov-2018 15:15:44         at org.apache.maven.surefire.junit4.JUnit4Provider.invoke(JUnit4Provider.java:159)
06-Nov-2018 15:15:44         at org.apache.maven.surefire.booter.ForkedBooter.invokeProviderInSameClassLoader(ForkedBooter.java:384)
06-Nov-2018 15:15:44         at org.apache.maven.surefire.booter.ForkedBooter.runSuitesInProcess(ForkedBooter.java:345)
06-Nov-2018 15:15:44         at org.apache.maven.surefire.booter.ForkedBooter.execute(ForkedBooter.java:126)
06-Nov-2018 15:15:44         at org.apache.maven.surefire.booter.ForkedBooter.main(ForkedBooter.java:418)
06-Nov-2018 15:15:44 Caused by: java.lang.IllegalStateException: Error processing condition on org.springframework.cloud.task.configuration.ResourceLoadingAutoConfiguration$LocalResourceLoadingAutoConfiguration.delegatingResourceLoader
06-Nov-2018 15:15:44         at org.springframework.boot.autoconfigure.condition.SpringBootCondition.matches(SpringBootCondition.java:64)
06-Nov-2018 15:15:44         at org.springframework.context.annotation.ConditionEvaluator.shouldSkip(ConditionEvaluator.java:108)
06-Nov-2018 15:15:44         at org.springframework.context.annotation.ConfigurationClassBeanDefinitionReader.loadBeanDefinitionsForBeanMethod(ConfigurationClassBeanDefinitionReader.java:181)
06-Nov-2018 15:15:44         at org.springframework.context.annotation.ConfigurationClassBeanDefinitionReader.loadBeanDefinitionsForConfigurationClass(ConfigurationClassBeanDefinitionReader.java:141)
06-Nov-2018 15:15:44         at org.springframework.context.annotation.ConfigurationClassBeanDefinitionReader.loadBeanDefinitions(ConfigurationClassBeanDefinitionReader.java:117)
06-Nov-2018 15:15:44         at org.springframework.context.annotation.ConfigurationClassPostProcessor.processConfigBeanDefinitions(ConfigurationClassPostProcessor.java:327)
06-Nov-2018 15:15:44         at org.springframework.context.annotation.ConfigurationClassPostProcessor.postProcessBeanDefinitionRegistry(ConfigurationClassPostProcessor.java:232)
06-Nov-2018 15:15:44         at org.springframework.context.support.PostProcessorRegistrationDelegate.invokeBeanDefinitionRegistryPostProcessors(PostProcessorRegistrationDelegate.java:275)
06-Nov-2018 15:15:44         at org.springframework.context.support.PostProcessorRegistrationDelegate.invokeBeanFactoryPostProcessors(PostProcessorRegistrationDelegate.java:95)
06-Nov-2018 15:15:44         at org.springframework.context.support.AbstractApplicationContext.invokeBeanFactoryPostProcessors(AbstractApplicationContext.java:691)
06-Nov-2018 15:15:44         at org.springframework.context.support.AbstractApplicationContext.refresh(AbstractApplicationContext.java:528)
06-Nov-2018 15:15:44         at org.springframework.test.context.support.AbstractGenericContextLoader.loadContext(AbstractGenericContextLoader.java:128)
06-Nov-2018 15:15:44         at org.springframework.test.context.support.AbstractGenericContextLoader.loadContext(AbstractGenericContextLoader.java:60)
06-Nov-2018 15:15:44         at org.springframework.test.context.support.AbstractDelegatingSmartContextLoader.delegateLoading(AbstractDelegatingSmartContextLoader.java:275)
06-Nov-2018 15:15:44         at org.springframework.test.context.support.AbstractDelegatingSmartContextLoader.loadContext(AbstractDelegatingSmartContextLoader.java:243)
06-Nov-2018 15:15:44         at org.springframework.test.context.cache.DefaultCacheAwareContextLoaderDelegate.loadContextInternal(DefaultCacheAwareContextLoaderDelegate.java:99)
06-Nov-2018 15:15:44         at org.springframework.test.context.cache.DefaultCacheAwareContextLoaderDelegate.loadContext(DefaultCacheAwareContextLoaderDelegate.java:117)
06-Nov-2018 15:15:44         ... 27 common frames omitted
06-Nov-2018 15:15:44 Caused by: java.lang.IllegalStateException: @ConditionalOnMissingBean did not specify a bean using type, name or annotation and the attempt to deduce the bean's type failed
06-Nov-2018 15:15:44         at org.springframework.boot.autoconfigure.condition.OnBeanCondition$BeanSearchSpec.validate(OnBeanCondition.java:451)
06-Nov-2018 15:15:44         at org.springframework.boot.autoconfigure.condition.OnBeanCondition$BeanSearchSpec.<init>(OnBeanCondition.java:441)
06-Nov-2018 15:15:44         at org.springframework.boot.autoconfigure.condition.OnBeanCondition$BeanSearchSpec.<init>(OnBeanCondition.java:416)
06-Nov-2018 15:15:44         at org.springframework.boot.autoconfigure.condition.OnBeanCondition.getMatchOutcome(OnBeanCondition.java:158)
06-Nov-2018 15:15:44         at org.springframework.boot.autoconfigure.condition.SpringBootCondition.matches(SpringBootCondition.java:47)
06-Nov-2018 15:15:44         ... 43 common frames omitted
06-Nov-2018 15:15:44 Caused by: org.springframework.boot.autoconfigure.condition.OnBeanCondition$BeanTypeDeductionException: Failed to deduce bean type for org.springframework.cloud.task.configuration.ResourceLoadingAutoConfiguration$LocalResourceLoadingAutoConfiguration.delegatingResourceLoader
06-Nov-2018 15:15:44         at org.springframework.boot.autoconfigure.condition.OnBeanCondition$BeanSearchSpec.addDeducedBeanTypeForBeanMethod(OnBeanCondition.java:496)
06-Nov-2018 15:15:44         at org.springframework.boot.autoconfigure.condition.OnBeanCondition$BeanSearchSpec.addDeducedBeanType(OnBeanCondition.java:483)
06-Nov-2018 15:15:44         at org.springframework.boot.autoconfigure.condition.OnBeanCondition$BeanSearchSpec.<init>(OnBeanCondition.java:435)
06-Nov-2018 15:15:44         ... 46 common frames omitted
06-Nov-2018 15:15:44 Caused by: java.lang.ClassNotFoundException: org.springframework.cloud.deployer.resource.support.DelegatingResourceLoader
06-Nov-2018 15:15:44         at java.net.URLClassLoader.findClass(URLClassLoader.java:381)
06-Nov-2018 15:15:44         at java.lang.ClassLoader.loadClass(ClassLoader.java:424)
06-Nov-2018 15:15:44         at sun.misc.Launcher$AppClassLoader.loadClass(Launcher.java:335)
06-Nov-2018 15:15:44         at java.lang.ClassLoader.loadClass(ClassLoader.java:357)
06-Nov-2018 15:15:44         at java.lang.Class.forName0(Native Method)
06-Nov-2018 15:15:44         at java.lang.Class.forName(Class.java:348)
06-Nov-2018 15:15:44         at org.springframework.util.ClassUtils.forName(ClassUtils.java:275)
06-Nov-2018 15:15:44         at org.springframework.boot.autoconfigure.condition.OnBeanCondition$BeanSearchSpec.getReturnType(OnBeanCondition.java:505)
06-Nov-2018 15:15:44         at org.springframework.boot.autoconfigure.condition.OnBeanCondition$BeanSearchSpec.addDeducedBeanTypeForBeanMethod(OnBeanCondition.java:491)
06-Nov-2018 15:15:44         ... 48 common frames omitted
06-Nov-2018 15:15:44 15:15:44.659 [main] DEBUG org.springframework.test.context.support.AbstractDirtiesContextTestExecutionListener - After test class: context [DefaultTestContext@6a396c1e testClass = BatchApplicationTests, testInstance = [null], testMethod = [null], testException = [null], mergedContextConfiguration = [MergedContextConfiguration@6c3f5566 testClass = BatchApplicationTests, locations = '{}', classes = '{class io.spring.cloud.dataflow.ingest.config.BatchConfiguration, class io.spring.cloud.dataflow.ingest.BatchApplicationTests$BatchTestConfiguration}', contextInitializerClasses = '[]', activeProfiles = '{}', propertySourceLocations = '{}', propertySourceProperties = '{}', contextCustomizers = set[org.springframework.boot.test.context.filter.ExcludeFilterContextCustomizer@782663d3, org.springframework.boot.test.json.DuplicateJsonObjectContextCustomizerFactory$DuplicateJsonObjectContextCustomizer@25bbf683, org.springframework.boot.test.mock.mockito.MockitoContextCustomizer@0, org.springframework.boot.test.autoconfigure.properties.PropertyMappingContextCustomizer@0, org.springframework.boot.test.autoconfigure.web.servlet.WebDriverContextCustomizerFactory$Customizer@6dde5c8c], contextLoader = 'org.springframework.test.context.support.DelegatingSmartContextLoader', parent = [null]], attributes = map[[empty]]], class annotated with @DirtiesContext [false] with mode [null].
06-Nov-2018 15:15:44 [ERROR] Tests run: 2, Failures: 0, Errors: 2, Skipped: 0, Time elapsed: 1.358 s <<< FAILURE! - in io.spring.cloud.dataflow.ingest.BatchApplicationTests
06-Nov-2018 15:15:44 [ERROR] testBatchConfigurationFail(io.spring.cloud.dataflow.ingest.BatchApplicationTests)  Time elapsed: 0.004 s  <<< ERROR!
06-Nov-2018 15:15:44 java.lang.IllegalStateException: Failed to load ApplicationContext
06-Nov-2018 15:15:44 Caused by: java.lang.IllegalStateException: Error processing condition on org.springframework.cloud.task.configuration.ResourceLoadingAutoConfiguration$LocalResourceLoadingAutoConfiguration.delegatingResourceLoader
06-Nov-2018 15:15:44 Caused by: java.lang.IllegalStateException: @ConditionalOnMissingBean did not specify a bean using type, name or annotation and the attempt to deduce the bean's type failed
06-Nov-2018 15:15:44 Caused by: org.springframework.boot.autoconfigure.condition.OnBeanCondition$BeanTypeDeductionException: Failed to deduce bean type for org.springframework.cloud.task.configuration.ResourceLoadingAutoConfiguration$LocalResourceLoadingAutoConfiguration.delegatingResourceLoader
06-Nov-2018 15:15:44 Caused by: java.lang.ClassNotFoundException: org.springframework.cloud.deployer.resource.support.DelegatingResourceLoader
06-Nov-2018 15:15:44
06-Nov-2018 15:15:44 [ERROR] testBatchDataProcessing(io.spring.cloud.dataflow.ingest.BatchApplicationTests)  Time elapsed: 0 s  <<< ERROR!
06-Nov-2018 15:15:44 java.lang.IllegalStateException: Failed to load ApplicationContext
06-Nov-2018 15:15:44 Caused by: java.lang.IllegalStateException: Error processing condition on org.springframework.cloud.task.configuration.ResourceLoadingAutoConfiguration$LocalResourceLoadingAutoConfiguration.delegatingResourceLoader
06-Nov-2018 15:15:44 Caused by: java.lang.IllegalStateException: @ConditionalOnMissingBean did not specify a bean using type, name or annotation and the attempt to deduce the bean's type failed
06-Nov-2018 15:15:44 Caused by: org.springframework.boot.autoconfigure.condition.OnBeanCondition$BeanTypeDeductionException: Failed to deduce bean type for org.springframework.cloud.task.configuration.ResourceLoadingAutoConfiguration$LocalResourceLoadingAutoConfiguration.delegatingResourceLoader
06-Nov-2018 15:15:44 Caused by: java.lang.ClassNotFoundException: org.springframework.cloud.deployer.resource.support.DelegatingResourceLoader
06-Nov-2018 15:15:44
06-Nov-2018 15:15:44 [INFO] Running io.spring.cloud.dataflow.ingest.processor.PersonItemProcessorTests
06-Nov-2018 15:15:44 15:15:44.662 [main] INFO io.spring.cloud.dataflow.ingest.processor.PersonItemProcessor - Processed: First name: jane , last name: doe into: First name: JANE , last name: DOE
06-Nov-2018 15:15:44 [INFO] Tests run: 1, Failures: 0, Errors: 0, Skipped: 0, Time elapsed: 0 s - in io.spring.cloud.dataflow.ingest.processor.PersonItemProcessorTests
06-Nov-2018 15:15:45 [INFO]
06-Nov-2018 15:15:45 [INFO] Results:
06-Nov-2018 15:15:45 [INFO]
06-Nov-2018 15:15:45 [ERROR] Errors:
06-Nov-2018 15:15:45 [ERROR]   BatchApplicationTests.testBatchConfigurationFail » IllegalState Failed to load...
06-Nov-2018 15:15:45 [ERROR]   BatchApplicationTests.testBatchDataProcessing » IllegalState Failed to load Ap...
06-Nov-2018 15:15:45 [INFO]
06-Nov-2018 15:15:45 [ERROR] Tests run: 4, Failures: 0, Errors: 2, Skipped: 0
06-Nov-2018 15:15:45 [INFO]
06-Nov-2018 15:15:45 [INFO] ------------------------------------------------------------------------
06-Nov-2018 15:15:45 [INFO] BUILD FAILURE
06-Nov-2018 15:15:45 [INFO] ------------------------------------------------------------------------
06-Nov-2018 15:15:45 [INFO] Total time: 10.990s
06-Nov-2018 15:15:45 [INFO] Finished at: Tue Nov 06 15:15:45 UTC 2018
06-Nov-2018 15:15:45 [INFO] Final Memory: 28M/278M
06-Nov-2018 15:15:45 [INFO] ------------------------------------------------------------------------
06-Nov-2018 15:15:45 [WARNING] The requested profile "full" could not be activated because it does not exist.
06-Nov-2018 15:15:45 [ERROR] Failed to execute goal org.apache.maven.plugins:maven-surefire-plugin:2.22.1:test (default-test) on project ingest: There are test failures.
06-Nov-2018 15:15:45 [ERROR]
06-Nov-2018 15:15:45 [ERROR] Please refer to /opt/bamboo-home/xml-data/build-dir/SCD-FILEINGEST-BSCDL/batch/file-ingest/target/surefire-reports for the individual test results.
06-Nov-2018 15:15:45 [ERROR] Please refer to dump files (if any exist) [date].dump, [date]-jvmRun[N].dump and [date].dumpstream.
06-Nov-2018 15:15:45 [ERROR] -> [Help 1]
06-Nov-2018 15:15:45 [ERROR]
06-Nov-2018 15:15:45 [ERROR] To see the full stack trace of the errors, re-run Maven with the -e switch.
06-Nov-2018 15:15:45 [ERROR] Re-run Maven using the -X switch to enable full debug logging.
06-Nov-2018 15:15:45 [ERROR]
06-Nov-2018 15:15:45 [ERROR] For more information about the errors and possible solutions, please read the following articles:
06-Nov-2018 15:15:45 [ERROR] [Help 1] http://cwiki.apache.org/confluence/display/MAVEN/MojoFailureException
06-Nov-2018 15:15:45
06-Nov-2018 15:15:45 Failing task since return code of [/opt/jdk-8/bin/java -cp /opt/maven-3.0/boot/plexus-classworlds-2.4.jar -Dclassworlds.conf=/tmp/artifactoryM28139988754865809853conf -DbuildInfoConfig.propertiesFile=/tmp/buildInfo1366649788314850843.properties -Xmx2048m -XX:MaxPermSize=768m -Dmaven.home=/opt/maven-3.0 -Dmaven.multiModuleProjectDirectory=/opt/bamboo-home/xml-data/build-dir/SCD-FILEINGEST-BSCDL/batch/file-ingest org.codehaus.plexus.classworlds.launcher.Launcher clean install -Pfull --batch-mode -Dartifactory.publish.password=********] was 1 while expected 0
06-Nov-2018 15:15:45 Parsing test results under /opt/bamboo-home/xml-data/build-dir/SCD-FILEINGEST-BSCDL...
06-Nov-2018 15:15:45 Finished task 'Build and publish Spring Cloud Data Flow Sample - File Ingest' with result: Failed
06-Nov-2018 15:15:45 Running post build plugin 'Docker Container Cleanup'
06-Nov-2018 15:15:45 Running post build plugin 'NCover Results Collector'
06-Nov-2018 15:15:45 Running post build plugin 'Artifactory Release Management Staging'
06-Nov-2018 15:15:45 Running post build plugin 'Artifactory Build Info Copier'
06-Nov-2018 15:15:45 Running post build plugin 'Artifactory Gradle Properties Info Copier'
06-Nov-2018 15:15:45 Running post build plugin 'Clover Results Collector'
06-Nov-2018 15:15:45 Running post build plugin 'npm Cache Cleanup'
06-Nov-2018 15:15:45 Running post build plugin 'Artifact Copier'
06-Nov-2018 15:15:45 Publishing an artifact: Test Results
06-Nov-2018 15:15:45 Finished publishing of artifact Job artifact: [Test Results], pattern: [**/target/surefire-reports/**/*.*] in 54.77 ms
06-Nov-2018 15:15:45 Successfully removed working directory at '/opt/bamboo-home/xml-data/build-dir/SCD-FILEINGEST-BSCDL'
06-Nov-2018 15:15:45 Finalising the build...
06-Nov-2018 15:15:45 Stopping timer.
06-Nov-2018 15:15:45 Build SCD-FILEINGEST-BSCDL-12 completed.
06-Nov-2018 15:15:45 Running on server: post build plugin 'NCover Results Collector'
06-Nov-2018 15:15:45 Running on server: post build plugin 'Build Hanging Detection Configuration'
06-Nov-2018 15:15:45 Running on server: post build plugin 'Clover Delta Calculator'
06-Nov-2018 15:15:45 Running on server: post build plugin 'Maven Dependencies Postprocessor'
06-Nov-2018 15:15:45 All post build plugins have finished
06-Nov-2018 15:15:45 Generating build results summary...
06-Nov-2018 15:15:45 Saving build results to disk...
06-Nov-2018 15:15:45 Logging substituted variables...
06-Nov-2018 15:15:45 Indexing build results...
06-Nov-2018 15:15:45 Finished building SCD-FILEINGEST-BSCDL-12.