Targeting Kubernetes version 1.10 on master branch

Build: #345 failed Child of SCD-BMASTER-2393

Stages & jobs

  1. Default Stage

  2. Build Server Docker Image and upload

Logs

The following logs have been generated by the jobs in this plan.
  • Expand all
  • Collapse all
Job Logs
Collapse Build Spring Cloud Dataflow Kubernetes Server Default Stage Download or View
10-Dec-2018 14:13:02 [INFO] spring-cloud-dataflow-server-kubernetes-parent ..... SUCCESS [  1.710 s]
10-Dec-2018 14:13:02 [INFO] spring-cloud-dataflow-server-kubernetes-autoconfig . SUCCESS [ 18.011 s]
10-Dec-2018 14:13:02 [INFO] Kubernetes Data Flow Server ........................ FAILURE [ 15.263 s]
10-Dec-2018 14:13:02 [INFO] spring-cloud-dataflow-server-kubernetes-docs ....... SKIPPED
10-Dec-2018 14:13:02 [INFO] ------------------------------------------------------------------------
10-Dec-2018 14:13:02 [INFO] BUILD FAILURE
10-Dec-2018 14:13:02 [INFO] ------------------------------------------------------------------------
10-Dec-2018 14:13:02 [INFO] Total time: 37.353 s
10-Dec-2018 14:13:02 [INFO] Finished at: 2018-12-10T14:13:02Z
10-Dec-2018 14:13:03 [INFO] Final Memory: 101M/680M
10-Dec-2018 14:13:03 [INFO] ------------------------------------------------------------------------
10-Dec-2018 14:13:03 [ERROR] Failed to execute goal org.apache.maven.plugins:maven-surefire-plugin:2.22.0:test (default-test) on project spring-cloud-dataflow-server-kubernetes: There are test failures.
10-Dec-2018 14:13:03 [ERROR]
10-Dec-2018 14:13:03 [ERROR] Please refer to /opt/bamboo-home/xml-data/build-dir/SCD-K8S110BMASTER-JOB1/spring-cloud-dataflow-server-kubernetes/target/surefire-reports for the individual test results.
10-Dec-2018 14:13:03 [ERROR] Please refer to dump files (if any exist) [date]-jvmRun[N].dump, [date].dumpstream and [date]-jvmRun[N].dumpstream.
10-Dec-2018 14:13:03 [ERROR] -> [Help 1]
10-Dec-2018 14:13:03 [ERROR]
10-Dec-2018 14:13:03 [ERROR] To see the full stack trace of the errors, re-run Maven with the -e switch.
10-Dec-2018 14:13:03 [ERROR] Re-run Maven using the -X switch to enable full debug logging.
10-Dec-2018 14:13:03 [ERROR]
10-Dec-2018 14:13:03 [ERROR] For more information about the errors and possible solutions, please read the following articles:
10-Dec-2018 14:13:03 [ERROR] [Help 1] http://cwiki.apache.org/confluence/display/MAVEN/MojoFailureException
10-Dec-2018 14:13:03 [ERROR]
10-Dec-2018 14:13:03 [ERROR] After correcting the problems, you can resume the build with the command
10-Dec-2018 14:13:03 [ERROR]   mvn <goals> -rf :spring-cloud-dataflow-server-kubernetes