Targeting Kubernetes version 1.10 on master branch

Build: #350 failed Child of SCD-BMASTER-2398

Stages & jobs

  1. Default Stage

  2. Build Server Docker Image and upload

Test results

  • 1 test in total
  • 1 test failed
  • < 1 second taken in total.
Existing test failures 1
Status Test Failing since View job Duration
java.lang.IllegalStateException: Failed to load ApplicationContext
Caused by: org.springframework.beans.factory.BeanCreationException: Error creating bean with name 'appDeployer' defined in class path resource [org/springframework/cloud/deployer/spi/kubernetes/KubernetesAutoConfiguration.class]: Post-processing of merged bean definition failed; nested exception is java.lang.IllegalStateException: Failed to introspect Class [org.springframework.cloud.deployer.spi.kubernetes.KubernetesAppDeployer] from ClassLoader [sun.misc.Launcher$AppClassLoader@18b4aac2]
Caused by: java.lang.IllegalStateException: Failed to introspect Class [org.springframework.cloud.deployer.spi.kubernetes.KubernetesAppDeployer] from ClassLoader [sun.misc.Launcher$AppClassLoader@18b4aac2]
Caused by: java.lang.NoClassDefFoundError: io/fabric8/kubernetes/api/model/apps/Deployment
Caused by: java.lang.ClassNotFoundException: io.fabric8.kubernetes.api.model.apps.Deployment