Targeting Kubernetes version 1.10 on master branch

Build: #353 failed Child of SCD-BMASTER-2401

Stages & jobs

  1. Default Stage

  2. Build Server Docker Image and upload

Build result summary

Details

Completed
Duration
42 seconds
Labels
None
Revision
cade3a5a89b5891995aa4f4176654daab4d586ec cade3a5a89b5891995aa4f4176654daab4d586ec
Total tests
1
Failing since
#344 (Child of SCD-BMASTER-2391)
Fixed in
#356 (Changes by Chris Schaefer)

Tests

Responsible

This build has been failing since #344
No one has taken responsibility

Tests

Existing test failures 1
Status Test Failing since View job Duration
java.lang.IllegalStateException: Failed to load ApplicationContext
Caused by: org.springframework.beans.factory.BeanCreationException: Error creating bean with name 'appDeployer' defined in class path resource [org/springframework/cloud/deployer/spi/kubernetes/KubernetesAutoConfiguration.class]: Post-processing of merged bean definition failed; nested exception is java.lang.IllegalStateException: Failed to introspect Class [org.springframework.cloud.deployer.spi.kubernetes.KubernetesAppDeployer] from ClassLoader [sun.misc.Launcher$AppClassLoader@18b4aac2]
Caused by: java.lang.IllegalStateException: Failed to introspect Class [org.springframework.cloud.deployer.spi.kubernetes.KubernetesAppDeployer] from ClassLoader [sun.misc.Launcher$AppClassLoader@18b4aac2]
Caused by: java.lang.NoClassDefFoundError: io/fabric8/kubernetes/api/model/apps/Deployment
Caused by: java.lang.ClassNotFoundException: io.fabric8.kubernetes.api.model.apps.Deployment