Targeting Kubernetes version 1.10 on master branch

Build: #355 failed Child of SCD-BMASTER-2403

Stages & jobs

  1. Default Stage

  2. Build Server Docker Image and upload

Logs

The following logs have been generated by the jobs in this plan.
  • Expand all
  • Collapse all
Job Logs
Collapse Build Spring Cloud Dataflow Kubernetes Server Default Stage Download or View
12-Dec-2018 14:03:58 [INFO] spring-cloud-dataflow-server-kubernetes-parent ..... SUCCESS [  1.405 s]
12-Dec-2018 14:03:58 [INFO] spring-cloud-dataflow-server-kubernetes-autoconfig . SUCCESS [ 13.085 s]
12-Dec-2018 14:03:58 [INFO] Kubernetes Data Flow Server ........................ FAILURE [ 16.777 s]
12-Dec-2018 14:03:58 [INFO] spring-cloud-dataflow-server-kubernetes-docs ....... SKIPPED
12-Dec-2018 14:03:58 [INFO] ------------------------------------------------------------------------
12-Dec-2018 14:03:58 [INFO] BUILD FAILURE
12-Dec-2018 14:03:58 [INFO] ------------------------------------------------------------------------
12-Dec-2018 14:03:58 [INFO] Total time: 33.756 s
12-Dec-2018 14:03:58 [INFO] Finished at: 2018-12-12T14:03:58Z
12-Dec-2018 14:03:59 [INFO] Final Memory: 101M/750M
12-Dec-2018 14:03:59 [INFO] ------------------------------------------------------------------------
12-Dec-2018 14:03:59 [ERROR] Failed to execute goal org.apache.maven.plugins:maven-surefire-plugin:2.22.0:test (default-test) on project spring-cloud-dataflow-server-kubernetes: There are test failures.
12-Dec-2018 14:03:59 [ERROR]
12-Dec-2018 14:03:59 [ERROR] Please refer to /opt/bamboo-home/xml-data/build-dir/SCD-K8S110BMASTER-JOB1/spring-cloud-dataflow-server-kubernetes/target/surefire-reports for the individual test results.
12-Dec-2018 14:03:59 [ERROR] Please refer to dump files (if any exist) [date]-jvmRun[N].dump, [date].dumpstream and [date]-jvmRun[N].dumpstream.
12-Dec-2018 14:03:59 [ERROR] -> [Help 1]
12-Dec-2018 14:03:59 [ERROR]
12-Dec-2018 14:03:59 [ERROR] To see the full stack trace of the errors, re-run Maven with the -e switch.
12-Dec-2018 14:03:59 [ERROR] Re-run Maven using the -X switch to enable full debug logging.
12-Dec-2018 14:03:59 [ERROR]
12-Dec-2018 14:03:59 [ERROR] For more information about the errors and possible solutions, please read the following articles:
12-Dec-2018 14:03:59 [ERROR] [Help 1] http://cwiki.apache.org/confluence/display/MAVEN/MojoFailureException
12-Dec-2018 14:03:59 [ERROR]
12-Dec-2018 14:03:59 [ERROR] After correcting the problems, you can resume the build with the command
12-Dec-2018 14:03:59 [ERROR]   mvn <goals> -rf :spring-cloud-dataflow-server-kubernetes