Targeting Kubernetes version 1.10 on master branch

Build: #344 failed

Job: Build Spring Cloud Dataflow Kubernetes Server failed

Stages & jobs

  1. Default Stage

  2. Build Server Docker Image and upload

Context loads: Test case result

The below summarizes the result of the test "Context loads" in build 344 of Spring Cloud Data Flow - Server - Kubernetes 1.10 - Master - Build Spring Cloud Dataflow Kubernetes Server. View test case history
Description
Context loads
Test class
org.springframework.cloud.dataflow.server.kubernetes.ContextLoadsTests
Method
contextLoads
Duration
< 1 sec
Status
Failed (New Failure)

Error Log

java.lang.IllegalStateException: Failed to load ApplicationContext
Caused by: org.springframework.beans.factory.BeanCreationException: Error creating bean with name 'appDeployer' defined in class path resource [org/springframework/cloud/deployer/spi/kubernetes/KubernetesAutoConfiguration.class]: Post-processing of merged bean definition failed; nested exception is java.lang.IllegalStateException: Failed to introspect Class [org.springframework.cloud.deployer.spi.kubernetes.KubernetesAppDeployer] from ClassLoader [sun.misc.Launcher$AppClassLoader@18b4aac2]
Caused by: java.lang.IllegalStateException: Failed to introspect Class [org.springframework.cloud.deployer.spi.kubernetes.KubernetesAppDeployer] from ClassLoader [sun.misc.Launcher$AppClassLoader@18b4aac2]
Caused by: java.lang.NoClassDefFoundError: io/fabric8/kubernetes/api/model/apps/Deployment
Caused by: java.lang.ClassNotFoundException: io.fabric8.kubernetes.api.model.apps.Deployment