Targeting Kubernetes version 1.10 on master branch

Build: #355 failed

Job: Build Spring Cloud Dataflow Kubernetes Server failed

Stages & jobs

  1. Default Stage

  2. Build Server Docker Image and upload

Build log

The build generated 915 lines of output. Download or view full build log

12-Dec-2018 14:03:20 Build Spring Cloud Data Flow - Server - Kubernetes 1.10 - Master - Build Spring Cloud Dataflow Kubernetes Server #355 (SCD-K8S110BMASTER-JOB1-355) started building on agent bamboo-10.af.pivotal.io
12-Dec-2018 14:03:20 Remote agent on host bamboo-10.af.pivotal.io
12-Dec-2018 14:03:20 Build working directory is /opt/bamboo-home/xml-data/build-dir/SCD-K8S110BMASTER-JOB1
12-Dec-2018 14:03:20 Executing build Spring Cloud Data Flow - Server - Kubernetes 1.10 - Master - Build Spring Cloud Dataflow Kubernetes Server #355 (SCD-K8S110BMASTER-JOB1-355)
12-Dec-2018 14:03:20 Starting task 'Checkout Default Repository' of type 'com.atlassian.bamboo.plugins.vcs:task.vcs.checkout'
12-Dec-2018 14:03:20 Checking out into /opt/bamboo-home/xml-data/build-dir/SCD-K8S110BMASTER-JOB1
12-Dec-2018 14:03:20 Updating source code to revision: cade3a5a89b5891995aa4f4176654daab4d586ec
12-Dec-2018 14:03:20 Creating local git repository in '/opt/bamboo-home/xml-data/build-dir/SCD-K8S110BMASTER-JOB1/.git'.
12-Dec-2018 14:03:20 Initialized empty Git repository in /opt/bamboo-home/xml-data/build-dir/SCD-K8S110BMASTER-JOB1/.git/
12-Dec-2018 14:03:21 Fetching 'refs/heads/master' from 'https://github.com/spring-cloud/spring-cloud-dataflow-server-kubernetes.git'.
12-Dec-2018 14:03:23 From https://github.com/spring-cloud/spring-cloud-dataflow-server-kubernetes
12-Dec-2018 14:03:23 * [new branch]      master     -> master
12-Dec-2018 14:03:23 * [new tag]         v1.0.0.M1  -> v1.0.0.M1
12-Dec-2018 14:03:23 * [new tag]         v1.0.0.M2  -> v1.0.0.M2
12-Dec-2018 14:03:23 * [new tag]         v1.0.0.RC1 -> v1.0.0.RC1
12-Dec-2018 14:03:23 * [new tag]         v1.0.0.RELEASE -> v1.0.0.RELEASE
12-Dec-2018 14:03:23 * [new tag]         v1.0.1.RELEASE -> v1.0.1.RELEASE
12-Dec-2018 14:03:23 * [new tag]         v1.1.0.M1  -> v1.1.0.M1
12-Dec-2018 14:03:23 * [new tag]         v1.1.0.M2  -> v1.1.0.M2
12-Dec-2018 14:03:23 * [new tag]         v1.1.0.RC1 -> v1.1.0.RC1
12-Dec-2018 14:03:23 * [new tag]         v1.1.0.RELEASE -> v1.1.0.RELEASE
12-Dec-2018 14:03:23 * [new tag]         v1.1.1.RELEASE -> v1.1.1.RELEASE
12-Dec-2018 14:03:23 * [new tag]         v1.1.2.RELEASE -> v1.1.2.RELEASE
12-Dec-2018 14:03:23 * [new tag]         v1.2.0.M1  -> v1.2.0.M1
12-Dec-2018 14:03:23 * [new tag]         v1.2.0.M2  -> v1.2.0.M2
12-Dec-2018 14:03:23 * [new tag]         v1.2.0.RC1 -> v1.2.0.RC1
12-Dec-2018 14:03:23 * [new tag]         v1.2.0.RC2 -> v1.2.0.RC2
12-Dec-2018 14:03:23 * [new tag]         v1.2.0.RELEASE -> v1.2.0.RELEASE
12-Dec-2018 14:03:23 * [new tag]         v1.2.1.RELEASE -> v1.2.1.RELEASE
12-Dec-2018 14:03:23 * [new tag]         v1.2.2.RELEASE -> v1.2.2.RELEASE
12-Dec-2018 14:03:23 * [new tag]         v1.3.0.M1  -> v1.3.0.M1
12-Dec-2018 14:03:23 * [new tag]         v1.3.0.M2  -> v1.3.0.M2
12-Dec-2018 14:03:23 * [new tag]         v1.3.0.M3  -> v1.3.0.M3
12-Dec-2018 14:03:23 * [new tag]         v1.3.0.RC1 -> v1.3.0.RC1
12-Dec-2018 14:03:23 * [new tag]         v1.3.0.RC2 -> v1.3.0.RC2
12-Dec-2018 14:03:23 * [new tag]         v1.3.0.RELEASE -> v1.3.0.RELEASE
12-Dec-2018 14:03:23 * [new tag]         v1.3.1.RELEASE -> v1.3.1.RELEASE
12-Dec-2018 14:03:23 * [new tag]         v1.4.0.M1  -> v1.4.0.M1
12-Dec-2018 14:03:23 * [new tag]         v1.4.0.RC1 -> v1.4.0.RC1
12-Dec-2018 14:03:23 * [new tag]         v1.4.0.RELEASE -> v1.4.0.RELEASE
12-Dec-2018 14:03:23 * [new tag]         v1.5.0.M1  -> v1.5.0.M1
12-Dec-2018 14:03:23 * [new tag]         v1.5.0.RC1 -> v1.5.0.RC1
12-Dec-2018 14:03:23 * [new tag]         v1.5.0.RELEASE -> v1.5.0.RELEASE
12-Dec-2018 14:03:23 * [new tag]         v1.5.1.RELEASE -> v1.5.1.RELEASE
12-Dec-2018 14:03:23 * [new tag]         v1.6.0.M1  -> v1.6.0.M1
12-Dec-2018 14:03:23 * [new tag]         v1.6.0.M2  -> v1.6.0.M2
12-Dec-2018 14:03:23 * [new tag]         v1.6.0.RC1 -> v1.6.0.RC1
12-Dec-2018 14:03:23 * [new tag]         v1.6.0.RELEASE -> v1.6.0.RELEASE
12-Dec-2018 14:03:23 * [new tag]         v1.7.0.M1  -> v1.7.0.M1
12-Dec-2018 14:03:23 * [new tag]         v1.7.0.RC1 -> v1.7.0.RC1
12-Dec-2018 14:03:23 * [new tag]         v1.7.0.RELEASE -> v1.7.0.RELEASE
12-Dec-2018 14:03:23 Checking out revision cade3a5a89b5891995aa4f4176654daab4d586ec.
12-Dec-2018 14:03:23 Already on 'master'
12-Dec-2018 14:03:23 Updated source code to revision: cade3a5a89b5891995aa4f4176654daab4d586ec
12-Dec-2018 14:03:23 Finished task 'Checkout Default Repository' with result: Success
12-Dec-2018 14:03:23 Running pre-build action: Artifactory Release Staging
12-Dec-2018 14:03:23 Running pre-build action: VCS Version Collector
12-Dec-2018 14:03:23 Starting task 'Build and publish Spring Cloud Data' of type 'org.jfrog.bamboo.bamboo-artifactory-plugin:maven3Task'
12-Dec-2018 14:03:23 Bamboo Artifactory Plugin version: 2.5.x-SNAPSHOT
12-Dec-2018 14:03:24
Beginning to execute external process for build 'Spring Cloud Data Flow - Server - Kubernetes 1.10 - Master - Build Spring Cloud Dataflow Kubernetes Server #355 (SCD-K8S110BMASTER-JOB1-355)'
... running command line:
/opt/jdk-8/bin/java -cp /opt/maven-3.5/boot/plexus-classworlds-2.5.2.jar -Dclassworlds.conf=/tmp/artifactoryM22956585511871340731conf -DbuildInfoConfig.propertiesFile=/tmp/buildInfo995009286484737470.properties -Dmaven.home=/opt/maven-3.5 -Dmaven.multiModuleProjectDirectory=/opt/bamboo-home/xml-data/build-dir/SCD-K8S110BMASTER-JOB1 org.codehaus.plexus.classworlds.launcher.Launcher -s .settings.xml clean install -Pfull -U --batch-mode -Dartifactory.publish.password=********
... in: /opt/bamboo-home/xml-data/build-dir/SCD-K8S110BMASTER-JOB1
... using extra environment variables:
bamboo_planRepository_1_branch=master
IRBRC=/home/bamboo/.rvm/rubies/ruby-2.3.0/.irbrc
bamboo_********_username_password=********
bamboo_signing_store_password=********
bamboo_capability_system_builder_ant_Ant_1_9=/opt/ant-1.9
bamboo_capability_system_builder_ant_Ant_1_8=/opt/ant-1.8
bamboo_planRepository_1_branchDisplayName=master
bamboo_repository_revision_number=cade3a5a89b5891995aa4f4176654daab4d586ec
bamboo_repository_268501035_previous_revision_number=cade3a5a89b5891995aa4f4176654daab4d586ec
bamboo_capability_system_builder_node_Node_js_6=/usr/bin/node
bamboo_RIAK_BIN=/usr/sbin/riak
WRAPPER_BITS=32
bamboo_buildKey=SCD-K8S110BMASTER-JOB1
rvm_loaded_flag=1
bamboo_sonar_token_password=********
rvm_version=1.27.0 (latest)
PWD=/opt/bamboo-home/bin
bamboo_shortJobName=Build Spring Cloud Dataflow Kubernetes Server
KUBERNETES_MASTER=https://35.227.88.51
bamboo_capability_system_builder_gradle___gradlew=./gradlew
bamboo_buildResultsUrl=https://build.spring.io/browse/SCD-K8S110BMASTER-JOB1-355
bamboo_capability_system_builder_mvn3_Maven_3_3=/opt/maven-3.3
bamboo_capability_system_builder_mvn3_Maven_3_2=/opt/maven-3.2
bamboo_capability_system_builder_mvn3_Maven_3_1=/opt/maven-3.1
bamboo_planRepository_repositoryUrl=https://github.com/spring-cloud/spring-cloud-dataflow-server-kubernetes.git
bamboo_repository_268501035_git_username=spring-buildmaster
bamboo_agentId=208568334
bamboo_capability_system_builder_mvn3_Maven_3_5=/opt/maven-3.5
MY_RUBY_HOME=/home/bamboo/.rvm/rubies/ruby-2.3.0
bamboo_capability_system_builder_mvn3_Maven_3_0=/opt/maven-3.0
KUBERNETES_AUTH_BASIC_PASSWORD=********
rvm_path=/home/bamboo/.rvm
bamboo_planRepository_revision=cade3a5a89b5891995aa4f4176654daab4d586ec
bamboo_repository_268501035_branch_name=master
bamboo_planRepository_previousRevision=cade3a5a89b5891995aa4f4176654daab4d586ec
bamboo_capability_remote_build=true
bamboo_repository_branch_name=master
KUBERNETES_NAMESPACE=default
SHLVL=1
bamboo_org_jfrog_bamboo_buildInfo_serverUrl=https://repo.spring.io
bamboo_scdf_acceptance_tests_password=********
WRAPPER_OS=linux
EC2_HOME=/opt/ec2-api-tools
XDG_SESSION_ID=c1
bamboo_capability_Agent=bamboo-10.af.pivotal.io
bamboo_planRepository_branch=master
bamboo_org_jfrog_bamboo_release_activated=false
EXTERNAL_SERVERS_REQUIRED=true
bamboo_repository_268501035_git_repositoryUrl=https://github.com/spring-cloud/spring-cloud-dataflow-server-kubernetes.git
bamboo_planRepository_1_type=gitv2
bamboo_planRepository_branchName=master
WRAPPER_FILE_SEPARATOR=/
_=/opt/bamboo-home/bin/bamboo-agent.sh
WRAPPER_PATH_SEPARATOR=:
bamboo_sonar_password=********
bamboo_hg_cache_directory=/opt/bamboo-home/xml-data/build-dir/_hg-repositories-cache
bamboo_planRepository_1_username=spring-buildmaster
bamboo_planRepository_type=gitv2
bamboo_git_cache_directory=/opt/bamboo-home/xml-data/build-dir/_git-repositories-cache
bamboo_artifactory_username=buildmaster
rvm_stored_umask=0002
bamboo_tmp_directory=/opt/bamboo-home/temp
GEM_PATH=/home/bamboo/.rvm/gems/ruby-2.3.0:/home/bamboo/.rvm/gems/ruby-2.3.0@global
bamboo_planKey=SCD-K8S110BMASTER
bamboo_planRepository_username=spring-buildmaster
bamboo_JDK8_HOME=/opt/jdk-8
NLSPATH=/usr/dt/lib/nls/msg/%L/%N.cat
bamboo_repository_268501035_revision_number=cade3a5a89b5891995aa4f4176654daab4d586ec
bamboo_repository_268501035_git_branch=master
bamboo_planRepository_1_branchName=master
bamboo_dependency_parent_1=SCD-BMASTER-2403
bamboo_dependency_parent_0=SCD-UIPUBLISH-528
bamboo_sonar_version=5.6.3
XDG_DATA_DIRS=/usr/local/share:/usr/share:/var/lib/snapd/desktop
bamboo_dependency_parent_total=2
bamboo_resultsUrl=https://build.spring.io/browse/SCD-K8S110BMASTER-JOB1-355
bamboo_build_working_directory=/opt/bamboo-home/xml-data/build-dir/SCD-K8S110BMASTER-JOB1
bamboo_planRepository_1_name=Git
bamboo_capability_system_os=ubuntu1604
bamboo_nexusPush_stagingProfile=buildmaster
bamboo_shortPlanName=Server - Kubernetes 1.10 - Master
MAIL=/var/mail/bamboo
bamboo_planRepository_name=Git
LOGNAME=bamboo
bamboo_buildNumber=355
rvm_user_install_flag=1
SHELL=/bin/bash
bamboo_planName=Spring Cloud Data Flow - Server - Kubernetes 1.10 - Master
bamboo_JDK7_HOME=/opt/jdk-7
bamboo_shortPlanKey=K8S110BMASTER
OLDPWD=/opt/users/bamboo
GEM_HOME=/home/bamboo/.rvm/gems/ruby-2.3.0
bamboo_shortJobKey=JOB1
bamboo_artifactory_password=********
bamboo_buildTimeStamp=2018-12-12T14:03:20.393Z
bamboo_repository_previous_revision_number=cade3a5a89b5891995aa4f4176654daab4d586ec
RUBY_VERSION=ruby-2.3.0
bamboo_repository_268501035_name=Git
bamboo_sonar_username=buildmaster
_system_name=Ubuntu
bamboo_********_password=********
bamboo_repository_git_branch=master
bamboo_buildResultKey=SCD-K8S110BMASTER-JOB1-355
bamboo_nexusPush_close=true
bamboo_buildPlanName=Spring Cloud Data Flow - Server - Kubernetes 1.10 - Master - Build Spring Cloud Dataflow Kubernetes Server
bamboo_planRepository_1_revision=cade3a5a89b5891995aa4f4176654daab4d586ec
_system_arch=x86_64
bamboo_repository_name=Git
rvm_bin_path=/home/bamboo/.rvm/bin
bamboo_signing_key_password=********
KUBERNETES_AUTH_BASIC_USERNAME=admin
XFILESEARCHPATH=/usr/dt/app-defaults/%L/Dt
rvm_prefix=/home/bamboo
LANG=en_US.UTF-8
bamboo_buildFailed=false
bamboo_capability_system_docker_executable=/usr/bin/docker
DISPLAY=:0
bamboo_capability_system_builder_groovy_Groovy_2_4=/opt/groovy-2.4
bamboo_capability_system_builder_command_Bash=/bin/bash
bamboo_artifactory_password_mask_a=********
bamboo_agentWorkingDirectory=/opt/bamboo-home/xml-data/build-dir
bamboo_capability_system_git_executable=/usr/bin/git
bamboo_repository_git_username=spring-buildmaster
bamboo_planRepository_1_previousRevision=cade3a5a89b5891995aa4f4176654daab4d586ec
bamboo_capability_os_family=unix
NVM_NODEJS_ORG_MIRROR=http://nodejs.org/dist
bamboo_planRepository_branchDisplayName=master
KUBERNETES_CERTS_CA_DATA=LS0tLS1CRUdJTiBDRVJUSUZJQ0FURS0tLS0tCk1JSURERENDQWZTZ0F3SUJBZ0lSQUlSVDh0YXQ5TUNCT2dvWjc4cGEydVV3RFFZSktvWklodmNOQVFFTEJRQXcKTHpFdE1Dc0dBMVVFQXhNa05ESmhOREZqTXpVdFpqWmpaaTAwT1RBekxXRTJNRE10TlRnMk9XWTFaV05oTmpBMQpNQjRYRFRFNE1EVXlNakUxTURFek1sb1hEVEl6TURVeU1URTJNREV6TWxvd0x6RXRNQ3NHQTFVRUF4TWtOREpoCk5ERmpNelV0WmpaalppMDBPVEF6TFdFMk1ETXROVGcyT1dZMVpXTmhOakExTUlJQklqQU5CZ2txaGtpRzl3MEIKQVFFRkFBT0NBUThBTUlJQkNnS0NBUUVBbFg0SCsxWCtUb01qL0xZbkJFLytrcG4rSWpFSE4xUGJUSE1TaC81egpEZE9PN2RXN3J0ZVpDeDluRUdjeHkwTnd2ekRyS0pNL2ZmOFJiN0ZpUUNrTEE2RXR3Z2EvZDd6TStUOWx2R3FUCkN5cXliNlIxaXlEakRuamZiZWlTbk5vN1N2eWgwL1FoWnE1V0NIOUlXV0Fid2VkQVRMeGM4UlJ3TFBidjlldTMKbXQ2VkZHOG8rNGpFS0ZEalY4NDA0a0kra2VmaStvSjRFbFRMUVhmRXRoaXFqTmw2bXRqNFE0emF5VDcvWDA3TgpZUnRvUFdKbjRmY21NcmQ2NXpmL251N1lkczJrSEliMVhUY2kyU01VSUh6SE9HdWx5K0hxcC8zbFNxLzU0Y2I3CmpSTUlwbU45dlZKRUo3R2ZRcmtOMGdISmZRaHZXSjN6aWdOWnp3MHZLcncwNXdJREFRQUJveU13SVRBT0JnTlYKSFE4QkFmOEVCQU1DQWdRd0R3WURWUjBUQVFIL0JBVXdBd0VCL3pBTkJna3Foa2lHOXcwQkFRc0ZBQU9DQVFFQQpCWXJVQkh2VkxoTW1XZUY0ZlBHZmVreHgrWmVyV3VxdnV3SDhBcklVRy9GYzdnL3JBenJodWd3RTZsWGU0bEJyCjZVRFVPOW5pa2hmcGpVeFhMY3RvNG5lZGZYUUNQcnBGVkVsMzZZWG1EZkdUUmVUVUdlZ2lrZ253U2wvNHAwM0EKL1ZleENZc2FOTXEzY3lMMFlZN29oUXRiNTg2OGFicytvTmt5YUdBRzRobG82MlE4L1d3NDJNZzhkTVZQUEZnYgpyemVVRnJvM0JxVEtXMG1FaVNsTkpKLzdIQ3NIQTFXbE5KRG1xbm84ZStrMVQ0bkhPVzREQTVnR1VzUnE5SHZSClhrZzJOaXE3YWVaSTltVkd5d1pjejlhK3dQSm1wblM3TDlpK3pjU2R5S0JZRThuSU5XdDg3allWSTdjeVpWOUkKaG9ySFI0cE4rNFdsNU1sdjN0QndYQT09Ci0tLS0tRU5EIENFUlRJRklDQVRFLS0tLS0K
NODE_PATH=/usr/lib/nodejs:/usr/lib/node_modules:/usr/share/javascript
bamboo_capability_system_builder_maven_Artifactory_Maven_3_5=/opt/maven-3.5
GIT_SSL_NO_VERIFY=true
bamboo_capability_system_builder_maven_Artifactory_Maven_3_3=/opt/maven-3.3
NVM_DIR=/home/bamboo/.nvm
bamboo_capability_system_builder_maven_Artifactory_Maven_3_2=/opt/maven-3.2
bamboo_s3_properties=/home/bamboo/tools/s3.properties
bamboo_capability_system_builder_maven_Artifactory_Maven_3_1=/opt/maven-3.1
bamboo_capability_system_builder_maven_Artifactory_Maven_3_0=/opt/maven-3.0
_system_type=Linux
bamboo_plan_storageTag=plan-268238945
_system_version=16.04
USER=bamboo
bamboo_repository_git_repositoryUrl=https://github.com/spring-cloud/spring-cloud-dataflow-server-kubernetes.git
bamboo_working_directory=/opt/bamboo-home/xml-data/build-dir/SCD-K8S110BMASTER-JOB1
bamboo_org_jfrog_bamboo_buildInfo_activated=true
bamboo_planRepository_1_repositoryUrl=https://github.com/spring-cloud/spring-cloud-dataflow-server-kubernetes.git
bamboo_capability_system_jdk_JDK_1_8=/opt/jdk-8
bamboo_capability_system_jdk_JDK_1_9=/opt/jdk-9
WRAPPER_ARCH=x86
bamboo_capability_system_jdk_JDK_1_6=/opt/jdk-6
bamboo_capability_system_jdk_JDK_1_7=/opt/jdk-7
bamboo_sonar_ip=10.194.6.9
XDG_RUNTIME_DIR=/run/user/505
HOME=/home/bamboo
PATH=/bin:/home/bamboo/.rvm/gems/ruby-2.3.0/bin:/home/bamboo/.rvm/gems/ruby-2.3.0@global/bin:/home/bamboo/.rvm/rubies/ruby-2.3.0/bin:/home/bamboo/bin:/usr/local/bin:/usr/bin:/bin:/usr/local/games:/usr/games:/snap/bin:/home/bamboo/bin:/usr/local/bin:/opt/ec2-api-tools/bin:/home/bamboo/.rvm/bin:/bin:/home/bamboo/.rvm/gems/ruby-2.3.0/bin:/home/bamboo/.rvm/gems/ruby-2.3.0@global/bin:/home/bamboo/.rvm/rubies/ruby-2.3.0/bin:/home/bamboo/bin:/usr/local/bin:/usr/bin:/bin:/usr/local/games:/usr/games:/snap/bin:/home/bamboo/bin:/usr/local/bin:/opt/ec2-api-tools/bin:/home/bamboo/.rvm/bin
12-Dec-2018 14:03:25 [INFO] Scanning for projects...
12-Dec-2018 14:03:25 [INFO] Downloading: http://repo.spring.io/libs-snapshot-local/org/springframework/cloud/spring-cloud-dataflow-parent/2.0.0.BUILD-SNAPSHOT/maven-metadata.xml
12-Dec-2018 14:03:25 [INFO] Downloaded: http://repo.spring.io/libs-snapshot-local/org/springframework/cloud/spring-cloud-dataflow-parent/2.0.0.BUILD-SNAPSHOT/maven-metadata.xml (644 B at 2.3 kB/s)
12-Dec-2018 14:03:25 [INFO] Downloading: http://repo.spring.io/libs-snapshot-local/org/springframework/cloud/spring-cloud-dataflow-parent/2.0.0.BUILD-SNAPSHOT/spring-cloud-dataflow-parent-2.0.0.BUILD-20181212.135220-81.pom
12-Dec-2018 14:03:25 [INFO] Downloaded: http://repo.spring.io/libs-snapshot-local/org/springframework/cloud/spring-cloud-dataflow-parent/2.0.0.BUILD-SNAPSHOT/spring-cloud-dataflow-parent-2.0.0.BUILD-20181212.135220-81.pom (12 kB at 74 kB/s)
12-Dec-2018 14:03:25 [INFO] Downloading: http://repo.spring.io/libs-snapshot-local/org/springframework/cloud/spring-cloud-task-dependencies/2.1.0.BUILD-SNAPSHOT/maven-metadata.xml
12-Dec-2018 14:03:26 [INFO] Downloaded: http://repo.spring.io/libs-snapshot-local/org/springframework/cloud/spring-cloud-task-dependencies/2.1.0.BUILD-SNAPSHOT/maven-metadata.xml (646 B at 4.0 kB/s)
12-Dec-2018 14:03:26 [INFO] Downloading: http://repo.spring.io/libs-snapshot-local/org/springframework/cloud/spring-cloud-dataflow-dependencies/2.0.0.BUILD-SNAPSHOT/maven-metadata.xml
12-Dec-2018 14:03:26 [INFO] Downloaded: http://repo.spring.io/libs-snapshot-local/org/springframework/cloud/spring-cloud-dataflow-dependencies/2.0.0.BUILD-SNAPSHOT/maven-metadata.xml (650 B at 4.1 kB/s)
12-Dec-2018 14:03:26 [INFO] Downloading: http://repo.spring.io/libs-snapshot-local/org/springframework/cloud/spring-cloud-dataflow-dependencies/2.0.0.BUILD-SNAPSHOT/spring-cloud-dataflow-dependencies-2.0.0.BUILD-20181212.135220-81.pom
12-Dec-2018 14:03:26 [INFO] Downloaded: http://repo.spring.io/libs-snapshot-local/org/springframework/cloud/spring-cloud-dataflow-dependencies/2.0.0.BUILD-SNAPSHOT/spring-cloud-dataflow-dependencies-2.0.0.BUILD-20181212.135220-81.pom (5.4 kB at 34 kB/s)
12-Dec-2018 14:03:26 [INFO] Initializing Artifactory Build-Info Recording
12-Dec-2018 14:03:26 [INFO] ------------------------------------------------------------------------
12-Dec-2018 14:03:26 [INFO] Reactor Build Order:
12-Dec-2018 14:03:26 [INFO]
12-Dec-2018 14:03:26 [INFO] spring-cloud-dataflow-server-kubernetes-parent
12-Dec-2018 14:03:26 [INFO] spring-cloud-dataflow-server-kubernetes-autoconfig
12-Dec-2018 14:03:26 [INFO] Kubernetes Data Flow Server
12-Dec-2018 14:03:26 [INFO] spring-cloud-dataflow-server-kubernetes-docs
12-Dec-2018 14:03:26 [INFO]
12-Dec-2018 14:03:26 [INFO] ------------------------------------------------------------------------
12-Dec-2018 14:03:26 [INFO] Building spring-cloud-dataflow-server-kubernetes-parent 2.0.0.BUILD-SNAPSHOT
12-Dec-2018 14:03:26 [INFO] ------------------------------------------------------------------------
12-Dec-2018 14:03:26 [INFO]
12-Dec-2018 14:03:26 [INFO] --- maven-clean-plugin:2.5:clean (default-clean) @ spring-cloud-dataflow-server-kubernetes-parent ---
12-Dec-2018 14:03:26 [INFO]
12-Dec-2018 14:03:26 [INFO] --- maven-checkstyle-plugin:2.17:check (checkstyle-validation) @ spring-cloud-dataflow-server-kubernetes-parent ---
12-Dec-2018 14:03:27 [INFO] Starting audit...
12-Dec-2018 14:03:27 Audit done.
12-Dec-2018 14:03:27 [INFO]
12-Dec-2018 14:03:27 [INFO] --- jacoco-maven-plugin:0.7.9:prepare-agent (agent) @ spring-cloud-dataflow-server-kubernetes-parent ---
12-Dec-2018 14:03:27 [INFO] argLine set to -javaagent:/home/bamboo/.m2/repository/org/jacoco/org.jacoco.agent/0.7.9/org.jacoco.agent-0.7.9-runtime.jar=destfile=/opt/bamboo-home/xml-data/build-dir/SCD-K8S110BMASTER-JOB1/target/jacoco.exec
12-Dec-2018 14:03:27 [INFO]
12-Dec-2018 14:03:27 [INFO] --- jacoco-maven-plugin:0.7.9:report (report) @ spring-cloud-dataflow-server-kubernetes-parent ---
12-Dec-2018 14:03:27 [INFO] Skipping JaCoCo execution due to missing execution data file.
12-Dec-2018 14:03:27 [INFO]
12-Dec-2018 14:03:27 [INFO] --- maven-javadoc-plugin:3.0.1:jar (attach-javadocs) @ spring-cloud-dataflow-server-kubernetes-parent ---
12-Dec-2018 14:03:27 [INFO] Not executing Javadoc as the project is not a Java classpath-capable package
12-Dec-2018 14:03:27 [INFO]
12-Dec-2018 14:03:27 [INFO] --- maven-javadoc-plugin:3.0.1:jar (javadoc) @ spring-cloud-dataflow-server-kubernetes-parent ---
12-Dec-2018 14:03:27 [INFO] Not executing Javadoc as the project is not a Java classpath-capable package
12-Dec-2018 14:03:27 [INFO]
12-Dec-2018 14:03:27 [INFO] >>> maven-source-plugin:3.0.1:jar (attach-sources) > generate-sources @ spring-cloud-dataflow-server-kubernetes-parent >>>
12-Dec-2018 14:03:27 [INFO]
12-Dec-2018 14:03:27 [INFO] --- maven-checkstyle-plugin:2.17:check (checkstyle-validation) @ spring-cloud-dataflow-server-kubernetes-parent ---
12-Dec-2018 14:03:28 [INFO] Starting audit...
12-Dec-2018 14:03:28 Audit done.
12-Dec-2018 14:03:28 [INFO]
12-Dec-2018 14:03:28 [INFO] --- jacoco-maven-plugin:0.7.9:prepare-agent (agent) @ spring-cloud-dataflow-server-kubernetes-parent ---
12-Dec-2018 14:03:28 [INFO] argLine set to -javaagent:/home/bamboo/.m2/repository/org/jacoco/org.jacoco.agent/0.7.9/org.jacoco.agent-0.7.9-runtime.jar=destfile=/opt/bamboo-home/xml-data/build-dir/SCD-K8S110BMASTER-JOB1/target/jacoco.exec
12-Dec-2018 14:03:28 [INFO]
12-Dec-2018 14:03:28 [INFO] <<< maven-source-plugin:3.0.1:jar (attach-sources) < generate-sources @ spring-cloud-dataflow-server-kubernetes-parent <<<
12-Dec-2018 14:03:28 [INFO]
12-Dec-2018 14:03:28 [INFO]
12-Dec-2018 14:03:28 [INFO] --- maven-source-plugin:3.0.1:jar (attach-sources) @ spring-cloud-dataflow-server-kubernetes-parent ---
12-Dec-2018 14:03:28 [INFO]
12-Dec-2018 14:03:28 [INFO] --- maven-install-plugin:2.4:install (default-install) @ spring-cloud-dataflow-server-kubernetes-parent ---
12-Dec-2018 14:03:28 [INFO] Installing /opt/bamboo-home/xml-data/build-dir/SCD-K8S110BMASTER-JOB1/pom.xml to /home/bamboo/.m2/repository/org/springframework/cloud/spring-cloud-dataflow-server-kubernetes-parent/2.0.0.BUILD-SNAPSHOT/spring-cloud-dataflow-server-kubernetes-parent-2.0.0.BUILD-SNAPSHOT.pom
12-Dec-2018 14:03:28 [INFO]
12-Dec-2018 14:03:28 [INFO] ------------------------------------------------------------------------
12-Dec-2018 14:03:28 [INFO] Building spring-cloud-dataflow-server-kubernetes-autoconfig 2.0.0.BUILD-SNAPSHOT
12-Dec-2018 14:03:28 [INFO] ------------------------------------------------------------------------
12-Dec-2018 14:03:28 [INFO] Downloading: http://repo.spring.io/libs-snapshot-local/org/springframework/cloud/spring-cloud-deployer-kubernetes/2.0.0.BUILD-SNAPSHOT/maven-metadata.xml
12-Dec-2018 14:03:28 [INFO] Downloaded: http://repo.spring.io/libs-snapshot-local/org/springframework/cloud/spring-cloud-deployer-kubernetes/2.0.0.BUILD-SNAPSHOT/maven-metadata.xml (1.3 kB at 7.0 kB/s)
12-Dec-2018 14:03:28 [INFO] Downloading: http://repo.spring.io/libs-snapshot-local/org/springframework/cloud/spring-cloud-deployer-parent/2.0.0.BUILD-SNAPSHOT/maven-metadata.xml
12-Dec-2018 14:03:28 [INFO] Downloaded: http://repo.spring.io/libs-snapshot-local/org/springframework/cloud/spring-cloud-deployer-parent/2.0.0.BUILD-SNAPSHOT/maven-metadata.xml (642 B at 4.0 kB/s)
12-Dec-2018 14:03:28 [INFO] Downloading: http://repo.spring.io/libs-snapshot-local/org/springframework/cloud/spring-cloud-deployer-dependencies/2.0.0.BUILD-SNAPSHOT/maven-metadata.xml
12-Dec-2018 14:03:28 [INFO] Downloaded: http://repo.spring.io/libs-snapshot-local/org/springframework/cloud/spring-cloud-deployer-dependencies/2.0.0.BUILD-SNAPSHOT/maven-metadata.xml (648 B at 4.1 kB/s)
12-Dec-2018 14:03:28 [INFO] Downloading: http://repo.spring.io/libs-snapshot-local/org/springframework/cloud/spring-cloud-dataflow-server-core/2.0.0.BUILD-SNAPSHOT/maven-metadata.xml
12-Dec-2018 14:03:28 [INFO] Downloaded: http://repo.spring.io/libs-snapshot-local/org/springframework/cloud/spring-cloud-dataflow-server-core/2.0.0.BUILD-SNAPSHOT/maven-metadata.xml (1.3 kB at 8.0 kB/s)
12-Dec-2018 14:03:28 [INFO] Downloading: http://repo.spring.io/libs-snapshot-local/org/springframework/cloud/spring-cloud-dataflow-server-core/2.0.0.BUILD-SNAPSHOT/spring-cloud-dataflow-server-core-2.0.0.BUILD-20181212.135220-81.pom
12-Dec-2018 14:03:29 [INFO] Downloaded: http://repo.spring.io/libs-snapshot-local/org/springframework/cloud/spring-cloud-dataflow-server-core/2.0.0.BUILD-SNAPSHOT/spring-cloud-dataflow-server-core-2.0.0.BUILD-20181212.135220-81.pom (6.7 kB at 42 kB/s)
12-Dec-2018 14:03:29 [INFO] Downloading: http://repo.spring.io/libs-snapshot-local/org/springframework/cloud/spring-cloud-dataflow-configuration-metadata/2.0.0.BUILD-SNAPSHOT/maven-metadata.xml
12-Dec-2018 14:03:29 [INFO] Downloaded: http://repo.spring.io/libs-snapshot-local/org/springframework/cloud/spring-cloud-dataflow-configuration-metadata/2.0.0.BUILD-SNAPSHOT/maven-metadata.xml (1.3 kB at 5.1 kB/s)
12-Dec-2018 14:03:29 [INFO] Downloading: http://repo.spring.io/libs-snapshot-local/org/springframework/cloud/spring-cloud-dataflow-configuration-metadata/2.0.0.BUILD-SNAPSHOT/spring-cloud-dataflow-configuration-metadata-2.0.0.BUILD-20181212.135220-81.pom
12-Dec-2018 14:03:29 [INFO] Downloaded: http://repo.spring.io/libs-snapshot-local/org/springframework/cloud/spring-cloud-dataflow-configuration-metadata/2.0.0.BUILD-SNAPSHOT/spring-cloud-dataflow-configuration-metadata-2.0.0.BUILD-20181212.135220-81.pom (1.2 kB at 7.6 kB/s)
12-Dec-2018 14:03:29 [INFO] Downloading: http://repo.spring.io/libs-snapshot-local/org/springframework/cloud/spring-cloud-dataflow-completion/2.0.0.BUILD-SNAPSHOT/maven-metadata.xml
12-Dec-2018 14:03:29 [INFO] Downloaded: http://repo.spring.io/libs-snapshot-local/org/springframework/cloud/spring-cloud-dataflow-completion/2.0.0.BUILD-SNAPSHOT/maven-metadata.xml (1.3 kB at 8.0 kB/s)
12-Dec-2018 14:03:29 [INFO] Downloading: http://repo.spring.io/libs-snapshot-local/org/springframework/cloud/spring-cloud-dataflow-completion/2.0.0.BUILD-SNAPSHOT/spring-cloud-dataflow-completion-2.0.0.BUILD-20181212.135220-81.pom
12-Dec-2018 14:03:29 [INFO] Downloaded: http://repo.spring.io/libs-snapshot-local/org/springframework/cloud/spring-cloud-dataflow-completion/2.0.0.BUILD-SNAPSHOT/spring-cloud-dataflow-completion-2.0.0.BUILD-20181212.135220-81.pom (1.1 kB at 7.2 kB/s)
12-Dec-2018 14:03:29 [INFO] Downloading: http://repo.spring.io/libs-snapshot-local/org/springframework/cloud/spring-cloud-dataflow-core/2.0.0.BUILD-SNAPSHOT/maven-metadata.xml
12-Dec-2018 14:03:30 [INFO] Downloaded: http://repo.spring.io/libs-snapshot-local/org/springframework/cloud/spring-cloud-dataflow-core/2.0.0.BUILD-SNAPSHOT/maven-metadata.xml (1.3 kB at 5.8 kB/s)
12-Dec-2018 14:03:30 [INFO] Downloading: http://repo.spring.io/libs-snapshot-local/org/springframework/cloud/spring-cloud-dataflow-core/2.0.0.BUILD-SNAPSHOT/spring-cloud-dataflow-core-2.0.0.BUILD-20181212.135220-81.pom
12-Dec-2018 14:03:33 [INFO] Downloaded: http://repo.spring.io/libs-snapshot-local/org/springframework/cloud/spring-cloud-dataflow-core/2.0.0.BUILD-SNAPSHOT/spring-cloud-dataflow-core-2.0.0.BUILD-20181212.135220-81.pom (1.8 kB at 531 B/s)
12-Dec-2018 14:03:33 [INFO] Downloading: http://repo.spring.io/libs-snapshot-local/org/springframework/cloud/spring-cloud-dataflow-registry/2.0.0.BUILD-SNAPSHOT/maven-metadata.xml
12-Dec-2018 14:03:33 [INFO] Downloaded: http://repo.spring.io/libs-snapshot-local/org/springframework/cloud/spring-cloud-dataflow-registry/2.0.0.BUILD-SNAPSHOT/maven-metadata.xml (1.3 kB at 8.1 kB/s)
12-Dec-2018 14:03:33 [INFO] Downloading: http://repo.spring.io/libs-snapshot-local/org/springframework/cloud/spring-cloud-dataflow-registry/2.0.0.BUILD-SNAPSHOT/spring-cloud-dataflow-registry-2.0.0.BUILD-20181212.135220-81.pom
12-Dec-2018 14:03:33 [INFO] Downloaded: http://repo.spring.io/libs-snapshot-local/org/springframework/cloud/spring-cloud-dataflow-registry/2.0.0.BUILD-SNAPSHOT/spring-cloud-dataflow-registry-2.0.0.BUILD-20181212.135220-81.pom (2.3 kB at 14 kB/s)
12-Dec-2018 14:03:33 [INFO] Downloading: http://repo.spring.io/libs-snapshot-local/org/springframework/cloud/spring-cloud-dataflow-rest-resource/2.0.0.BUILD-SNAPSHOT/maven-metadata.xml
12-Dec-2018 14:03:34 [INFO] Downloaded: http://repo.spring.io/libs-snapshot-local/org/springframework/cloud/spring-cloud-dataflow-rest-resource/2.0.0.BUILD-SNAPSHOT/maven-metadata.xml (1.3 kB at 8.2 kB/s)
12-Dec-2018 14:03:34 [INFO] Downloading: http://repo.spring.io/libs-snapshot-local/org/springframework/cloud/spring-cloud-dataflow-rest-resource/2.0.0.BUILD-SNAPSHOT/spring-cloud-dataflow-rest-resource-2.0.0.BUILD-20181212.135220-81.pom
12-Dec-2018 14:03:34 [INFO] Downloaded: http://repo.spring.io/libs-snapshot-local/org/springframework/cloud/spring-cloud-dataflow-rest-resource/2.0.0.BUILD-SNAPSHOT/spring-cloud-dataflow-rest-resource-2.0.0.BUILD-20181212.135220-81.pom (3.1 kB at 19 kB/s)
12-Dec-2018 14:03:34 [INFO] Downloading: http://repo.spring.io/libs-snapshot-local/org/springframework/cloud/spring-cloud-task-core/2.1.0.BUILD-SNAPSHOT/maven-metadata.xml
12-Dec-2018 14:03:34 [INFO] Downloaded: http://repo.spring.io/libs-snapshot-local/org/springframework/cloud/spring-cloud-task-core/2.1.0.BUILD-SNAPSHOT/maven-metadata.xml (1.3 kB at 8.0 kB/s)
12-Dec-2018 14:03:34 [INFO] Downloading: http://repo.spring.io/libs-snapshot-local/org/springframework/cloud/spring-cloud-task-parent/2.1.0.BUILD-SNAPSHOT/maven-metadata.xml
12-Dec-2018 14:03:34 [INFO] Downloaded: http://repo.spring.io/libs-snapshot-local/org/springframework/cloud/spring-cloud-task-parent/2.1.0.BUILD-SNAPSHOT/maven-metadata.xml (640 B at 4.0 kB/s)
12-Dec-2018 14:03:34 [INFO] Downloading: http://repo.spring.io/libs-snapshot-local/org/springframework/cloud/spring-cloud-deployer-autoconfigure/2.0.0.BUILD-SNAPSHOT/maven-metadata.xml
12-Dec-2018 14:03:34 [INFO] Downloaded: http://repo.spring.io/libs-snapshot-local/org/springframework/cloud/spring-cloud-deployer-autoconfigure/2.0.0.BUILD-SNAPSHOT/maven-metadata.xml (1.3 kB at 7.9 kB/s)
12-Dec-2018 14:03:34 [INFO] Downloading: http://repo.spring.io/libs-snapshot-local/org/springframework/cloud/spring-cloud-skipper/2.0.0.BUILD-SNAPSHOT/maven-metadata.xml
12-Dec-2018 14:03:34 [INFO] Downloaded: http://repo.spring.io/libs-snapshot-local/org/springframework/cloud/spring-cloud-skipper/2.0.0.BUILD-SNAPSHOT/maven-metadata.xml (1.3 kB at 8.0 kB/s)
12-Dec-2018 14:03:34 [INFO] Downloading: http://repo.spring.io/libs-snapshot-local/org/springframework/cloud/spring-cloud-skipper-parent/2.0.0.BUILD-SNAPSHOT/maven-metadata.xml
12-Dec-2018 14:03:35 [INFO] Downloaded: http://repo.spring.io/libs-snapshot-local/org/springframework/cloud/spring-cloud-skipper-parent/2.0.0.BUILD-SNAPSHOT/maven-metadata.xml (643 B at 4.1 kB/s)
12-Dec-2018 14:03:35 [INFO] Downloading: http://repo.spring.io/libs-snapshot-local/org/springframework/cloud/spring-cloud-starter-common-security-config-web/1.1.0.BUILD-SNAPSHOT/maven-metadata.xml
12-Dec-2018 14:03:35 [INFO] Downloaded: http://repo.spring.io/libs-snapshot-local/org/springframework/cloud/spring-cloud-starter-common-security-config-web/1.1.0.BUILD-SNAPSHOT/maven-metadata.xml (840 B at 5.2 kB/s)
12-Dec-2018 14:03:35 [INFO] Downloading: http://repo.spring.io/libs-snapshot-local/org/springframework/cloud/spring-cloud-common-security-config/1.1.0.BUILD-SNAPSHOT/maven-metadata.xml
12-Dec-2018 14:03:35 [INFO] Downloaded: http://repo.spring.io/libs-snapshot-local/org/springframework/cloud/spring-cloud-common-security-config/1.1.0.BUILD-SNAPSHOT/maven-metadata.xml (649 B at 4.1 kB/s)
12-Dec-2018 14:03:35 [INFO] Downloading: http://repo.spring.io/libs-snapshot-local/org/springframework/cloud/spring-cloud-common-security-config-web/1.1.0.BUILD-SNAPSHOT/maven-metadata.xml
12-Dec-2018 14:03:35 [INFO] Downloaded: http://repo.spring.io/libs-snapshot-local/org/springframework/cloud/spring-cloud-common-security-config-web/1.1.0.BUILD-SNAPSHOT/maven-metadata.xml (1.3 kB at 8.1 kB/s)
12-Dec-2018 14:03:35 [INFO] Downloading: http://repo.spring.io/libs-snapshot-local/org/springframework/cloud/spring-cloud-dataflow-ui/2.0.0.BUILD-SNAPSHOT/maven-metadata.xml
12-Dec-2018 14:03:35 [INFO] Downloaded: http://repo.spring.io/libs-snapshot-local/org/springframework/cloud/spring-cloud-dataflow-ui/2.0.0.BUILD-SNAPSHOT/maven-metadata.xml (820 B at 4.1 kB/s)
12-Dec-2018 14:03:35 [INFO] Downloading: http://repo.spring.io/libs-snapshot-local/org/springframework/cloud/spring-cloud-dataflow-ui/2.0.0.BUILD-SNAPSHOT/spring-cloud-dataflow-ui-2.0.0.BUILD-20181212.135357-26.pom
12-Dec-2018 14:03:36 [INFO] Downloaded: http://repo.spring.io/libs-snapshot-local/org/springframework/cloud/spring-cloud-dataflow-ui/2.0.0.BUILD-SNAPSHOT/spring-cloud-dataflow-ui-2.0.0.BUILD-20181212.135357-26.pom (5.8 kB at 36 kB/s)
12-Dec-2018 14:03:36 [INFO] Downloading: http://repo.spring.io/libs-snapshot-local/org/springframework/cloud/spring-cloud-skipper-client/2.0.0.BUILD-SNAPSHOT/maven-metadata.xml
12-Dec-2018 14:03:36 [INFO] Downloaded: http://repo.spring.io/libs-snapshot-local/org/springframework/cloud/spring-cloud-skipper-client/2.0.0.BUILD-SNAPSHOT/maven-metadata.xml (1.3 kB at 8.0 kB/s)
12-Dec-2018 14:03:36 [INFO] Downloading: http://repo.spring.io/libs-snapshot-local/org/springframework/cloud/spring-cloud-scheduler-kubernetes/1.1.0.BUILD-SNAPSHOT/maven-metadata.xml
12-Dec-2018 14:03:36 [INFO] Downloaded: http://repo.spring.io/libs-snapshot-local/org/springframework/cloud/spring-cloud-scheduler-kubernetes/1.1.0.BUILD-SNAPSHOT/maven-metadata.xml (1.3 kB at 8.0 kB/s)
12-Dec-2018 14:03:36 [INFO] Downloading: http://repo.spring.io/libs-snapshot-local/org/springframework/cloud/spring-cloud-dataflow-server-core/2.0.0.BUILD-SNAPSHOT/spring-cloud-dataflow-server-core-2.0.0.BUILD-20181212.135220-81.jar
12-Dec-2018 14:03:36 [INFO] Downloading: http://repo.spring.io/libs-snapshot-local/org/springframework/cloud/spring-cloud-dataflow-completion/2.0.0.BUILD-SNAPSHOT/spring-cloud-dataflow-completion-2.0.0.BUILD-20181212.135220-81.jar
12-Dec-2018 14:03:36 [INFO] Downloading: http://repo.spring.io/libs-snapshot-local/org/springframework/cloud/spring-cloud-dataflow-configuration-metadata/2.0.0.BUILD-SNAPSHOT/spring-cloud-dataflow-configuration-metadata-2.0.0.BUILD-20181212.135220-81.jar
12-Dec-2018 14:03:36 [INFO] Downloading: http://repo.spring.io/libs-snapshot-local/org/springframework/cloud/spring-cloud-dataflow-core/2.0.0.BUILD-SNAPSHOT/spring-cloud-dataflow-core-2.0.0.BUILD-20181212.135220-81.jar
12-Dec-2018 14:03:36 [INFO] Downloading: http://repo.spring.io/libs-snapshot-local/org/springframework/cloud/spring-cloud-dataflow-rest-resource/2.0.0.BUILD-SNAPSHOT/spring-cloud-dataflow-rest-resource-2.0.0.BUILD-20181212.135220-81.jar
12-Dec-2018 14:03:36 [INFO] Downloaded: http://repo.spring.io/libs-snapshot-local/org/springframework/cloud/spring-cloud-dataflow-configuration-metadata/2.0.0.BUILD-SNAPSHOT/spring-cloud-dataflow-configuration-metadata-2.0.0.BUILD-20181212.135220-81.jar (15 kB at 73 kB/s)
12-Dec-2018 14:03:36 [INFO] Downloading: http://repo.spring.io/libs-snapshot-local/org/springframework/cloud/spring-cloud-dataflow-registry/2.0.0.BUILD-SNAPSHOT/spring-cloud-dataflow-registry-2.0.0.BUILD-20181212.135220-81.jar
12-Dec-2018 14:03:36 [INFO] Downloaded: http://repo.spring.io/libs-snapshot-local/org/springframework/cloud/spring-cloud-dataflow-completion/2.0.0.BUILD-SNAPSHOT/spring-cloud-dataflow-completion-2.0.0.BUILD-20181212.135220-81.jar (64 kB at 242 kB/s)
12-Dec-2018 14:03:36 [INFO] Downloading: http://repo.spring.io/libs-snapshot-local/org/springframework/cloud/spring-cloud-dataflow-ui/2.0.0.BUILD-SNAPSHOT/spring-cloud-dataflow-ui-2.0.0.BUILD-20181212.135357-26.jar
12-Dec-2018 14:03:36 [INFO] Downloaded: http://repo.spring.io/libs-snapshot-local/org/springframework/cloud/spring-cloud-dataflow-rest-resource/2.0.0.BUILD-SNAPSHOT/spring-cloud-dataflow-rest-resource-2.0.0.BUILD-20181212.135220-81.jar (76 kB at 238 kB/s)
12-Dec-2018 14:03:36 [INFO] Downloaded: http://repo.spring.io/libs-snapshot-local/org/springframework/cloud/spring-cloud-dataflow-core/2.0.0.BUILD-SNAPSHOT/spring-cloud-dataflow-core-2.0.0.BUILD-20181212.135220-81.jar (127 kB at 382 kB/s)
12-Dec-2018 14:03:36 [INFO] Downloaded: http://repo.spring.io/libs-snapshot-local/org/springframework/cloud/spring-cloud-dataflow-registry/2.0.0.BUILD-SNAPSHOT/spring-cloud-dataflow-registry-2.0.0.BUILD-20181212.135220-81.jar (22 kB at 52 kB/s)
12-Dec-2018 14:03:37 [INFO] Downloaded: http://repo.spring.io/libs-snapshot-local/org/springframework/cloud/spring-cloud-dataflow-server-core/2.0.0.BUILD-SNAPSHOT/spring-cloud-dataflow-server-core-2.0.0.BUILD-20181212.135220-81.jar (357 kB at 489 kB/s)
12-Dec-2018 14:03:37 [INFO] Downloaded: http://repo.spring.io/libs-snapshot-local/org/springframework/cloud/spring-cloud-dataflow-ui/2.0.0.BUILD-SNAPSHOT/spring-cloud-dataflow-ui-2.0.0.BUILD-20181212.135357-26.jar (2.1 MB at 1.7 MB/s)
12-Dec-2018 14:03:37 [INFO]
12-Dec-2018 14:03:37 [INFO] --- maven-clean-plugin:2.5:clean (default-clean) @ spring-cloud-dataflow-server-kubernetes-autoconfig ---
12-Dec-2018 14:03:37 [INFO]
12-Dec-2018 14:03:37 [INFO] --- maven-checkstyle-plugin:2.17:check (checkstyle-validation) @ spring-cloud-dataflow-server-kubernetes-autoconfig ---
12-Dec-2018 14:03:37 [INFO] Starting audit...
12-Dec-2018 14:03:37 Audit done.
12-Dec-2018 14:03:37 [INFO]
12-Dec-2018 14:03:37 [INFO] --- jacoco-maven-plugin:0.7.9:prepare-agent (agent) @ spring-cloud-dataflow-server-kubernetes-autoconfig ---
12-Dec-2018 14:03:37 [INFO] argLine set to -javaagent:/home/bamboo/.m2/repository/org/jacoco/org.jacoco.agent/0.7.9/org.jacoco.agent-0.7.9-runtime.jar=destfile=/opt/bamboo-home/xml-data/build-dir/SCD-K8S110BMASTER-JOB1/spring-cloud-dataflow-server-kubernetes-autoconfig/target/jacoco.exec
12-Dec-2018 14:03:37 [INFO]
12-Dec-2018 14:03:37 [INFO] --- maven-resources-plugin:3.1.0:resources (default-resources) @ spring-cloud-dataflow-server-kubernetes-autoconfig ---
12-Dec-2018 14:03:37 [INFO] Using 'UTF-8' encoding to copy filtered resources.
12-Dec-2018 14:03:37 [INFO] Copying 1 resource
12-Dec-2018 14:03:37 [INFO]
12-Dec-2018 14:03:37 [INFO] --- maven-compiler-plugin:3.8.0:compile (default-compile) @ spring-cloud-dataflow-server-kubernetes-autoconfig ---
12-Dec-2018 14:03:37 [INFO] Changes detected - recompiling the module!
12-Dec-2018 14:03:37 [INFO] Compiling 2 source files to /opt/bamboo-home/xml-data/build-dir/SCD-K8S110BMASTER-JOB1/spring-cloud-dataflow-server-kubernetes-autoconfig/target/classes
12-Dec-2018 14:03:38 [INFO]
12-Dec-2018 14:03:38 [INFO] --- maven-resources-plugin:3.1.0:testResources (default-testResources) @ spring-cloud-dataflow-server-kubernetes-autoconfig ---
12-Dec-2018 14:03:38 [INFO] Using 'UTF-8' encoding to copy filtered resources.
12-Dec-2018 14:03:38 [INFO] skip non existing resourceDirectory /opt/bamboo-home/xml-data/build-dir/SCD-K8S110BMASTER-JOB1/spring-cloud-dataflow-server-kubernetes-autoconfig/src/test/resources
12-Dec-2018 14:03:38 [INFO]
12-Dec-2018 14:03:38 [INFO] --- maven-compiler-plugin:3.8.0:testCompile (default-testCompile) @ spring-cloud-dataflow-server-kubernetes-autoconfig ---
12-Dec-2018 14:03:38 [INFO] No sources to compile
12-Dec-2018 14:03:38 [INFO]
12-Dec-2018 14:03:38 [INFO] --- maven-surefire-plugin:2.22.0:test (default-test) @ spring-cloud-dataflow-server-kubernetes-autoconfig ---
12-Dec-2018 14:03:38 [INFO] No tests to run.
12-Dec-2018 14:03:38 [INFO]
12-Dec-2018 14:03:38 [INFO] --- jacoco-maven-plugin:0.7.9:report (report) @ spring-cloud-dataflow-server-kubernetes-autoconfig ---
12-Dec-2018 14:03:38 [INFO] Skipping JaCoCo execution due to missing execution data file.
12-Dec-2018 14:03:38 [INFO]
12-Dec-2018 14:03:38 [INFO] --- maven-jar-plugin:3.0.2:jar (default-jar) @ spring-cloud-dataflow-server-kubernetes-autoconfig ---
12-Dec-2018 14:03:38 [INFO] Building jar: /opt/bamboo-home/xml-data/build-dir/SCD-K8S110BMASTER-JOB1/spring-cloud-dataflow-server-kubernetes-autoconfig/target/spring-cloud-dataflow-server-kubernetes-autoconfig-2.0.0.BUILD-SNAPSHOT.jar
12-Dec-2018 14:03:38 [INFO]
12-Dec-2018 14:03:38 [INFO] --- maven-javadoc-plugin:3.0.1:jar (attach-javadocs) @ spring-cloud-dataflow-server-kubernetes-autoconfig ---
12-Dec-2018 14:03:39 [INFO]
12-Dec-2018 14:03:39 1 error
12-Dec-2018 14:03:39 [ERROR] MavenReportException: Error while generating Javadoc:
12-Dec-2018 14:03:39 Exit code: 1 - /opt/bamboo-home/xml-data/build-dir/SCD-K8S110BMASTER-JOB1/spring-cloud-dataflow-server-kubernetes-autoconfig/src/main/java/org/springframework/cloud/dataflow/server/kubernetes/config/KubernetesDataFlowServerAutoConfiguration.java:33: error: reference not found
12-Dec-2018 14:03:39 * AutoConfiguration for the {@link KubernetesDataFlowServer}
12-Dec-2018 14:03:39                                     ^
12-Dec-2018 14:03:39
12-Dec-2018 14:03:39 Command line was: /opt/jdk1.8.0_144/jre/../bin/javadoc @options @packages
12-Dec-2018 14:03:39
12-Dec-2018 14:03:39 Refer to the generated Javadoc files in '/opt/bamboo-home/xml-data/build-dir/SCD-K8S110BMASTER-JOB1/spring-cloud-dataflow-server-kubernetes-autoconfig/target/apidocs' dir.
12-Dec-2018 14:03:39
12-Dec-2018 14:03:39 org.apache.maven.reporting.MavenReportException:
12-Dec-2018 14:03:39 Exit code: 1 - /opt/bamboo-home/xml-data/build-dir/SCD-K8S110BMASTER-JOB1/spring-cloud-dataflow-server-kubernetes-autoconfig/src/main/java/org/springframework/cloud/dataflow/server/kubernetes/config/KubernetesDataFlowServerAutoConfiguration.java:33: error: reference not found
12-Dec-2018 14:03:39 * AutoConfiguration for the {@link KubernetesDataFlowServer}
12-Dec-2018 14:03:39                                     ^
12-Dec-2018 14:03:39
12-Dec-2018 14:03:39 Command line was: /opt/jdk1.8.0_144/jre/../bin/javadoc @options @packages
12-Dec-2018 14:03:39
12-Dec-2018 14:03:39 Refer to the generated Javadoc files in '/opt/bamboo-home/xml-data/build-dir/SCD-K8S110BMASTER-JOB1/spring-cloud-dataflow-server-kubernetes-autoconfig/target/apidocs' dir.
12-Dec-2018 14:03:39
12-Dec-2018 14:03:39         at org.apache.maven.plugins.javadoc.AbstractJavadocMojo.executeJavadocCommandLine(AbstractJavadocMojo.java:5298)
12-Dec-2018 14:03:39         at org.apache.maven.plugins.javadoc.AbstractJavadocMojo.executeReport(AbstractJavadocMojo.java:2134)
12-Dec-2018 14:03:39         at org.apache.maven.plugins.javadoc.JavadocJar.doExecute(JavadocJar.java:190)
12-Dec-2018 14:03:39         at org.apache.maven.plugins.javadoc.AbstractJavadocMojo.execute(AbstractJavadocMojo.java:1912)
12-Dec-2018 14:03:39         at org.apache.maven.plugin.DefaultBuildPluginManager.executeMojo(DefaultBuildPluginManager.java:134)
12-Dec-2018 14:03:39         at org.apache.maven.lifecycle.internal.MojoExecutor.execute(MojoExecutor.java:208)
12-Dec-2018 14:03:39         at org.apache.maven.lifecycle.internal.MojoExecutor.execute(MojoExecutor.java:154)
12-Dec-2018 14:03:39         at org.apache.maven.lifecycle.internal.MojoExecutor.execute(MojoExecutor.java:146)
12-Dec-2018 14:03:39         at org.apache.maven.lifecycle.internal.LifecycleModuleBuilder.buildProject(LifecycleModuleBuilder.java:117)
12-Dec-2018 14:03:39         at org.apache.maven.lifecycle.internal.LifecycleModuleBuilder.buildProject(LifecycleModuleBuilder.java:81)
12-Dec-2018 14:03:39         at org.apache.maven.lifecycle.internal.builder.singlethreaded.SingleThreadedBuilder.build(SingleThreadedBuilder.java:51)
12-Dec-2018 14:03:39         at org.apache.maven.lifecycle.internal.LifecycleStarter.execute(LifecycleStarter.java:128)
12-Dec-2018 14:03:39         at org.apache.maven.DefaultMaven.doExecute(DefaultMaven.java:309)
12-Dec-2018 14:03:39         at org.apache.maven.DefaultMaven.doExecute(DefaultMaven.java:194)
12-Dec-2018 14:03:39         at org.apache.maven.DefaultMaven.execute(DefaultMaven.java:107)
12-Dec-2018 14:03:39         at org.apache.maven.cli.MavenCli.execute(MavenCli.java:993)
12-Dec-2018 14:03:39         at org.apache.maven.cli.MavenCli.doMain(MavenCli.java:345)
12-Dec-2018 14:03:39         at org.apache.maven.cli.MavenCli.main(MavenCli.java:191)
12-Dec-2018 14:03:39         at sun.reflect.NativeMethodAccessorImpl.invoke0(Native Method)
12-Dec-2018 14:03:39         at sun.reflect.NativeMethodAccessorImpl.invoke(NativeMethodAccessorImpl.java:62)
12-Dec-2018 14:03:39         at sun.reflect.DelegatingMethodAccessorImpl.invoke(DelegatingMethodAccessorImpl.java:43)
12-Dec-2018 14:03:39         at java.lang.reflect.Method.invoke(Method.java:498)
12-Dec-2018 14:03:39         at org.codehaus.plexus.classworlds.launcher.Launcher.launchEnhanced(Launcher.java:289)
12-Dec-2018 14:03:39         at org.codehaus.plexus.classworlds.launcher.Launcher.launch(Launcher.java:229)
12-Dec-2018 14:03:39         at org.codehaus.plexus.classworlds.launcher.Launcher.mainWithExitCode(Launcher.java:415)
12-Dec-2018 14:03:39         at org.codehaus.plexus.classworlds.launcher.Launcher.main(Launcher.java:356)
12-Dec-2018 14:03:39 [INFO] Building jar: /opt/bamboo-home/xml-data/build-dir/SCD-K8S110BMASTER-JOB1/spring-cloud-dataflow-server-kubernetes-autoconfig/target/spring-cloud-dataflow-server-kubernetes-autoconfig-2.0.0.BUILD-SNAPSHOT-javadoc.jar
12-Dec-2018 14:03:40 [INFO]
12-Dec-2018 14:03:40 [INFO] --- maven-javadoc-plugin:3.0.1:jar (javadoc) @ spring-cloud-dataflow-server-kubernetes-autoconfig ---
12-Dec-2018 14:03:40 [INFO]
12-Dec-2018 14:03:40 1 error
12-Dec-2018 14:03:40 [ERROR] MavenReportException: Error while generating Javadoc:
12-Dec-2018 14:03:40 Exit code: 1 - /opt/bamboo-home/xml-data/build-dir/SCD-K8S110BMASTER-JOB1/spring-cloud-dataflow-server-kubernetes-autoconfig/src/main/java/org/springframework/cloud/dataflow/server/kubernetes/config/KubernetesDataFlowServerAutoConfiguration.java:33: error: reference not found
12-Dec-2018 14:03:40 * AutoConfiguration for the {@link KubernetesDataFlowServer}
12-Dec-2018 14:03:40                                     ^
12-Dec-2018 14:03:40
12-Dec-2018 14:03:40 Command line was: /opt/jdk1.8.0_144/jre/../bin/javadoc @options @packages
12-Dec-2018 14:03:40
12-Dec-2018 14:03:40 Refer to the generated Javadoc files in '/opt/bamboo-home/xml-data/build-dir/SCD-K8S110BMASTER-JOB1/spring-cloud-dataflow-server-kubernetes-autoconfig/target/apidocs' dir.
12-Dec-2018 14:03:40
12-Dec-2018 14:03:40 org.apache.maven.reporting.MavenReportException:
12-Dec-2018 14:03:40 Exit code: 1 - /opt/bamboo-home/xml-data/build-dir/SCD-K8S110BMASTER-JOB1/spring-cloud-dataflow-server-kubernetes-autoconfig/src/main/java/org/springframework/cloud/dataflow/server/kubernetes/config/KubernetesDataFlowServerAutoConfiguration.java:33: error: reference not found
12-Dec-2018 14:03:40 * AutoConfiguration for the {@link KubernetesDataFlowServer}
12-Dec-2018 14:03:40                                     ^
12-Dec-2018 14:03:40
12-Dec-2018 14:03:40 Command line was: /opt/jdk1.8.0_144/jre/../bin/javadoc @options @packages
12-Dec-2018 14:03:40
12-Dec-2018 14:03:40 Refer to the generated Javadoc files in '/opt/bamboo-home/xml-data/build-dir/SCD-K8S110BMASTER-JOB1/spring-cloud-dataflow-server-kubernetes-autoconfig/target/apidocs' dir.
12-Dec-2018 14:03:40
12-Dec-2018 14:03:40         at org.apache.maven.plugins.javadoc.AbstractJavadocMojo.executeJavadocCommandLine(AbstractJavadocMojo.java:5298)
12-Dec-2018 14:03:40         at org.apache.maven.plugins.javadoc.AbstractJavadocMojo.executeReport(AbstractJavadocMojo.java:2134)
12-Dec-2018 14:03:40         at org.apache.maven.plugins.javadoc.JavadocJar.doExecute(JavadocJar.java:190)
12-Dec-2018 14:03:40         at org.apache.maven.plugins.javadoc.AbstractJavadocMojo.execute(AbstractJavadocMojo.java:1912)
12-Dec-2018 14:03:40         at org.apache.maven.plugin.DefaultBuildPluginManager.executeMojo(DefaultBuildPluginManager.java:134)
12-Dec-2018 14:03:40         at org.apache.maven.lifecycle.internal.MojoExecutor.execute(MojoExecutor.java:208)
12-Dec-2018 14:03:40         at org.apache.maven.lifecycle.internal.MojoExecutor.execute(MojoExecutor.java:154)
12-Dec-2018 14:03:40         at org.apache.maven.lifecycle.internal.MojoExecutor.execute(MojoExecutor.java:146)
12-Dec-2018 14:03:40         at org.apache.maven.lifecycle.internal.LifecycleModuleBuilder.buildProject(LifecycleModuleBuilder.java:117)
12-Dec-2018 14:03:40         at org.apache.maven.lifecycle.internal.LifecycleModuleBuilder.buildProject(LifecycleModuleBuilder.java:81)
12-Dec-2018 14:03:40         at org.apache.maven.lifecycle.internal.builder.singlethreaded.SingleThreadedBuilder.build(SingleThreadedBuilder.java:51)
12-Dec-2018 14:03:40         at org.apache.maven.lifecycle.internal.LifecycleStarter.execute(LifecycleStarter.java:128)
12-Dec-2018 14:03:40         at org.apache.maven.DefaultMaven.doExecute(DefaultMaven.java:309)
12-Dec-2018 14:03:40         at org.apache.maven.DefaultMaven.doExecute(DefaultMaven.java:194)
12-Dec-2018 14:03:40         at org.apache.maven.DefaultMaven.execute(DefaultMaven.java:107)
12-Dec-2018 14:03:40         at org.apache.maven.cli.MavenCli.execute(MavenCli.java:993)
12-Dec-2018 14:03:40         at org.apache.maven.cli.MavenCli.doMain(MavenCli.java:345)
12-Dec-2018 14:03:40         at org.apache.maven.cli.MavenCli.main(MavenCli.java:191)
12-Dec-2018 14:03:40         at sun.reflect.NativeMethodAccessorImpl.invoke0(Native Method)
12-Dec-2018 14:03:40         at sun.reflect.NativeMethodAccessorImpl.invoke(NativeMethodAccessorImpl.java:62)
12-Dec-2018 14:03:40         at sun.reflect.DelegatingMethodAccessorImpl.invoke(DelegatingMethodAccessorImpl.java:43)
12-Dec-2018 14:03:40         at java.lang.reflect.Method.invoke(Method.java:498)
12-Dec-2018 14:03:40         at org.codehaus.plexus.classworlds.launcher.Launcher.launchEnhanced(Launcher.java:289)
12-Dec-2018 14:03:40         at org.codehaus.plexus.classworlds.launcher.Launcher.launch(Launcher.java:229)
12-Dec-2018 14:03:40         at org.codehaus.plexus.classworlds.launcher.Launcher.mainWithExitCode(Launcher.java:415)
12-Dec-2018 14:03:40         at org.codehaus.plexus.classworlds.launcher.Launcher.main(Launcher.java:356)
12-Dec-2018 14:03:40 [INFO] Building jar: /opt/bamboo-home/xml-data/build-dir/SCD-K8S110BMASTER-JOB1/spring-cloud-dataflow-server-kubernetes-autoconfig/target/spring-cloud-dataflow-server-kubernetes-autoconfig-2.0.0.BUILD-SNAPSHOT-javadoc.jar
12-Dec-2018 14:03:41 [INFO]
12-Dec-2018 14:03:41 [INFO] >>> maven-source-plugin:3.0.1:jar (attach-sources) > generate-sources @ spring-cloud-dataflow-server-kubernetes-autoconfig >>>
12-Dec-2018 14:03:41 [INFO]
12-Dec-2018 14:03:41 [INFO] --- maven-checkstyle-plugin:2.17:check (checkstyle-validation) @ spring-cloud-dataflow-server-kubernetes-autoconfig ---
12-Dec-2018 14:03:41 [INFO] Starting audit...
12-Dec-2018 14:03:41 Audit done.
12-Dec-2018 14:03:41 [INFO]
12-Dec-2018 14:03:41 [INFO] --- jacoco-maven-plugin:0.7.9:prepare-agent (agent) @ spring-cloud-dataflow-server-kubernetes-autoconfig ---
12-Dec-2018 14:03:41 [INFO] argLine set to -javaagent:/home/bamboo/.m2/repository/org/jacoco/org.jacoco.agent/0.7.9/org.jacoco.agent-0.7.9-runtime.jar=destfile=/opt/bamboo-home/xml-data/build-dir/SCD-K8S110BMASTER-JOB1/spring-cloud-dataflow-server-kubernetes-autoconfig/target/jacoco.exec
12-Dec-2018 14:03:41 [INFO]
12-Dec-2018 14:03:41 [INFO] <<< maven-source-plugin:3.0.1:jar (attach-sources) < generate-sources @ spring-cloud-dataflow-server-kubernetes-autoconfig <<<
12-Dec-2018 14:03:41 [INFO]
12-Dec-2018 14:03:41 [INFO]
12-Dec-2018 14:03:41 [INFO] --- maven-source-plugin:3.0.1:jar (attach-sources) @ spring-cloud-dataflow-server-kubernetes-autoconfig ---
12-Dec-2018 14:03:41 [INFO] Building jar: /opt/bamboo-home/xml-data/build-dir/SCD-K8S110BMASTER-JOB1/spring-cloud-dataflow-server-kubernetes-autoconfig/target/spring-cloud-dataflow-server-kubernetes-autoconfig-2.0.0.BUILD-SNAPSHOT-sources.jar
12-Dec-2018 14:03:41 [INFO]
12-Dec-2018 14:03:41 [INFO] --- maven-install-plugin:2.4:install (default-install) @ spring-cloud-dataflow-server-kubernetes-autoconfig ---
12-Dec-2018 14:03:41 [INFO] Installing /opt/bamboo-home/xml-data/build-dir/SCD-K8S110BMASTER-JOB1/spring-cloud-dataflow-server-kubernetes-autoconfig/target/spring-cloud-dataflow-server-kubernetes-autoconfig-2.0.0.BUILD-SNAPSHOT.jar to /home/bamboo/.m2/repository/org/springframework/cloud/spring-cloud-dataflow-server-kubernetes-autoconfig/2.0.0.BUILD-SNAPSHOT/spring-cloud-dataflow-server-kubernetes-autoconfig-2.0.0.BUILD-SNAPSHOT.jar
12-Dec-2018 14:03:41 [INFO] Installing /opt/bamboo-home/xml-data/build-dir/SCD-K8S110BMASTER-JOB1/spring-cloud-dataflow-server-kubernetes-autoconfig/pom.xml to /home/bamboo/.m2/repository/org/springframework/cloud/spring-cloud-dataflow-server-kubernetes-autoconfig/2.0.0.BUILD-SNAPSHOT/spring-cloud-dataflow-server-kubernetes-autoconfig-2.0.0.BUILD-SNAPSHOT.pom
12-Dec-2018 14:03:41 [INFO] Installing /opt/bamboo-home/xml-data/build-dir/SCD-K8S110BMASTER-JOB1/spring-cloud-dataflow-server-kubernetes-autoconfig/target/spring-cloud-dataflow-server-kubernetes-autoconfig-2.0.0.BUILD-SNAPSHOT-javadoc.jar to /home/bamboo/.m2/repository/org/springframework/cloud/spring-cloud-dataflow-server-kubernetes-autoconfig/2.0.0.BUILD-SNAPSHOT/spring-cloud-dataflow-server-kubernetes-autoconfig-2.0.0.BUILD-SNAPSHOT-javadoc.jar
12-Dec-2018 14:03:41 [INFO] Installing /opt/bamboo-home/xml-data/build-dir/SCD-K8S110BMASTER-JOB1/spring-cloud-dataflow-server-kubernetes-autoconfig/target/spring-cloud-dataflow-server-kubernetes-autoconfig-2.0.0.BUILD-SNAPSHOT-javadoc.jar to /home/bamboo/.m2/repository/org/springframework/cloud/spring-cloud-dataflow-server-kubernetes-autoconfig/2.0.0.BUILD-SNAPSHOT/spring-cloud-dataflow-server-kubernetes-autoconfig-2.0.0.BUILD-SNAPSHOT-javadoc.jar
12-Dec-2018 14:03:41 [INFO] Installing /opt/bamboo-home/xml-data/build-dir/SCD-K8S110BMASTER-JOB1/spring-cloud-dataflow-server-kubernetes-autoconfig/target/spring-cloud-dataflow-server-kubernetes-autoconfig-2.0.0.BUILD-SNAPSHOT-sources.jar to /home/bamboo/.m2/repository/org/springframework/cloud/spring-cloud-dataflow-server-kubernetes-autoconfig/2.0.0.BUILD-SNAPSHOT/spring-cloud-dataflow-server-kubernetes-autoconfig-2.0.0.BUILD-SNAPSHOT-sources.jar
12-Dec-2018 14:03:41 [INFO]
12-Dec-2018 14:03:41 [INFO] ------------------------------------------------------------------------
12-Dec-2018 14:03:41 [INFO] Building Kubernetes Data Flow Server 2.0.0.BUILD-SNAPSHOT
12-Dec-2018 14:03:41 [INFO] ------------------------------------------------------------------------
12-Dec-2018 14:03:42 [INFO] Downloading: http://repo.spring.io/libs-snapshot-local/org/springframework/cloud/spring-cloud-kubernetes-core/1.0.0.RC1/spring-cloud-kubernetes-core-1.0.0.RC1.pom
12-Dec-2018 14:03:42 [INFO] Downloading: http://repo.spring.io/libs-milestone-local/org/springframework/cloud/spring-cloud-kubernetes-core/1.0.0.RC1/spring-cloud-kubernetes-core-1.0.0.RC1.pom
12-Dec-2018 14:03:42 [INFO] Downloaded: http://repo.spring.io/libs-milestone-local/org/springframework/cloud/spring-cloud-kubernetes-core/1.0.0.RC1/spring-cloud-kubernetes-core-1.0.0.RC1.pom (3.9 kB at 21 kB/s)
12-Dec-2018 14:03:42 [INFO] Downloading: http://repo.spring.io/libs-snapshot-local/org/springframework/cloud/spring-cloud-kubernetes/1.0.0.RC1/spring-cloud-kubernetes-1.0.0.RC1.pom
12-Dec-2018 14:03:42 [INFO] Downloading: http://repo.spring.io/libs-milestone-local/org/springframework/cloud/spring-cloud-kubernetes/1.0.0.RC1/spring-cloud-kubernetes-1.0.0.RC1.pom
12-Dec-2018 14:03:42 [INFO] Downloaded: http://repo.spring.io/libs-milestone-local/org/springframework/cloud/spring-cloud-kubernetes/1.0.0.RC1/spring-cloud-kubernetes-1.0.0.RC1.pom (8.4 kB at 50 kB/s)
12-Dec-2018 14:03:42 [INFO] Downloading: http://repo.spring.io/libs-snapshot-local/org/springframework/cloud/spring-cloud-kubernetes-config/1.0.0.RC1/spring-cloud-kubernetes-config-1.0.0.RC1.pom
12-Dec-2018 14:03:42 [INFO] Downloading: http://repo.spring.io/libs-milestone-local/org/springframework/cloud/spring-cloud-kubernetes-config/1.0.0.RC1/spring-cloud-kubernetes-config-1.0.0.RC1.pom
12-Dec-2018 14:03:42 [INFO] Downloaded: http://repo.spring.io/libs-milestone-local/org/springframework/cloud/spring-cloud-kubernetes-config/1.0.0.RC1/spring-cloud-kubernetes-config-1.0.0.RC1.pom (5.8 kB at 22 kB/s)
12-Dec-2018 14:03:42 [INFO] Downloading: http://repo.spring.io/libs-snapshot-local/org/springframework/cloud/spring-cloud-kubernetes-core/1.0.0.RC1/spring-cloud-kubernetes-core-1.0.0.RC1.jar
12-Dec-2018 14:03:42 [INFO] Downloading: http://repo.spring.io/libs-snapshot-local/org/springframework/cloud/spring-cloud-kubernetes-config/1.0.0.RC1/spring-cloud-kubernetes-config-1.0.0.RC1.jar
12-Dec-2018 14:03:43 [INFO] Downloading: http://repo.spring.io/libs-milestone-local/org/springframework/cloud/spring-cloud-kubernetes-core/1.0.0.RC1/spring-cloud-kubernetes-core-1.0.0.RC1.jar
12-Dec-2018 14:03:43 [INFO] Downloading: http://repo.spring.io/libs-milestone-local/org/springframework/cloud/spring-cloud-kubernetes-config/1.0.0.RC1/spring-cloud-kubernetes-config-1.0.0.RC1.jar
12-Dec-2018 14:03:43 [INFO] Downloaded: http://repo.spring.io/libs-milestone-local/org/springframework/cloud/spring-cloud-kubernetes-core/1.0.0.RC1/spring-cloud-kubernetes-core-1.0.0.RC1.jar (19 kB at 96 kB/s)
12-Dec-2018 14:03:43 [INFO] Downloaded: http://repo.spring.io/libs-milestone-local/org/springframework/cloud/spring-cloud-kubernetes-config/1.0.0.RC1/spring-cloud-kubernetes-config-1.0.0.RC1.jar (46 kB at 178 kB/s)
12-Dec-2018 14:03:43 [INFO]
12-Dec-2018 14:03:43 [INFO] --- maven-clean-plugin:2.5:clean (default-clean) @ spring-cloud-dataflow-server-kubernetes ---
12-Dec-2018 14:03:43 [INFO]
12-Dec-2018 14:03:43 [INFO] --- maven-checkstyle-plugin:2.17:check (checkstyle-validation) @ spring-cloud-dataflow-server-kubernetes ---
12-Dec-2018 14:03:43 [INFO] Starting audit...
12-Dec-2018 14:03:43 Audit done.
12-Dec-2018 14:03:43 [INFO]
12-Dec-2018 14:03:43 [INFO] --- jacoco-maven-plugin:0.7.9:prepare-agent (agent) @ spring-cloud-dataflow-server-kubernetes ---
12-Dec-2018 14:03:43 [INFO] argLine set to -javaagent:/home/bamboo/.m2/repository/org/jacoco/org.jacoco.agent/0.7.9/org.jacoco.agent-0.7.9-runtime.jar=destfile=/opt/bamboo-home/xml-data/build-dir/SCD-K8S110BMASTER-JOB1/spring-cloud-dataflow-server-kubernetes/target/jacoco.exec
12-Dec-2018 14:03:43 [INFO]
12-Dec-2018 14:03:43 [INFO] --- maven-resources-plugin:3.1.0:resources (default-resources) @ spring-cloud-dataflow-server-kubernetes ---
12-Dec-2018 14:03:43 [INFO] Using 'UTF-8' encoding to copy filtered resources.
12-Dec-2018 14:03:43 [INFO] Copying 1 resource
12-Dec-2018 14:03:43 [INFO]
12-Dec-2018 14:03:43 [INFO] --- maven-compiler-plugin:3.8.0:compile (default-compile) @ spring-cloud-dataflow-server-kubernetes ---
12-Dec-2018 14:03:43 [INFO] Changes detected - recompiling the module!
12-Dec-2018 14:03:43 [INFO] Compiling 1 source file to /opt/bamboo-home/xml-data/build-dir/SCD-K8S110BMASTER-JOB1/spring-cloud-dataflow-server-kubernetes/target/classes
12-Dec-2018 14:03:43 [INFO]
12-Dec-2018 14:03:43 [INFO] --- maven-resources-plugin:3.1.0:testResources (default-testResources) @ spring-cloud-dataflow-server-kubernetes ---
12-Dec-2018 14:03:43 [INFO] Using 'UTF-8' encoding to copy filtered resources.
12-Dec-2018 14:03:43 [INFO] skip non existing resourceDirectory /opt/bamboo-home/xml-data/build-dir/SCD-K8S110BMASTER-JOB1/spring-cloud-dataflow-server-kubernetes/src/test/resources
12-Dec-2018 14:03:43 [INFO]
12-Dec-2018 14:03:43 [INFO] --- maven-compiler-plugin:3.8.0:testCompile (default-testCompile) @ spring-cloud-dataflow-server-kubernetes ---
12-Dec-2018 14:03:43 [INFO] Changes detected - recompiling the module!
12-Dec-2018 14:03:43 [INFO] Compiling 1 source file to /opt/bamboo-home/xml-data/build-dir/SCD-K8S110BMASTER-JOB1/spring-cloud-dataflow-server-kubernetes/target/test-classes
12-Dec-2018 14:03:43 [INFO]
12-Dec-2018 14:03:43 [INFO] --- maven-surefire-plugin:2.22.0:test (default-test) @ spring-cloud-dataflow-server-kubernetes ---
12-Dec-2018 14:03:43 [INFO]
12-Dec-2018 14:03:43 [INFO] -------------------------------------------------------
12-Dec-2018 14:03:43 [INFO]  T E S T S
12-Dec-2018 14:03:43 [INFO] -------------------------------------------------------
12-Dec-2018 14:03:44 [INFO] Running org.springframework.cloud.dataflow.server.kubernetes.ContextLoadsTests
12-Dec-2018 14:03:44 14:03:44.465 [main] DEBUG org.springframework.test.context.junit4.SpringJUnit4ClassRunner - SpringJUnit4ClassRunner constructor called with [class org.springframework.cloud.dataflow.server.kubernetes.ContextLoadsTests]
12-Dec-2018 14:03:44 14:03:44.473 [main] DEBUG org.springframework.test.context.BootstrapUtils - Instantiating CacheAwareContextLoaderDelegate from class [org.springframework.test.context.cache.DefaultCacheAwareContextLoaderDelegate]
12-Dec-2018 14:03:44 14:03:44.486 [main] DEBUG org.springframework.test.context.BootstrapUtils - Instantiating BootstrapContext using constructor [public org.springframework.test.context.support.DefaultBootstrapContext(java.lang.Class,org.springframework.test.context.CacheAwareContextLoaderDelegate)]
12-Dec-2018 14:03:44 14:03:44.515 [main] DEBUG org.springframework.test.context.BootstrapUtils - Instantiating TestContextBootstrapper for test class [org.springframework.cloud.dataflow.server.kubernetes.ContextLoadsTests] from class [org.springframework.boot.test.context.SpringBootTestContextBootstrapper]
12-Dec-2018 14:03:44 14:03:44.534 [main] INFO org.springframework.boot.test.context.SpringBootTestContextBootstrapper - Neither @ContextConfiguration nor @ContextHierarchy found for test class [org.springframework.cloud.dataflow.server.kubernetes.ContextLoadsTests], using SpringBootContextLoader
12-Dec-2018 14:03:44 14:03:44.539 [main] DEBUG org.springframework.test.context.support.AbstractContextLoader - Did not detect default resource location for test class [org.springframework.cloud.dataflow.server.kubernetes.ContextLoadsTests]: class path resource [org/springframework/cloud/dataflow/server/kubernetes/ContextLoadsTests-context.xml] does not exist
12-Dec-2018 14:03:44 14:03:44.540 [main] DEBUG org.springframework.test.context.support.AbstractContextLoader - Did not detect default resource location for test class [org.springframework.cloud.dataflow.server.kubernetes.ContextLoadsTests]: class path resource [org/springframework/cloud/dataflow/server/kubernetes/ContextLoadsTestsContext.groovy] does not exist
12-Dec-2018 14:03:44 14:03:44.540 [main] INFO org.springframework.test.context.support.AbstractContextLoader - Could not detect default resource locations for test class [org.springframework.cloud.dataflow.server.kubernetes.ContextLoadsTests]: no resource found for suffixes {-context.xml, Context.groovy}.
12-Dec-2018 14:03:44 14:03:44.597 [main] DEBUG org.springframework.test.context.support.ActiveProfilesUtils - Could not find an 'annotation declaring class' for annotation type [org.springframework.test.context.ActiveProfiles] and class [org.springframework.cloud.dataflow.server.kubernetes.ContextLoadsTests]
12-Dec-2018 14:03:44 14:03:44.816 [main] DEBUG org.springframework.boot.test.context.SpringBootTestContextBootstrapper - @TestExecutionListeners is not present for class [org.springframework.cloud.dataflow.server.kubernetes.ContextLoadsTests]: using defaults.
12-Dec-2018 14:03:44 14:03:44.817 [main] INFO org.springframework.boot.test.context.SpringBootTestContextBootstrapper - Loaded default TestExecutionListener class names from location [META-INF/spring.factories]: [org.springframework.boot.test.mock.mockito.MockitoTestExecutionListener, org.springframework.boot.test.mock.mockito.ResetMocksTestExecutionListener, org.springframework.boot.test.autoconfigure.restdocs.RestDocsTestExecutionListener, org.springframework.boot.test.autoconfigure.web.client.MockRestServiceServerResetTestExecutionListener, org.springframework.boot.test.autoconfigure.web.servlet.MockMvcPrintOnlyOnFailureTestExecutionListener, org.springframework.boot.test.autoconfigure.web.servlet.WebDriverTestExecutionListener, org.springframework.test.context.web.ServletTestExecutionListener, org.springframework.test.context.support.DirtiesContextBeforeModesTestExecutionListener, org.springframework.test.context.support.DependencyInjectionTestExecutionListener, org.springframework.test.context.support.DirtiesContextTestExecutionListener, org.springframework.test.context.transaction.TransactionalTestExecutionListener, org.springframework.test.context.jdbc.SqlScriptsTestExecutionListener]
12-Dec-2018 14:03:44 14:03:44.844 [main] INFO org.springframework.boot.test.context.SpringBootTestContextBootstrapper - Using TestExecutionListeners: [org.springframework.test.context.web.ServletTestExecutionListener@30c19bff, org.springframework.test.context.support.DirtiesContextBeforeModesTestExecutionListener@4e375bba, org.springframework.boot.test.mock.mockito.MockitoTestExecutionListener@ab2e6d2, org.springframework.boot.test.autoconfigure.SpringBootDependencyInjectionTestExecutionListener@71664560, org.springframework.test.context.support.DirtiesContextTestExecutionListener@4d4436d0, org.springframework.test.context.transaction.TransactionalTestExecutionListener@39da5e49, org.springframework.test.context.jdbc.SqlScriptsTestExecutionListener@2443abd6, org.springframework.boot.test.mock.mockito.ResetMocksTestExecutionListener@674da77b, org.springframework.boot.test.autoconfigure.restdocs.RestDocsTestExecutionListener@bd3eff4, org.springframework.boot.test.autoconfigure.web.client.MockRestServiceServerResetTestExecutionListener@6010d0d1, org.springframework.boot.test.autoconfigure.web.servlet.MockMvcPrintOnlyOnFailureTestExecutionListener@5934ca1e, org.springframework.boot.test.autoconfigure.web.servlet.WebDriverTestExecutionListener@5348d83c]
12-Dec-2018 14:03:44 14:03:44.847 [main] DEBUG org.springframework.test.annotation.ProfileValueUtils - Retrieved @ProfileValueSourceConfiguration [null] for test class [org.springframework.cloud.dataflow.server.kubernetes.ContextLoadsTests]
12-Dec-2018 14:03:44 14:03:44.848 [main] DEBUG org.springframework.test.annotation.ProfileValueUtils - Retrieved ProfileValueSource type [class org.springframework.test.annotation.SystemProfileValueSource] for class [org.springframework.cloud.dataflow.server.kubernetes.ContextLoadsTests]
12-Dec-2018 14:03:44 14:03:44.850 [main] DEBUG org.springframework.test.annotation.ProfileValueUtils - Retrieved @ProfileValueSourceConfiguration [null] for test class [org.springframework.cloud.dataflow.server.kubernetes.ContextLoadsTests]
12-Dec-2018 14:03:44 14:03:44.850 [main] DEBUG org.springframework.test.annotation.ProfileValueUtils - Retrieved ProfileValueSource type [class org.springframework.test.annotation.SystemProfileValueSource] for class [org.springframework.cloud.dataflow.server.kubernetes.ContextLoadsTests]
12-Dec-2018 14:03:44 14:03:44.851 [main] DEBUG org.springframework.test.annotation.ProfileValueUtils - Retrieved @ProfileValueSourceConfiguration [null] for test class [org.springframework.cloud.dataflow.server.kubernetes.ContextLoadsTests]
12-Dec-2018 14:03:44 14:03:44.852 [main] DEBUG org.springframework.test.annotation.ProfileValueUtils - Retrieved ProfileValueSource type [class org.springframework.test.annotation.SystemProfileValueSource] for class [org.springframework.cloud.dataflow.server.kubernetes.ContextLoadsTests]
12-Dec-2018 14:03:44 14:03:44.858 [main] DEBUG org.springframework.test.context.support.AbstractDirtiesContextTestExecutionListener - Before test class: context [DefaultTestContext@96897c8 testClass = ContextLoadsTests, testInstance = [null], testMethod = [null], testException = [null], mergedContextConfiguration = [WebMergedContextConfiguration@7f97bc14 testClass = ContextLoadsTests, locations = '{}', classes = '{class org.springframework.cloud.dataflow.server.kubernetes.KubernetesDataFlowServer, class org.springframework.cloud.dataflow.server.kubernetes.KubernetesDataFlowServer}', contextInitializerClasses = '[]', activeProfiles = '{}', propertySourceLocations = '{}', propertySourceProperties = '{org.springframework.boot.test.context.SpringBootTestContextBootstrapper=true, server.port=0}', contextCustomizers = set[org.springframework.boot.test.context.filter.ExcludeFilterContextCustomizer@352e787a, org.springframework.boot.test.json.DuplicateJsonObjectContextCustomizerFactory$DuplicateJsonObjectContextCustomizer@6d171ce0, org.springframework.boot.test.mock.mockito.MockitoContextCustomizer@0, org.springframework.boot.test.web.client.TestRestTemplateContextCustomizer@c6a6c1d, org.springframework.boot.test.autoconfigure.properties.PropertyMappingContextCustomizer@0, org.springframework.boot.test.autoconfigure.web.servlet.WebDriverContextCustomizerFactory$Customizer@20e6c4dc], resourceBasePath = 'src/main/webapp', contextLoader = 'org.springframework.boot.test.context.SpringBootContextLoader', parent = [null]], attributes = map['org.springframework.test.context.web.ServletTestExecutionListener.activateListener' -> false]], class annotated with @DirtiesContext [false] with mode [null].
12-Dec-2018 14:03:44 14:03:44.859 [main] DEBUG org.springframework.test.annotation.ProfileValueUtils - Retrieved @ProfileValueSourceConfiguration [null] for test class [org.springframework.cloud.dataflow.server.kubernetes.ContextLoadsTests]
12-Dec-2018 14:03:44 14:03:44.859 [main] DEBUG org.springframework.test.annotation.ProfileValueUtils - Retrieved ProfileValueSource type [class org.springframework.test.annotation.SystemProfileValueSource] for class [org.springframework.cloud.dataflow.server.kubernetes.ContextLoadsTests]
12-Dec-2018 14:03:44 14:03:44.868 [main] DEBUG org.springframework.test.context.support.DependencyInjectionTestExecutionListener - Performing dependency injection for test context [[DefaultTestContext@96897c8 testClass = ContextLoadsTests, testInstance = org.springframework.cloud.dataflow.server.kubernetes.ContextLoadsTests@9df564f, testMethod = [null], testException = [null], mergedContextConfiguration = [WebMergedContextConfiguration@7f97bc14 testClass = ContextLoadsTests, locations = '{}', classes = '{class org.springframework.cloud.dataflow.server.kubernetes.KubernetesDataFlowServer, class org.springframework.cloud.dataflow.server.kubernetes.KubernetesDataFlowServer}', contextInitializerClasses = '[]', activeProfiles = '{}', propertySourceLocations = '{}', propertySourceProperties = '{org.springframework.boot.test.context.SpringBootTestContextBootstrapper=true, server.port=0}', contextCustomizers = set[org.springframework.boot.test.context.filter.ExcludeFilterContextCustomizer@352e787a, org.springframework.boot.test.json.DuplicateJsonObjectContextCustomizerFactory$DuplicateJsonObjectContextCustomizer@6d171ce0, org.springframework.boot.test.mock.mockito.MockitoContextCustomizer@0, org.springframework.boot.test.web.client.TestRestTemplateContextCustomizer@c6a6c1d, org.springframework.boot.test.autoconfigure.properties.PropertyMappingContextCustomizer@0, org.springframework.boot.test.autoconfigure.web.servlet.WebDriverContextCustomizerFactory$Customizer@20e6c4dc], resourceBasePath = 'src/main/webapp', contextLoader = 'org.springframework.boot.test.context.SpringBootContextLoader', parent = [null]], attributes = map['org.springframework.test.context.web.ServletTestExecutionListener.activateListener' -> false]]].
12-Dec-2018 14:03:44 14:03:44.926 [main] DEBUG org.springframework.test.context.support.TestPropertySourceUtils - Adding inlined properties to environment: {spring.jmx.enabled=false, org.springframework.boot.test.context.SpringBootTestContextBootstrapper=true, server.port=0}
12-Dec-2018 14:03:46 2018-12-12 14:03:46.677  INFO 31418 --- [           main] trationDelegate$BeanPostProcessorChecker : Bean 'org.springframework.cloud.autoconfigure.ConfigurationPropertiesRebinderAutoConfiguration' of type [org.springframework.cloud.autoconfigure.ConfigurationPropertiesRebinderAutoConfiguration$$EnhancerBySpringCGLIB$$30c2f2e9] is not eligible for getting processed by all BeanPostProcessors (for example: not eligible for auto-proxying)
12-Dec-2018 14:03:47   ____                              ____ _                __
12-Dec-2018 14:03:47 / ___| _ __  _ __(_)_ __   __ _   / ___| | ___  _   _  __| |
12-Dec-2018 14:03:47 \___ \| '_ \| '__| | '_ \ / _` | | |   | |/ _ \| | | |/ _` |
12-Dec-2018 14:03:47   ___) | |_) | |  | | | | | (_| | | |___| | (_) | |_| | (_| |
12-Dec-2018 14:03:47 |____/| .__/|_|  |_|_| |_|\__, |  \____|_|\___/ \__,_|\__,_|
12-Dec-2018 14:03:47   ____ |_|    _          __|___/                 __________
12-Dec-2018 14:03:47 |  _ \  __ _| |_ __ _  |  ___| | _____      __  \ \ \ \ \ \
12-Dec-2018 14:03:47 | | | |/ _` | __/ _` | | |_  | |/ _ \ \ /\ / /   \ \ \ \ \ \
12-Dec-2018 14:03:47 | |_| | (_| | || (_| | |  _| | | (_) \ V  V /    / / / / / /
12-Dec-2018 14:03:47 |____/ \__,_|\__\__,_| |_|   |_|\___/ \_/\_/    /_/_/_/_/_/
12-Dec-2018 14:03:47
12-Dec-2018 14:03:47
12-Dec-2018 14:03:47
12-Dec-2018 14:03:47 2018-12-12 14:03:47.029  INFO 31418 --- [           main] c.c.c.ConfigServicePropertySourceLocator : Fetching config from server at : http://localhost:8888
12-Dec-2018 14:03:47 2018-12-12 14:03:47.080  INFO 31418 --- [           main] c.c.c.ConfigServicePropertySourceLocator : Connect Timeout Exception on Url - http://localhost:8888. Will be trying the next url if available
12-Dec-2018 14:03:47 2018-12-12 14:03:47.081  WARN 31418 --- [           main] c.c.c.ConfigServicePropertySourceLocator : Could not locate PropertySource: I/O error on GET request for "http://localhost:8888/spring-cloud-dataflow-server-kubernetes/default": Connection refused (Connection refused); nested exception is java.net.ConnectException: Connection refused (Connection refused)
12-Dec-2018 14:03:47 2018-12-12 14:03:47.762  WARN 31418 --- [           main] o.s.c.k.config.ConfigMapPropertySource   : Can't read configMap with name: [spring-cloud-dataflow-server-kubernetes] in namespace:[default]. Ignoring
12-Dec-2018 14:03:47
12-Dec-2018 14:03:47 io.fabric8.kubernetes.client.KubernetesClientException: Failure executing: GET at: https://35.227.88.51/api/v1/namespaces/default/configmaps/spring-cloud-dataflow-server-kubernetes. Message: Unauthorized! Token may have expired! Please log-in again. Unauthorized.
12-Dec-2018 14:03:47         at io.fabric8.kubernetes.client.dsl.base.OperationSupport.requestFailure(OperationSupport.java:472) ~[kubernetes-client-3.1.10.jar:na]
12-Dec-2018 14:03:47         at io.fabric8.kubernetes.client.dsl.base.OperationSupport.assertResponseCode(OperationSupport.java:409) ~[kubernetes-client-3.1.10.jar:na]
12-Dec-2018 14:03:47         at io.fabric8.kubernetes.client.dsl.base.OperationSupport.handleResponse(OperationSupport.java:381) ~[kubernetes-client-3.1.10.jar:na]
12-Dec-2018 14:03:47         at io.fabric8.kubernetes.client.dsl.base.OperationSupport.handleResponse(OperationSupport.java:344) ~[kubernetes-client-3.1.10.jar:na]
12-Dec-2018 14:03:47         at io.fabric8.kubernetes.client.dsl.base.OperationSupport.handleGet(OperationSupport.java:313) ~[kubernetes-client-3.1.10.jar:na]
12-Dec-2018 14:03:47         at io.fabric8.kubernetes.client.dsl.base.OperationSupport.handleGet(OperationSupport.java:296) ~[kubernetes-client-3.1.10.jar:na]
12-Dec-2018 14:03:47         at io.fabric8.kubernetes.client.dsl.base.BaseOperation.handleGet(BaseOperation.java:770) ~[kubernetes-client-3.1.10.jar:na]
12-Dec-2018 14:03:47         at io.fabric8.kubernetes.client.dsl.base.BaseOperation.getMandatory(BaseOperation.java:195) ~[kubernetes-client-3.1.10.jar:na]
12-Dec-2018 14:03:47         at io.fabric8.kubernetes.client.dsl.base.BaseOperation.get(BaseOperation.java:162) ~[kubernetes-client-3.1.10.jar:na]
12-Dec-2018 14:03:47         at org.springframework.cloud.kubernetes.config.ConfigMapPropertySource.getData(ConfigMapPropertySource.java:86) [spring-cloud-kubernetes-config-1.0.0.RC1.jar:1.0.0.RC1]
12-Dec-2018 14:03:47         at org.springframework.cloud.kubernetes.config.ConfigMapPropertySource.<init>(ConfigMapPropertySource.java:66) [spring-cloud-kubernetes-config-1.0.0.RC1.jar:1.0.0.RC1]
12-Dec-2018 14:03:47         at org.springframework.cloud.kubernetes.config.ConfigMapPropertySourceLocator.getMapPropertySourceForSingleConfigMap(ConfigMapPropertySourceLocator.java:77) [spring-cloud-kubernetes-config-1.0.0.RC1.jar:1.0.0.RC1]
12-Dec-2018 14:03:47         at org.springframework.cloud.kubernetes.config.ConfigMapPropertySourceLocator.locate(ConfigMapPropertySourceLocator.java:55) [spring-cloud-kubernetes-config-1.0.0.RC1.jar:1.0.0.RC1]
12-Dec-2018 14:03:47         at org.springframework.cloud.bootstrap.config.PropertySourceBootstrapConfiguration.initialize(PropertySourceBootstrapConfiguration.java:94) [spring-cloud-context-2.1.0.RC2.jar:2.1.0.RC2]
12-Dec-2018 14:03:47         at org.springframework.boot.SpringApplication.applyInitializers(SpringApplication.java:649) [spring-boot-2.1.1.RELEASE.jar:2.1.1.RELEASE]
12-Dec-2018 14:03:47         at org.springframework.boot.SpringApplication.prepareContext(SpringApplication.java:373) [spring-boot-2.1.1.RELEASE.jar:2.1.1.RELEASE]
12-Dec-2018 14:03:47         at org.springframework.boot.SpringApplication.run(SpringApplication.java:314) [spring-boot-2.1.1.RELEASE.jar:2.1.1.RELEASE]
12-Dec-2018 14:03:47         at org.springframework.boot.test.context.SpringBootContextLoader.loadContext(SpringBootContextLoader.java:127) [spring-boot-test-2.1.1.RELEASE.jar:2.1.1.RELEASE]
12-Dec-2018 14:03:47         at org.springframework.test.context.cache.DefaultCacheAwareContextLoaderDelegate.loadContextInternal(DefaultCacheAwareContextLoaderDelegate.java:99) [spring-test-5.1.3.RELEASE.jar:5.1.3.RELEASE]
12-Dec-2018 14:03:47         at org.springframework.test.context.cache.DefaultCacheAwareContextLoaderDelegate.loadContext(DefaultCacheAwareContextLoaderDelegate.java:117) [spring-test-5.1.3.RELEASE.jar:5.1.3.RELEASE]
12-Dec-2018 14:03:47         at org.springframework.test.context.support.DefaultTestContext.getApplicationContext(DefaultTestContext.java:108) [spring-test-5.1.3.RELEASE.jar:5.1.3.RELEASE]
12-Dec-2018 14:03:47         at org.springframework.test.context.support.DependencyInjectionTestExecutionListener.injectDependencies(DependencyInjectionTestExecutionListener.java:118) [spring-test-5.1.3.RELEASE.jar:5.1.3.RELEASE]
12-Dec-2018 14:03:47         at org.springframework.test.context.support.DependencyInjectionTestExecutionListener.prepareTestInstance(DependencyInjectionTestExecutionListener.java:83) [spring-test-5.1.3.RELEASE.jar:5.1.3.RELEASE]
12-Dec-2018 14:03:47         at org.springframework.boot.test.autoconfigure.SpringBootDependencyInjectionTestExecutionListener.prepareTestInstance(SpringBootDependencyInjectionTestExecutionListener.java:44) [spring-boot-test-autoconfigure-2.1.1.RELEASE.jar:2.1.1.RELEASE]
12-Dec-2018 14:03:47         at org.springframework.test.context.TestContextManager.prepareTestInstance(TestContextManager.java:246) [spring-test-5.1.3.RELEASE.jar:5.1.3.RELEASE]
12-Dec-2018 14:03:47         at org.springframework.test.context.junit4.SpringJUnit4ClassRunner.createTest(SpringJUnit4ClassRunner.java:227) [spring-test-5.1.3.RELEASE.jar:5.1.3.RELEASE]
12-Dec-2018 14:03:47         at org.springframework.test.context.junit4.SpringJUnit4ClassRunner$1.runReflectiveCall(SpringJUnit4ClassRunner.java:289) [spring-test-5.1.3.RELEASE.jar:5.1.3.RELEASE]
12-Dec-2018 14:03:47         at org.junit.internal.runners.model.ReflectiveCallable.run(ReflectiveCallable.java:12) [junit-4.12.jar:4.12]
12-Dec-2018 14:03:47         at org.springframework.test.context.junit4.SpringJUnit4ClassRunner.methodBlock(SpringJUnit4ClassRunner.java:291) [spring-test-5.1.3.RELEASE.jar:5.1.3.RELEASE]
12-Dec-2018 14:03:47         at org.springframework.test.context.junit4.SpringJUnit4ClassRunner.runChild(SpringJUnit4ClassRunner.java:246) [spring-test-5.1.3.RELEASE.jar:5.1.3.RELEASE]
12-Dec-2018 14:03:47         at org.springframework.test.context.junit4.SpringJUnit4ClassRunner.runChild(SpringJUnit4ClassRunner.java:97) [spring-test-5.1.3.RELEASE.jar:5.1.3.RELEASE]
12-Dec-2018 14:03:47         at org.junit.runners.ParentRunner$3.run(ParentRunner.java:290) [junit-4.12.jar:4.12]
12-Dec-2018 14:03:47         at org.junit.runners.ParentRunner$1.schedule(ParentRunner.java:71) [junit-4.12.jar:4.12]
12-Dec-2018 14:03:47         at org.junit.runners.ParentRunner.runChildren(ParentRunner.java:288) [junit-4.12.jar:4.12]
12-Dec-2018 14:03:47         at org.junit.runners.ParentRunner.access$000(ParentRunner.java:58) [junit-4.12.jar:4.12]
12-Dec-2018 14:03:47         at org.junit.runners.ParentRunner$2.evaluate(ParentRunner.java:268) [junit-4.12.jar:4.12]
12-Dec-2018 14:03:47         at org.springframework.test.context.junit4.statements.RunBeforeTestClassCallbacks.evaluate(RunBeforeTestClassCallbacks.java:61) [spring-test-5.1.3.RELEASE.jar:5.1.3.RELEASE]
12-Dec-2018 14:03:47         at org.springframework.test.context.junit4.statements.RunAfterTestClassCallbacks.evaluate(RunAfterTestClassCallbacks.java:70) [spring-test-5.1.3.RELEASE.jar:5.1.3.RELEASE]
12-Dec-2018 14:03:47         at org.junit.runners.ParentRunner.run(ParentRunner.java:363) [junit-4.12.jar:4.12]
12-Dec-2018 14:03:47         at org.springframework.test.context.junit4.SpringJUnit4ClassRunner.run(SpringJUnit4ClassRunner.java:190) [spring-test-5.1.3.RELEASE.jar:5.1.3.RELEASE]
12-Dec-2018 14:03:47         at org.apache.maven.surefire.junit4.JUnit4Provider.execute(JUnit4Provider.java:365) [surefire-junit4-2.22.0.jar:2.22.0]
12-Dec-2018 14:03:47         at org.apache.maven.surefire.junit4.JUnit4Provider.executeWithRerun(JUnit4Provider.java:273) [surefire-junit4-2.22.0.jar:2.22.0]
12-Dec-2018 14:03:47         at org.apache.maven.surefire.junit4.JUnit4Provider.executeTestSet(JUnit4Provider.java:238) [surefire-junit4-2.22.0.jar:2.22.0]
12-Dec-2018 14:03:47         at org.apache.maven.surefire.junit4.JUnit4Provider.invoke(JUnit4Provider.java:159) [surefire-junit4-2.22.0.jar:2.22.0]
12-Dec-2018 14:03:47         at org.apache.maven.surefire.booter.ForkedBooter.invokeProviderInSameClassLoader(ForkedBooter.java:383) [surefire-booter-2.22.0.jar:2.22.0]
12-Dec-2018 14:03:47         at org.apache.maven.surefire.booter.ForkedBooter.runSuitesInProcess(ForkedBooter.java:344) [surefire-booter-2.22.0.jar:2.22.0]
12-Dec-2018 14:03:47         at org.apache.maven.surefire.booter.ForkedBooter.execute(ForkedBooter.java:125) [surefire-booter-2.22.0.jar:2.22.0]
12-Dec-2018 14:03:47         at org.apache.maven.surefire.booter.ForkedBooter.main(ForkedBooter.java:417) [surefire-booter-2.22.0.jar:2.22.0]
12-Dec-2018 14:03:47
12-Dec-2018 14:03:47 2018-12-12 14:03:47.765  INFO 31418 --- [           main] b.c.PropertySourceBootstrapConfiguration : Located property source: ConfigMapPropertySource {name='configmap.spring-cloud-dataflow-server-kubernetes.default'}
12-Dec-2018 14:03:47 2018-12-12 14:03:47.766  INFO 31418 --- [           main] b.c.PropertySourceBootstrapConfiguration : Located property source: SecretsPropertySource {name='secrets.spring-cloud-dataflow-server-kubernetes.default'}
12-Dec-2018 14:03:47 2018-12-12 14:03:47.828  INFO 31418 --- [           main] o.s.c.d.s.kubernetes.ContextLoadsTests   : No active profile set, falling back to default profiles: default
12-Dec-2018 14:03:48 2018-12-12 14:03:48.990  INFO 31418 --- [           main] .s.d.r.c.RepositoryConfigurationDelegate : Multiple Spring Data modules found, entering strict repository configuration mode!
12-Dec-2018 14:03:48 2018-12-12 14:03:48.993  INFO 31418 --- [           main] .s.d.r.c.RepositoryConfigurationDelegate : Bootstrapping Spring Data repositories in DEFAULT mode.
12-Dec-2018 14:03:49 2018-12-12 14:03:49.020  INFO 31418 --- [           main] .s.d.r.c.RepositoryConfigurationDelegate : Finished Spring Data repository scanning in 15ms. Found 0 repository interfaces.
12-Dec-2018 14:03:49 2018-12-12 14:03:49.274  INFO 31418 --- [           main] .s.d.r.c.RepositoryConfigurationDelegate : Multiple Spring Data modules found, entering strict repository configuration mode!
12-Dec-2018 14:03:49 2018-12-12 14:03:49.275  INFO 31418 --- [           main] .s.d.r.c.RepositoryConfigurationDelegate : Bootstrapping Spring Data repositories in DEFAULT mode.
12-Dec-2018 14:03:49 2018-12-12 14:03:49.491  INFO 31418 --- [           main] .s.d.r.c.RepositoryConfigurationDelegate : Finished Spring Data repository scanning in 210ms. Found 1 repository interfaces.
12-Dec-2018 14:03:49 2018-12-12 14:03:49.491  INFO 31418 --- [           main] .s.d.r.c.RepositoryConfigurationDelegate : Multiple Spring Data modules found, entering strict repository configuration mode!
12-Dec-2018 14:03:49 2018-12-12 14:03:49.492  INFO 31418 --- [           main] .s.d.r.c.RepositoryConfigurationDelegate : Bootstrapping Spring Data repositories in DEFAULT mode.
12-Dec-2018 14:03:49 2018-12-12 14:03:49.525  INFO 31418 --- [           main] .s.d.r.c.RepositoryConfigurationDelegate : Finished Spring Data repository scanning in 33ms. Found 4 repository interfaces.
12-Dec-2018 14:03:49 2018-12-12 14:03:49.543  WARN 31418 --- [           main] o.s.boot.actuate.endpoint.EndpointId     : Endpoint ID 'hystrix.stream' contains invalid characters, please migrate to a valid format.
12-Dec-2018 14:03:49 2018-12-12 14:03:49.940  INFO 31418 --- [           main] o.s.cloud.context.scope.GenericScope     : BeanFactory id=46c11934-1460-3023-a3e8-45eb86b8cb5b
12-Dec-2018 14:03:51 2018-12-12 14:03:51.180  INFO 31418 --- [           main] o.apache.catalina.core.StandardService   : Starting service [Tomcat]
12-Dec-2018 14:03:51 2018-12-12 14:03:51.180  INFO 31418 --- [           main] org.apache.catalina.core.StandardEngine  : Starting Servlet Engine: Apache Tomcat/9.0.13
12-Dec-2018 14:03:51 2018-12-12 14:03:51.195  INFO 31418 --- [           main] o.a.catalina.core.AprLifecycleListener   : The APR based Apache Tomcat Native library which allows optimal performance in production environments was not found on the java.library.path: [/usr/java/packages/lib/amd64:/usr/lib64:/lib64:/lib:/usr/lib]
12-Dec-2018 14:03:51 2018-12-12 14:03:51.327  INFO 31418 --- [           main] o.a.c.c.C.[Tomcat].[localhost].[/]       : Initializing Spring embedded WebApplicationContext
12-Dec-2018 14:03:51 2018-12-12 14:03:51.553  WARN 31418 --- [           main] c.n.c.sources.URLConfigurationSource     : No URLs will be polled as dynamic configuration sources.
12-Dec-2018 14:03:51 2018-12-12 14:03:51.553  INFO 31418 --- [           main] c.n.c.sources.URLConfigurationSource     : To enable URLs as dynamic configuration sources, define System property archaius.configurationSource.additionalUrls or make config.properties available on classpath.
12-Dec-2018 14:03:51 2018-12-12 14:03:51.577  INFO 31418 --- [           main] c.netflix.config.DynamicPropertyFactory  : DynamicPropertyFactory is initialized with configuration sources: com.netflix.config.ConcurrentCompositeConfiguration@ff01f06
12-Dec-2018 14:03:53 2018-12-12 14:03:53.177  INFO 31418 --- [           main] com.zaxxer.hikari.HikariDataSource       : HikariPool-1 - Starting...
12-Dec-2018 14:03:53 2018-12-12 14:03:53.475  INFO 31418 --- [           main] com.zaxxer.hikari.HikariDataSource       : HikariPool-1 - Start completed.
12-Dec-2018 14:03:53 2018-12-12 14:03:53.607  INFO 31418 --- [           main] o.hibernate.jpa.internal.util.LogHelper  : HHH000204: Processing PersistenceUnitInfo [
12-Dec-2018 14:03:53         name: default
12-Dec-2018 14:03:53         ...]
12-Dec-2018 14:03:53 2018-12-12 14:03:53.724  INFO 31418 --- [           main] org.hibernate.Version                    : HHH000412: Hibernate Core {5.3.7.Final}
12-Dec-2018 14:03:53 2018-12-12 14:03:53.726  INFO 31418 --- [           main] org.hibernate.cfg.Environment            : HHH000206: hibernate.properties not found
12-Dec-2018 14:03:54 2018-12-12 14:03:54.007  INFO 31418 --- [           main] o.hibernate.annotations.common.Version   : HCANN000001: Hibernate Commons Annotations {5.0.4.Final}
12-Dec-2018 14:03:54 2018-12-12 14:03:54.232  INFO 31418 --- [           main] org.hibernate.dialect.Dialect            : HHH000400: Using dialect: org.hibernate.dialect.H2Dialect
12-Dec-2018 14:03:55 2018-12-12 14:03:55.383  INFO 31418 --- [           main] o.h.t.schema.internal.SchemaCreatorImpl  : HHH000476: Executing import script 'org.hibernate.tool.schema.internal.exec.ScriptSourceInputNonExistentImpl@7e04cd65'
12-Dec-2018 14:03:55 2018-12-12 14:03:55.387  INFO 31418 --- [           main] j.LocalContainerEntityManagerFactoryBean : Initialized JPA EntityManagerFactory for persistence unit 'default'
12-Dec-2018 14:03:55 2018-12-12 14:03:55.601  WARN 31418 --- [           main] ConfigServletWebServerApplicationContext : Exception encountered during context initialization - cancelling refresh attempt: org.springframework.beans.factory.BeanCreationException: Error creating bean with name 'appDeployer' defined in class path resource [org/springframework/cloud/deployer/spi/kubernetes/KubernetesAutoConfiguration.class]: Post-processing of merged bean definition failed; nested exception is java.lang.IllegalStateException: Failed to introspect Class [org.springframework.cloud.deployer.spi.kubernetes.KubernetesAppDeployer] from ClassLoader [sun.misc.Launcher$AppClassLoader@18b4aac2]
12-Dec-2018 14:03:55 2018-12-12 14:03:55.601  INFO 31418 --- [           main] j.LocalContainerEntityManagerFactoryBean : Closing JPA EntityManagerFactory for persistence unit 'default'
12-Dec-2018 14:03:55 2018-12-12 14:03:55.602  INFO 31418 --- [           main] .SchemaDropperImpl$DelayedDropActionImpl : HHH000477: Starting delayed evictData of schema as part of SessionFactory shut-down'
12-Dec-2018 14:03:55 2018-12-12 14:03:55.631  INFO 31418 --- [           main] com.zaxxer.hikari.HikariDataSource       : HikariPool-1 - Shutdown initiated...
12-Dec-2018 14:03:55 2018-12-12 14:03:55.636  INFO 31418 --- [           main] com.zaxxer.hikari.HikariDataSource       : HikariPool-1 - Shutdown completed.
12-Dec-2018 14:03:55 2018-12-12 14:03:55.637  INFO 31418 --- [           main] o.apache.catalina.core.StandardService   : Stopping service [Tomcat]
12-Dec-2018 14:03:55 2018-12-12 14:03:55.641  WARN 31418 --- [           main] o.a.c.loader.WebappClassLoaderBase       : The web application [ROOT] appears to have started a thread named [RxIoScheduler-1 (Evictor)] but has failed to stop it. This is very likely to create a memory leak. Stack trace of thread:
12-Dec-2018 14:03:55 sun.misc.Unsafe.park(Native Method)
12-Dec-2018 14:03:55 java.util.concurrent.locks.LockSupport.parkNanos(LockSupport.java:215)
12-Dec-2018 14:03:55 java.util.concurrent.locks.AbstractQueuedSynchronizer$ConditionObject.awaitNanos(AbstractQueuedSynchronizer.java:2078)
12-Dec-2018 14:03:55 java.util.concurrent.ScheduledThreadPoolExecutor$DelayedWorkQueue.take(ScheduledThreadPoolExecutor.java:1093)
12-Dec-2018 14:03:55 java.util.concurrent.ScheduledThreadPoolExecutor$DelayedWorkQueue.take(ScheduledThreadPoolExecutor.java:809)
12-Dec-2018 14:03:55 java.util.concurrent.ThreadPoolExecutor.getTask(ThreadPoolExecutor.java:1074)
12-Dec-2018 14:03:55 java.util.concurrent.ThreadPoolExecutor.runWorker(ThreadPoolExecutor.java:1134)
12-Dec-2018 14:03:55 java.util.concurrent.ThreadPoolExecutor$Worker.run(ThreadPoolExecutor.java:624)
12-Dec-2018 14:03:55 java.lang.Thread.run(Thread.java:748)
12-Dec-2018 14:03:55 2018-12-12 14:03:55.659 ERROR 31418 --- [           main] o.s.c.t.listener.TaskLifecycleListener   : An event to end a task has been received for a task that has not yet started.
12-Dec-2018 14:03:55 2018-12-12 14:03:55.662 ERROR 31418 --- [           main] o.s.boot.SpringApplication               : Application run failed
12-Dec-2018 14:03:55
12-Dec-2018 14:03:55 org.springframework.beans.factory.BeanCreationException: Error creating bean with name 'appDeployer' defined in class path resource [org/springframework/cloud/deployer/spi/kubernetes/KubernetesAutoConfiguration.class]: Post-processing of merged bean definition failed; nested exception is java.lang.IllegalStateException: Failed to introspect Class [org.springframework.cloud.deployer.spi.kubernetes.KubernetesAppDeployer] from ClassLoader [sun.misc.Launcher$AppClassLoader@18b4aac2]
12-Dec-2018 14:03:55         at org.springframework.beans.factory.support.AbstractAutowireCapableBeanFactory.doCreateBean(AbstractAutowireCapableBeanFactory.java:553) ~[spring-beans-5.1.3.RELEASE.jar:5.1.3.RELEASE]
12-Dec-2018 14:03:55         at org.springframework.beans.factory.support.AbstractAutowireCapableBeanFactory.createBean(AbstractAutowireCapableBeanFactory.java:498) ~[spring-beans-5.1.3.RELEASE.jar:5.1.3.RELEASE]
12-Dec-2018 14:03:55         at org.springframework.beans.factory.support.AbstractBeanFactory.lambda$doGetBean$0(AbstractBeanFactory.java:320) ~[spring-beans-5.1.3.RELEASE.jar:5.1.3.RELEASE]
12-Dec-2018 14:03:55         at org.springframework.beans.factory.support.DefaultSingletonBeanRegistry.getSingleton(DefaultSingletonBeanRegistry.java:222) ~[spring-beans-5.1.3.RELEASE.jar:5.1.3.RELEASE]
12-Dec-2018 14:03:55         at org.springframework.beans.factory.support.AbstractBeanFactory.doGetBean(AbstractBeanFactory.java:318) ~[spring-beans-5.1.3.RELEASE.jar:5.1.3.RELEASE]
12-Dec-2018 14:03:55         at org.springframework.beans.factory.support.AbstractBeanFactory.getBean(AbstractBeanFactory.java:199) ~[spring-beans-5.1.3.RELEASE.jar:5.1.3.RELEASE]
12-Dec-2018 14:03:55         at org.springframework.beans.factory.support.DefaultListableBeanFactory.preInstantiateSingletons(DefaultListableBeanFactory.java:846) ~[spring-beans-5.1.3.RELEASE.jar:5.1.3.RELEASE]
12-Dec-2018 14:03:55         at org.springframework.context.support.AbstractApplicationContext.finishBeanFactoryInitialization(AbstractApplicationContext.java:863) ~[spring-context-5.1.3.RELEASE.jar:5.1.3.RELEASE]
12-Dec-2018 14:03:55         at org.springframework.context.support.AbstractApplicationContext.refresh(AbstractApplicationContext.java:546) ~[spring-context-5.1.3.RELEASE.jar:5.1.3.RELEASE]
12-Dec-2018 14:03:55         at org.springframework.boot.web.servlet.context.ServletWebServerApplicationContext.refresh(ServletWebServerApplicationContext.java:142) ~[spring-boot-2.1.1.RELEASE.jar:2.1.1.RELEASE]
12-Dec-2018 14:03:55         at org.springframework.boot.SpringApplication.refresh(SpringApplication.java:775) ~[spring-boot-2.1.1.RELEASE.jar:2.1.1.RELEASE]
12-Dec-2018 14:03:55         at org.springframework.boot.SpringApplication.refreshContext(SpringApplication.java:397) ~[spring-boot-2.1.1.RELEASE.jar:2.1.1.RELEASE]
12-Dec-2018 14:03:55         at org.springframework.boot.SpringApplication.run(SpringApplication.java:316) ~[spring-boot-2.1.1.RELEASE.jar:2.1.1.RELEASE]
12-Dec-2018 14:03:55         at org.springframework.boot.test.context.SpringBootContextLoader.loadContext(SpringBootContextLoader.java:127) [spring-boot-test-2.1.1.RELEASE.jar:2.1.1.RELEASE]
12-Dec-2018 14:03:55         at org.springframework.test.context.cache.DefaultCacheAwareContextLoaderDelegate.loadContextInternal(DefaultCacheAwareContextLoaderDelegate.java:99) [spring-test-5.1.3.RELEASE.jar:5.1.3.RELEASE]
12-Dec-2018 14:03:55         at org.springframework.test.context.cache.DefaultCacheAwareContextLoaderDelegate.loadContext(DefaultCacheAwareContextLoaderDelegate.java:117) [spring-test-5.1.3.RELEASE.jar:5.1.3.RELEASE]
12-Dec-2018 14:03:55         at org.springframework.test.context.support.DefaultTestContext.getApplicationContext(DefaultTestContext.java:108) [spring-test-5.1.3.RELEASE.jar:5.1.3.RELEASE]
12-Dec-2018 14:03:55         at org.springframework.test.context.support.DependencyInjectionTestExecutionListener.injectDependencies(DependencyInjectionTestExecutionListener.java:118) [spring-test-5.1.3.RELEASE.jar:5.1.3.RELEASE]
12-Dec-2018 14:03:55         at org.springframework.test.context.support.DependencyInjectionTestExecutionListener.prepareTestInstance(DependencyInjectionTestExecutionListener.java:83) [spring-test-5.1.3.RELEASE.jar:5.1.3.RELEASE]
12-Dec-2018 14:03:55         at org.springframework.boot.test.autoconfigure.SpringBootDependencyInjectionTestExecutionListener.prepareTestInstance(SpringBootDependencyInjectionTestExecutionListener.java:44) [spring-boot-test-autoconfigure-2.1.1.RELEASE.jar:2.1.1.RELEASE]
12-Dec-2018 14:03:55         at org.springframework.test.context.TestContextManager.prepareTestInstance(TestContextManager.java:246) [spring-test-5.1.3.RELEASE.jar:5.1.3.RELEASE]
12-Dec-2018 14:03:55         at org.springframework.test.context.junit4.SpringJUnit4ClassRunner.createTest(SpringJUnit4ClassRunner.java:227) [spring-test-5.1.3.RELEASE.jar:5.1.3.RELEASE]
12-Dec-2018 14:03:55         at org.springframework.test.context.junit4.SpringJUnit4ClassRunner$1.runReflectiveCall(SpringJUnit4ClassRunner.java:289) [spring-test-5.1.3.RELEASE.jar:5.1.3.RELEASE]
12-Dec-2018 14:03:55         at org.junit.internal.runners.model.ReflectiveCallable.run(ReflectiveCallable.java:12) [junit-4.12.jar:4.12]
12-Dec-2018 14:03:55         at org.springframework.test.context.junit4.SpringJUnit4ClassRunner.methodBlock(SpringJUnit4ClassRunner.java:291) [spring-test-5.1.3.RELEASE.jar:5.1.3.RELEASE]
12-Dec-2018 14:03:55         at org.springframework.test.context.junit4.SpringJUnit4ClassRunner.runChild(SpringJUnit4ClassRunner.java:246) [spring-test-5.1.3.RELEASE.jar:5.1.3.RELEASE]
12-Dec-2018 14:03:55         at org.springframework.test.context.junit4.SpringJUnit4ClassRunner.runChild(SpringJUnit4ClassRunner.java:97) [spring-test-5.1.3.RELEASE.jar:5.1.3.RELEASE]
12-Dec-2018 14:03:55         at org.junit.runners.ParentRunner$3.run(ParentRunner.java:290) [junit-4.12.jar:4.12]
12-Dec-2018 14:03:55         at org.junit.runners.ParentRunner$1.schedule(ParentRunner.java:71) [junit-4.12.jar:4.12]
12-Dec-2018 14:03:55         at org.junit.runners.ParentRunner.runChildren(ParentRunner.java:288) [junit-4.12.jar:4.12]
12-Dec-2018 14:03:55         at org.junit.runners.ParentRunner.access$000(ParentRunner.java:58) [junit-4.12.jar:4.12]
12-Dec-2018 14:03:55         at org.junit.runners.ParentRunner$2.evaluate(ParentRunner.java:268) [junit-4.12.jar:4.12]
12-Dec-2018 14:03:55         at org.springframework.test.context.junit4.statements.RunBeforeTestClassCallbacks.evaluate(RunBeforeTestClassCallbacks.java:61) [spring-test-5.1.3.RELEASE.jar:5.1.3.RELEASE]
12-Dec-2018 14:03:55         at org.springframework.test.context.junit4.statements.RunAfterTestClassCallbacks.evaluate(RunAfterTestClassCallbacks.java:70) [spring-test-5.1.3.RELEASE.jar:5.1.3.RELEASE]
12-Dec-2018 14:03:55         at org.junit.runners.ParentRunner.run(ParentRunner.java:363) [junit-4.12.jar:4.12]
12-Dec-2018 14:03:55         at org.springframework.test.context.junit4.SpringJUnit4ClassRunner.run(SpringJUnit4ClassRunner.java:190) [spring-test-5.1.3.RELEASE.jar:5.1.3.RELEASE]
12-Dec-2018 14:03:55         at org.apache.maven.surefire.junit4.JUnit4Provider.execute(JUnit4Provider.java:365) [surefire-junit4-2.22.0.jar:2.22.0]
12-Dec-2018 14:03:55         at org.apache.maven.surefire.junit4.JUnit4Provider.executeWithRerun(JUnit4Provider.java:273) [surefire-junit4-2.22.0.jar:2.22.0]
12-Dec-2018 14:03:55         at org.apache.maven.surefire.junit4.JUnit4Provider.executeTestSet(JUnit4Provider.java:238) [surefire-junit4-2.22.0.jar:2.22.0]
12-Dec-2018 14:03:55         at org.apache.maven.surefire.junit4.JUnit4Provider.invoke(JUnit4Provider.java:159) [surefire-junit4-2.22.0.jar:2.22.0]
12-Dec-2018 14:03:55         at org.apache.maven.surefire.booter.ForkedBooter.invokeProviderInSameClassLoader(ForkedBooter.java:383) [surefire-booter-2.22.0.jar:2.22.0]
12-Dec-2018 14:03:55         at org.apache.maven.surefire.booter.ForkedBooter.runSuitesInProcess(ForkedBooter.java:344) [surefire-booter-2.22.0.jar:2.22.0]
12-Dec-2018 14:03:55         at org.apache.maven.surefire.booter.ForkedBooter.execute(ForkedBooter.java:125) [surefire-booter-2.22.0.jar:2.22.0]
12-Dec-2018 14:03:55         at org.apache.maven.surefire.booter.ForkedBooter.main(ForkedBooter.java:417) [surefire-booter-2.22.0.jar:2.22.0]
12-Dec-2018 14:03:55 Caused by: java.lang.IllegalStateException: Failed to introspect Class [org.springframework.cloud.deployer.spi.kubernetes.KubernetesAppDeployer] from ClassLoader [sun.misc.Launcher$AppClassLoader@18b4aac2]
12-Dec-2018 14:03:55         at org.springframework.util.ReflectionUtils.getDeclaredMethods(ReflectionUtils.java:686) ~[spring-core-5.1.3.RELEASE.jar:5.1.3.RELEASE]
12-Dec-2018 14:03:55         at org.springframework.util.ReflectionUtils.doWithLocalMethods(ReflectionUtils.java:546) ~[spring-core-5.1.3.RELEASE.jar:5.1.3.RELEASE]
12-Dec-2018 14:03:55         at org.springframework.orm.jpa.support.PersistenceAnnotationBeanPostProcessor.buildPersistenceMetadata(PersistenceAnnotationBeanPostProcessor.java:432) ~[spring-orm-5.1.3.RELEASE.jar:5.1.3.RELEASE]
12-Dec-2018 14:03:55         at org.springframework.orm.jpa.support.PersistenceAnnotationBeanPostProcessor.findPersistenceMetadata(PersistenceAnnotationBeanPostProcessor.java:406) ~[spring-orm-5.1.3.RELEASE.jar:5.1.3.RELEASE]
12-Dec-2018 14:03:55         at org.springframework.orm.jpa.support.PersistenceAnnotationBeanPostProcessor.postProcessMergedBeanDefinition(PersistenceAnnotationBeanPostProcessor.java:333) ~[spring-orm-5.1.3.RELEASE.jar:5.1.3.RELEASE]
12-Dec-2018 14:03:55         at org.springframework.beans.factory.support.AbstractAutowireCapableBeanFactory.applyMergedBeanDefinitionPostProcessors(AbstractAutowireCapableBeanFactory.java:1044) ~[spring-beans-5.1.3.RELEASE.jar:5.1.3.RELEASE]
12-Dec-2018 14:03:55         at org.springframework.beans.factory.support.AbstractAutowireCapableBeanFactory.doCreateBean(AbstractAutowireCapableBeanFactory.java:550) ~[spring-beans-5.1.3.RELEASE.jar:5.1.3.RELEASE]
12-Dec-2018 14:03:55         ... 43 common frames omitted
12-Dec-2018 14:03:55 Caused by: java.lang.NoClassDefFoundError: io/fabric8/kubernetes/api/model/apps/Deployment
12-Dec-2018 14:03:55         at java.lang.Class.getDeclaredMethods0(Native Method) ~[na:1.8.0_144]
12-Dec-2018 14:03:55         at java.lang.Class.privateGetDeclaredMethods(Class.java:2701) ~[na:1.8.0_144]
12-Dec-2018 14:03:55         at java.lang.Class.getDeclaredMethods(Class.java:1975) ~[na:1.8.0_144]
12-Dec-2018 14:03:55         at org.springframework.util.ReflectionUtils.getDeclaredMethods(ReflectionUtils.java:668) ~[spring-core-5.1.3.RELEASE.jar:5.1.3.RELEASE]
12-Dec-2018 14:03:55         ... 49 common frames omitted
12-Dec-2018 14:03:55 Caused by: java.lang.ClassNotFoundException: io.fabric8.kubernetes.api.model.apps.Deployment
12-Dec-2018 14:03:55         at java.net.URLClassLoader.findClass(URLClassLoader.java:381) ~[na:1.8.0_144]
12-Dec-2018 14:03:55         at java.lang.ClassLoader.loadClass(ClassLoader.java:424) ~[na:1.8.0_144]
12-Dec-2018 14:03:55         at sun.misc.Launcher$AppClassLoader.loadClass(Launcher.java:335) ~[na:1.8.0_144]
12-Dec-2018 14:03:55         at java.lang.ClassLoader.loadClass(ClassLoader.java:357) ~[na:1.8.0_144]
12-Dec-2018 14:03:55         ... 53 common frames omitted
12-Dec-2018 14:03:55
12-Dec-2018 14:03:55 2018-12-12 14:03:55.737  INFO 31418 --- [           main] trationDelegate$BeanPostProcessorChecker : Bean 'org.springframework.cloud.autoconfigure.ConfigurationPropertiesRebinderAutoConfiguration' of type [org.springframework.cloud.autoconfigure.ConfigurationPropertiesRebinderAutoConfiguration$$EnhancerBySpringCGLIB$$30c2f2e9] is not eligible for getting processed by all BeanPostProcessors (for example: not eligible for auto-proxying)
12-Dec-2018 14:03:55   ____                              ____ _                __
12-Dec-2018 14:03:55 / ___| _ __  _ __(_)_ __   __ _   / ___| | ___  _   _  __| |
12-Dec-2018 14:03:55 \___ \| '_ \| '__| | '_ \ / _` | | |   | |/ _ \| | | |/ _` |
12-Dec-2018 14:03:55   ___) | |_) | |  | | | | | (_| | | |___| | (_) | |_| | (_| |
12-Dec-2018 14:03:55 |____/| .__/|_|  |_|_| |_|\__, |  \____|_|\___/ \__,_|\__,_|
12-Dec-2018 14:03:55   ____ |_|    _          __|___/                 __________
12-Dec-2018 14:03:55 |  _ \  __ _| |_ __ _  |  ___| | _____      __  \ \ \ \ \ \
12-Dec-2018 14:03:55 | | | |/ _` | __/ _` | | |_  | |/ _ \ \ /\ / /   \ \ \ \ \ \
12-Dec-2018 14:03:55 | |_| | (_| | || (_| | |  _| | | (_) \ V  V /    / / / / / /
12-Dec-2018 14:03:55 |____/ \__,_|\__\__,_| |_|   |_|\___/ \_/\_/    /_/_/_/_/_/
12-Dec-2018 14:03:55
12-Dec-2018 14:03:55
12-Dec-2018 14:03:55
12-Dec-2018 14:03:55 2018-12-12 14:03:55.807  INFO 31418 --- [           main] c.c.c.ConfigServicePropertySourceLocator : Fetching config from server at : http://localhost:8888
12-Dec-2018 14:03:55 2018-12-12 14:03:55.811  INFO 31418 --- [           main] c.c.c.ConfigServicePropertySourceLocator : Connect Timeout Exception on Url - http://localhost:8888. Will be trying the next url if available
12-Dec-2018 14:03:55 2018-12-12 14:03:55.811  WARN 31418 --- [           main] c.c.c.ConfigServicePropertySourceLocator : Could not locate PropertySource: I/O error on GET request for "http://localhost:8888/spring-cloud-dataflow-server-kubernetes/default": Connection refused (Connection refused); nested exception is java.net.ConnectException: Connection refused (Connection refused)
12-Dec-2018 14:03:56 2018-12-12 14:03:56.244  WARN 31418 --- [           main] o.s.c.k.config.ConfigMapPropertySource   : Can't read configMap with name: [spring-cloud-dataflow-server-kubernetes] in namespace:[default]. Ignoring
12-Dec-2018 14:03:56
12-Dec-2018 14:03:56 io.fabric8.kubernetes.client.KubernetesClientException: Failure executing: GET at: https://35.227.88.51/api/v1/namespaces/default/configmaps/spring-cloud-dataflow-server-kubernetes. Message: Unauthorized! Token may have expired! Please log-in again. Unauthorized.
12-Dec-2018 14:03:56         at io.fabric8.kubernetes.client.dsl.base.OperationSupport.requestFailure(OperationSupport.java:472) ~[kubernetes-client-3.1.10.jar:na]
12-Dec-2018 14:03:56         at io.fabric8.kubernetes.client.dsl.base.OperationSupport.assertResponseCode(OperationSupport.java:409) ~[kubernetes-client-3.1.10.jar:na]
12-Dec-2018 14:03:56         at io.fabric8.kubernetes.client.dsl.base.OperationSupport.handleResponse(OperationSupport.java:381) ~[kubernetes-client-3.1.10.jar:na]
12-Dec-2018 14:03:56         at io.fabric8.kubernetes.client.dsl.base.OperationSupport.handleResponse(OperationSupport.java:344) ~[kubernetes-client-3.1.10.jar:na]
12-Dec-2018 14:03:56         at io.fabric8.kubernetes.client.dsl.base.OperationSupport.handleGet(OperationSupport.java:313) ~[kubernetes-client-3.1.10.jar:na]
12-Dec-2018 14:03:56         at io.fabric8.kubernetes.client.dsl.base.OperationSupport.handleGet(OperationSupport.java:296) ~[kubernetes-client-3.1.10.jar:na]
12-Dec-2018 14:03:56         at io.fabric8.kubernetes.client.dsl.base.BaseOperation.handleGet(BaseOperation.java:770) ~[kubernetes-client-3.1.10.jar:na]
12-Dec-2018 14:03:56         at io.fabric8.kubernetes.client.dsl.base.BaseOperation.getMandatory(BaseOperation.java:195) ~[kubernetes-client-3.1.10.jar:na]
12-Dec-2018 14:03:56         at io.fabric8.kubernetes.client.dsl.base.BaseOperation.get(BaseOperation.java:162) ~[kubernetes-client-3.1.10.jar:na]
12-Dec-2018 14:03:56         at org.springframework.cloud.kubernetes.config.ConfigMapPropertySource.getData(ConfigMapPropertySource.java:86) [spring-cloud-kubernetes-config-1.0.0.RC1.jar:1.0.0.RC1]
12-Dec-2018 14:03:56         at org.springframework.cloud.kubernetes.config.ConfigMapPropertySource.<init>(ConfigMapPropertySource.java:66) [spring-cloud-kubernetes-config-1.0.0.RC1.jar:1.0.0.RC1]
12-Dec-2018 14:03:56         at org.springframework.cloud.kubernetes.config.ConfigMapPropertySourceLocator.getMapPropertySourceForSingleConfigMap(ConfigMapPropertySourceLocator.java:77) [spring-cloud-kubernetes-config-1.0.0.RC1.jar:1.0.0.RC1]
12-Dec-2018 14:03:56         at org.springframework.cloud.kubernetes.config.ConfigMapPropertySourceLocator.locate(ConfigMapPropertySourceLocator.java:55) [spring-cloud-kubernetes-config-1.0.0.RC1.jar:1.0.0.RC1]
12-Dec-2018 14:03:56         at org.springframework.cloud.bootstrap.config.PropertySourceBootstrapConfiguration.initialize(PropertySourceBootstrapConfiguration.java:94) [spring-cloud-context-2.1.0.RC2.jar:2.1.0.RC2]
12-Dec-2018 14:03:56         at org.springframework.boot.SpringApplication.applyInitializers(SpringApplication.java:649) [spring-boot-2.1.1.RELEASE.jar:2.1.1.RELEASE]
12-Dec-2018 14:03:56         at org.springframework.boot.SpringApplication.prepareContext(SpringApplication.java:373) [spring-boot-2.1.1.RELEASE.jar:2.1.1.RELEASE]
12-Dec-2018 14:03:56         at org.springframework.boot.SpringApplication.run(SpringApplication.java:314) [spring-boot-2.1.1.RELEASE.jar:2.1.1.RELEASE]
12-Dec-2018 14:03:56         at org.springframework.boot.test.context.SpringBootContextLoader.loadContext(SpringBootContextLoader.java:127) [spring-boot-test-2.1.1.RELEASE.jar:2.1.1.RELEASE]
12-Dec-2018 14:03:56         at org.springframework.test.context.cache.DefaultCacheAwareContextLoaderDelegate.loadContextInternal(DefaultCacheAwareContextLoaderDelegate.java:99) [spring-test-5.1.3.RELEASE.jar:5.1.3.RELEASE]
12-Dec-2018 14:03:56         at org.springframework.test.context.cache.DefaultCacheAwareContextLoaderDelegate.loadContext(DefaultCacheAwareContextLoaderDelegate.java:117) [spring-test-5.1.3.RELEASE.jar:5.1.3.RELEASE]
12-Dec-2018 14:03:56         at org.springframework.test.context.support.DefaultTestContext.getApplicationContext(DefaultTestContext.java:108) [spring-test-5.1.3.RELEASE.jar:5.1.3.RELEASE]
12-Dec-2018 14:03:56         at org.springframework.boot.test.autoconfigure.SpringBootDependencyInjectionTestExecutionListener.outputConditionEvaluationReport(SpringBootDependencyInjectionTestExecutionListener.java:54) [spring-boot-test-autoconfigure-2.1.1.RELEASE.jar:2.1.1.RELEASE]
12-Dec-2018 14:03:56         at org.springframework.boot.test.autoconfigure.SpringBootDependencyInjectionTestExecutionListener.prepareTestInstance(SpringBootDependencyInjectionTestExecutionListener.java:47) [spring-boot-test-autoconfigure-2.1.1.RELEASE.jar:2.1.1.RELEASE]
12-Dec-2018 14:03:56         at org.springframework.test.context.TestContextManager.prepareTestInstance(TestContextManager.java:246) [spring-test-5.1.3.RELEASE.jar:5.1.3.RELEASE]
12-Dec-2018 14:03:56         at org.springframework.test.context.junit4.SpringJUnit4ClassRunner.createTest(SpringJUnit4ClassRunner.java:227) [spring-test-5.1.3.RELEASE.jar:5.1.3.RELEASE]
12-Dec-2018 14:03:56         at org.springframework.test.context.junit4.SpringJUnit4ClassRunner$1.runReflectiveCall(SpringJUnit4ClassRunner.java:289) [spring-test-5.1.3.RELEASE.jar:5.1.3.RELEASE]
12-Dec-2018 14:03:56         at org.junit.internal.runners.model.ReflectiveCallable.run(ReflectiveCallable.java:12) [junit-4.12.jar:4.12]
12-Dec-2018 14:03:56         at org.springframework.test.context.junit4.SpringJUnit4ClassRunner.methodBlock(SpringJUnit4ClassRunner.java:291) [spring-test-5.1.3.RELEASE.jar:5.1.3.RELEASE]
12-Dec-2018 14:03:56         at org.springframework.test.context.junit4.SpringJUnit4ClassRunner.runChild(SpringJUnit4ClassRunner.java:246) [spring-test-5.1.3.RELEASE.jar:5.1.3.RELEASE]
12-Dec-2018 14:03:56         at org.springframework.test.context.junit4.SpringJUnit4ClassRunner.runChild(SpringJUnit4ClassRunner.java:97) [spring-test-5.1.3.RELEASE.jar:5.1.3.RELEASE]
12-Dec-2018 14:03:56         at org.junit.runners.ParentRunner$3.run(ParentRunner.java:290) [junit-4.12.jar:4.12]
12-Dec-2018 14:03:56         at org.junit.runners.ParentRunner$1.schedule(ParentRunner.java:71) [junit-4.12.jar:4.12]
12-Dec-2018 14:03:56         at org.junit.runners.ParentRunner.runChildren(ParentRunner.java:288) [junit-4.12.jar:4.12]
12-Dec-2018 14:03:56         at org.junit.runners.ParentRunner.access$000(ParentRunner.java:58) [junit-4.12.jar:4.12]
12-Dec-2018 14:03:56         at org.junit.runners.ParentRunner$2.evaluate(ParentRunner.java:268) [junit-4.12.jar:4.12]
12-Dec-2018 14:03:56         at org.springframework.test.context.junit4.statements.RunBeforeTestClassCallbacks.evaluate(RunBeforeTestClassCallbacks.java:61) [spring-test-5.1.3.RELEASE.jar:5.1.3.RELEASE]
12-Dec-2018 14:03:56         at org.springframework.test.context.junit4.statements.RunAfterTestClassCallbacks.evaluate(RunAfterTestClassCallbacks.java:70) [spring-test-5.1.3.RELEASE.jar:5.1.3.RELEASE]
12-Dec-2018 14:03:56         at org.junit.runners.ParentRunner.run(ParentRunner.java:363) [junit-4.12.jar:4.12]
12-Dec-2018 14:03:56         at org.springframework.test.context.junit4.SpringJUnit4ClassRunner.run(SpringJUnit4ClassRunner.java:190) [spring-test-5.1.3.RELEASE.jar:5.1.3.RELEASE]
12-Dec-2018 14:03:56         at org.apache.maven.surefire.junit4.JUnit4Provider.execute(JUnit4Provider.java:365) [surefire-junit4-2.22.0.jar:2.22.0]
12-Dec-2018 14:03:56         at org.apache.maven.surefire.junit4.JUnit4Provider.executeWithRerun(JUnit4Provider.java:273) [surefire-junit4-2.22.0.jar:2.22.0]
12-Dec-2018 14:03:56         at org.apache.maven.surefire.junit4.JUnit4Provider.executeTestSet(JUnit4Provider.java:238) [surefire-junit4-2.22.0.jar:2.22.0]
12-Dec-2018 14:03:56         at org.apache.maven.surefire.junit4.JUnit4Provider.invoke(JUnit4Provider.java:159) [surefire-junit4-2.22.0.jar:2.22.0]
12-Dec-2018 14:03:56         at org.apache.maven.surefire.booter.ForkedBooter.invokeProviderInSameClassLoader(ForkedBooter.java:383) [surefire-booter-2.22.0.jar:2.22.0]
12-Dec-2018 14:03:56         at org.apache.maven.surefire.booter.ForkedBooter.runSuitesInProcess(ForkedBooter.java:344) [surefire-booter-2.22.0.jar:2.22.0]
12-Dec-2018 14:03:56         at org.apache.maven.surefire.booter.ForkedBooter.execute(ForkedBooter.java:125) [surefire-booter-2.22.0.jar:2.22.0]
12-Dec-2018 14:03:56         at org.apache.maven.surefire.booter.ForkedBooter.main(ForkedBooter.java:417) [surefire-booter-2.22.0.jar:2.22.0]
12-Dec-2018 14:03:56
12-Dec-2018 14:03:56 2018-12-12 14:03:56.248  INFO 31418 --- [           main] b.c.PropertySourceBootstrapConfiguration : Located property source: ConfigMapPropertySource {name='configmap.spring-cloud-dataflow-server-kubernetes.default'}
12-Dec-2018 14:03:56 2018-12-12 14:03:56.249  INFO 31418 --- [           main] b.c.PropertySourceBootstrapConfiguration : Located property source: SecretsPropertySource {name='secrets.spring-cloud-dataflow-server-kubernetes.default'}
12-Dec-2018 14:03:56 2018-12-12 14:03:56.274  INFO 31418 --- [           main] o.s.c.d.s.kubernetes.ContextLoadsTests   : No active profile set, falling back to default profiles: default
12-Dec-2018 14:03:56 2018-12-12 14:03:56.589  INFO 31418 --- [           main] .s.d.r.c.RepositoryConfigurationDelegate : Multiple Spring Data modules found, entering strict repository configuration mode!
12-Dec-2018 14:03:56 2018-12-12 14:03:56.589  INFO 31418 --- [           main] .s.d.r.c.RepositoryConfigurationDelegate : Bootstrapping Spring Data repositories in DEFAULT mode.
12-Dec-2018 14:03:56 2018-12-12 14:03:56.591  INFO 31418 --- [           main] .s.d.r.c.RepositoryConfigurationDelegate : Finished Spring Data repository scanning in 1ms. Found 0 repository interfaces.
12-Dec-2018 14:03:56 2018-12-12 14:03:56.630  INFO 31418 --- [           main] .s.d.r.c.RepositoryConfigurationDelegate : Multiple Spring Data modules found, entering strict repository configuration mode!
12-Dec-2018 14:03:56 2018-12-12 14:03:56.631  INFO 31418 --- [           main] .s.d.r.c.RepositoryConfigurationDelegate : Bootstrapping Spring Data repositories in DEFAULT mode.
12-Dec-2018 14:03:56 2018-12-12 14:03:56.638  INFO 31418 --- [           main] .s.d.r.c.RepositoryConfigurationDelegate : Finished Spring Data repository scanning in 7ms. Found 1 repository interfaces.
12-Dec-2018 14:03:56 2018-12-12 14:03:56.638  INFO 31418 --- [           main] .s.d.r.c.RepositoryConfigurationDelegate : Multiple Spring Data modules found, entering strict repository configuration mode!
12-Dec-2018 14:03:56 2018-12-12 14:03:56.638  INFO 31418 --- [           main] .s.d.r.c.RepositoryConfigurationDelegate : Bootstrapping Spring Data repositories in DEFAULT mode.
12-Dec-2018 14:03:56 2018-12-12 14:03:56.655  INFO 31418 --- [           main] .s.d.r.c.RepositoryConfigurationDelegate : Finished Spring Data repository scanning in 17ms. Found 4 repository interfaces.
12-Dec-2018 14:03:56 2018-12-12 14:03:56.676  INFO 31418 --- [           main] o.s.cloud.context.scope.GenericScope     : BeanFactory id=46c11934-1460-3023-a3e8-45eb86b8cb5b
12-Dec-2018 14:03:56 2018-12-12 14:03:56.929  INFO 31418 --- [           main] o.apache.catalina.core.StandardService   : Starting service [Tomcat]
12-Dec-2018 14:03:56 2018-12-12 14:03:56.929  INFO 31418 --- [           main] org.apache.catalina.core.StandardEngine  : Starting Servlet Engine: Apache Tomcat/9.0.13
12-Dec-2018 14:03:56 2018-12-12 14:03:56.932  INFO 31418 --- [           main] o.a.c.c.C.[Tomcat-1].[localhost].[/]     : Initializing Spring embedded WebApplicationContext
12-Dec-2018 14:03:57 2018-12-12 14:03:57.802  INFO 31418 --- [           main] com.zaxxer.hikari.HikariDataSource       : HikariPool-2 - Starting...
12-Dec-2018 14:03:57 2018-12-12 14:03:57.803  INFO 31418 --- [           main] com.zaxxer.hikari.HikariDataSource       : HikariPool-2 - Start completed.
12-Dec-2018 14:03:57 2018-12-12 14:03:57.840  INFO 31418 --- [           main] o.hibernate.jpa.internal.util.LogHelper  : HHH000204: Processing PersistenceUnitInfo [
12-Dec-2018 14:03:57         name: default
12-Dec-2018 14:03:57         ...]
12-Dec-2018 14:03:57 2018-12-12 14:03:57.849  INFO 31418 --- [           main] org.hibernate.dialect.Dialect            : HHH000400: Using dialect: org.hibernate.dialect.H2Dialect
12-Dec-2018 14:03:58 2018-12-12 14:03:58.017  INFO 31418 --- [           main] o.h.t.schema.internal.SchemaCreatorImpl  : HHH000476: Executing import script 'org.hibernate.tool.schema.internal.exec.ScriptSourceInputNonExistentImpl@7e04cd65'
12-Dec-2018 14:03:58 2018-12-12 14:03:58.018  INFO 31418 --- [           main] j.LocalContainerEntityManagerFactoryBean : Initialized JPA EntityManagerFactory for persistence unit 'default'
12-Dec-2018 14:03:58 2018-12-12 14:03:58.143  WARN 31418 --- [           main] ConfigServletWebServerApplicationContext : Exception encountered during context initialization - cancelling refresh attempt: org.springframework.beans.factory.BeanCreationException: Error creating bean with name 'appDeployer' defined in class path resource [org/springframework/cloud/deployer/spi/kubernetes/KubernetesAutoConfiguration.class]: Post-processing of merged bean definition failed; nested exception is java.lang.IllegalStateException: Failed to introspect Class [org.springframework.cloud.deployer.spi.kubernetes.KubernetesAppDeployer] from ClassLoader [sun.misc.Launcher$AppClassLoader@18b4aac2]
12-Dec-2018 14:03:58 2018-12-12 14:03:58.143  INFO 31418 --- [           main] j.LocalContainerEntityManagerFactoryBean : Closing JPA EntityManagerFactory for persistence unit 'default'
12-Dec-2018 14:03:58 2018-12-12 14:03:58.144  INFO 31418 --- [           main] .SchemaDropperImpl$DelayedDropActionImpl : HHH000477: Starting delayed evictData of schema as part of SessionFactory shut-down'
12-Dec-2018 14:03:58 2018-12-12 14:03:58.174  INFO 31418 --- [           main] com.zaxxer.hikari.HikariDataSource       : HikariPool-2 - Shutdown initiated...
12-Dec-2018 14:03:58 2018-12-12 14:03:58.179  INFO 31418 --- [           main] com.zaxxer.hikari.HikariDataSource       : HikariPool-2 - Shutdown completed.
12-Dec-2018 14:03:58 2018-12-12 14:03:58.180  INFO 31418 --- [           main] o.apache.catalina.core.StandardService   : Stopping service [Tomcat]
12-Dec-2018 14:03:58 2018-12-12 14:03:58.192 ERROR 31418 --- [           main] o.s.c.t.listener.TaskLifecycleListener   : An event to end a task has been received for a task that has not yet started.
12-Dec-2018 14:03:58 2018-12-12 14:03:58.194 ERROR 31418 --- [           main] o.s.boot.SpringApplication               : Application run failed
12-Dec-2018 14:03:58
12-Dec-2018 14:03:58 org.springframework.beans.factory.BeanCreationException: Error creating bean with name 'appDeployer' defined in class path resource [org/springframework/cloud/deployer/spi/kubernetes/KubernetesAutoConfiguration.class]: Post-processing of merged bean definition failed; nested exception is java.lang.IllegalStateException: Failed to introspect Class [org.springframework.cloud.deployer.spi.kubernetes.KubernetesAppDeployer] from ClassLoader [sun.misc.Launcher$AppClassLoader@18b4aac2]
12-Dec-2018 14:03:58         at org.springframework.beans.factory.support.AbstractAutowireCapableBeanFactory.doCreateBean(AbstractAutowireCapableBeanFactory.java:553) ~[spring-beans-5.1.3.RELEASE.jar:5.1.3.RELEASE]
12-Dec-2018 14:03:58         at org.springframework.beans.factory.support.AbstractAutowireCapableBeanFactory.createBean(AbstractAutowireCapableBeanFactory.java:498) ~[spring-beans-5.1.3.RELEASE.jar:5.1.3.RELEASE]
12-Dec-2018 14:03:58         at org.springframework.beans.factory.support.AbstractBeanFactory.lambda$doGetBean$0(AbstractBeanFactory.java:320) ~[spring-beans-5.1.3.RELEASE.jar:5.1.3.RELEASE]
12-Dec-2018 14:03:58         at org.springframework.beans.factory.support.DefaultSingletonBeanRegistry.getSingleton(DefaultSingletonBeanRegistry.java:222) ~[spring-beans-5.1.3.RELEASE.jar:5.1.3.RELEASE]
12-Dec-2018 14:03:58         at org.springframework.beans.factory.support.AbstractBeanFactory.doGetBean(AbstractBeanFactory.java:318) ~[spring-beans-5.1.3.RELEASE.jar:5.1.3.RELEASE]
12-Dec-2018 14:03:58         at org.springframework.beans.factory.support.AbstractBeanFactory.getBean(AbstractBeanFactory.java:199) ~[spring-beans-5.1.3.RELEASE.jar:5.1.3.RELEASE]
12-Dec-2018 14:03:58         at org.springframework.beans.factory.support.DefaultListableBeanFactory.preInstantiateSingletons(DefaultListableBeanFactory.java:846) ~[spring-beans-5.1.3.RELEASE.jar:5.1.3.RELEASE]
12-Dec-2018 14:03:58         at org.springframework.context.support.AbstractApplicationContext.finishBeanFactoryInitialization(AbstractApplicationContext.java:863) ~[spring-context-5.1.3.RELEASE.jar:5.1.3.RELEASE]
12-Dec-2018 14:03:58         at org.springframework.context.support.AbstractApplicationContext.refresh(AbstractApplicationContext.java:546) ~[spring-context-5.1.3.RELEASE.jar:5.1.3.RELEASE]
12-Dec-2018 14:03:58         at org.springframework.boot.web.servlet.context.ServletWebServerApplicationContext.refresh(ServletWebServerApplicationContext.java:142) ~[spring-boot-2.1.1.RELEASE.jar:2.1.1.RELEASE]
12-Dec-2018 14:03:58         at org.springframework.boot.SpringApplication.refresh(SpringApplication.java:775) ~[spring-boot-2.1.1.RELEASE.jar:2.1.1.RELEASE]
12-Dec-2018 14:03:58         at org.springframework.boot.SpringApplication.refreshContext(SpringApplication.java:397) ~[spring-boot-2.1.1.RELEASE.jar:2.1.1.RELEASE]
12-Dec-2018 14:03:58         at org.springframework.boot.SpringApplication.run(SpringApplication.java:316) ~[spring-boot-2.1.1.RELEASE.jar:2.1.1.RELEASE]
12-Dec-2018 14:03:58         at org.springframework.boot.test.context.SpringBootContextLoader.loadContext(SpringBootContextLoader.java:127) [spring-boot-test-2.1.1.RELEASE.jar:2.1.1.RELEASE]
12-Dec-2018 14:03:58         at org.springframework.test.context.cache.DefaultCacheAwareContextLoaderDelegate.loadContextInternal(DefaultCacheAwareContextLoaderDelegate.java:99) [spring-test-5.1.3.RELEASE.jar:5.1.3.RELEASE]
12-Dec-2018 14:03:58         at org.springframework.test.context.cache.DefaultCacheAwareContextLoaderDelegate.loadContext(DefaultCacheAwareContextLoaderDelegate.java:117) [spring-test-5.1.3.RELEASE.jar:5.1.3.RELEASE]
12-Dec-2018 14:03:58         at org.springframework.test.context.support.DefaultTestContext.getApplicationContext(DefaultTestContext.java:108) [spring-test-5.1.3.RELEASE.jar:5.1.3.RELEASE]
12-Dec-2018 14:03:58         at org.springframework.boot.test.autoconfigure.SpringBootDependencyInjectionTestExecutionListener.outputConditionEvaluationReport(SpringBootDependencyInjectionTestExecutionListener.java:54) [spring-boot-test-autoconfigure-2.1.1.RELEASE.jar:2.1.1.RELEASE]
12-Dec-2018 14:03:58         at org.springframework.boot.test.autoconfigure.SpringBootDependencyInjectionTestExecutionListener.prepareTestInstance(SpringBootDependencyInjectionTestExecutionListener.java:47) [spring-boot-test-autoconfigure-2.1.1.RELEASE.jar:2.1.1.RELEASE]
12-Dec-2018 14:03:58         at org.springframework.test.context.TestContextManager.prepareTestInstance(TestContextManager.java:246) [spring-test-5.1.3.RELEASE.jar:5.1.3.RELEASE]
12-Dec-2018 14:03:58         at org.springframework.test.context.junit4.SpringJUnit4ClassRunner.createTest(SpringJUnit4ClassRunner.java:227) [spring-test-5.1.3.RELEASE.jar:5.1.3.RELEASE]
12-Dec-2018 14:03:58         at org.springframework.test.context.junit4.SpringJUnit4ClassRunner$1.runReflectiveCall(SpringJUnit4ClassRunner.java:289) [spring-test-5.1.3.RELEASE.jar:5.1.3.RELEASE]
12-Dec-2018 14:03:58         at org.junit.internal.runners.model.ReflectiveCallable.run(ReflectiveCallable.java:12) [junit-4.12.jar:4.12]
12-Dec-2018 14:03:58         at org.springframework.test.context.junit4.SpringJUnit4ClassRunner.methodBlock(SpringJUnit4ClassRunner.java:291) [spring-test-5.1.3.RELEASE.jar:5.1.3.RELEASE]
12-Dec-2018 14:03:58         at org.springframework.test.context.junit4.SpringJUnit4ClassRunner.runChild(SpringJUnit4ClassRunner.java:246) [spring-test-5.1.3.RELEASE.jar:5.1.3.RELEASE]
12-Dec-2018 14:03:58         at org.springframework.test.context.junit4.SpringJUnit4ClassRunner.runChild(SpringJUnit4ClassRunner.java:97) [spring-test-5.1.3.RELEASE.jar:5.1.3.RELEASE]
12-Dec-2018 14:03:58         at org.junit.runners.ParentRunner$3.run(ParentRunner.java:290) [junit-4.12.jar:4.12]
12-Dec-2018 14:03:58         at org.junit.runners.ParentRunner$1.schedule(ParentRunner.java:71) [junit-4.12.jar:4.12]
12-Dec-2018 14:03:58         at org.junit.runners.ParentRunner.runChildren(ParentRunner.java:288) [junit-4.12.jar:4.12]
12-Dec-2018 14:03:58         at org.junit.runners.ParentRunner.access$000(ParentRunner.java:58) [junit-4.12.jar:4.12]
12-Dec-2018 14:03:58         at org.junit.runners.ParentRunner$2.evaluate(ParentRunner.java:268) [junit-4.12.jar:4.12]
12-Dec-2018 14:03:58         at org.springframework.test.context.junit4.statements.RunBeforeTestClassCallbacks.evaluate(RunBeforeTestClassCallbacks.java:61) [spring-test-5.1.3.RELEASE.jar:5.1.3.RELEASE]
12-Dec-2018 14:03:58         at org.springframework.test.context.junit4.statements.RunAfterTestClassCallbacks.evaluate(RunAfterTestClassCallbacks.java:70) [spring-test-5.1.3.RELEASE.jar:5.1.3.RELEASE]
12-Dec-2018 14:03:58         at org.junit.runners.ParentRunner.run(ParentRunner.java:363) [junit-4.12.jar:4.12]
12-Dec-2018 14:03:58         at org.springframework.test.context.junit4.SpringJUnit4ClassRunner.run(SpringJUnit4ClassRunner.java:190) [spring-test-5.1.3.RELEASE.jar:5.1.3.RELEASE]
12-Dec-2018 14:03:58         at org.apache.maven.surefire.junit4.JUnit4Provider.execute(JUnit4Provider.java:365) [surefire-junit4-2.22.0.jar:2.22.0]
12-Dec-2018 14:03:58         at org.apache.maven.surefire.junit4.JUnit4Provider.executeWithRerun(JUnit4Provider.java:273) [surefire-junit4-2.22.0.jar:2.22.0]
12-Dec-2018 14:03:58         at org.apache.maven.surefire.junit4.JUnit4Provider.executeTestSet(JUnit4Provider.java:238) [surefire-junit4-2.22.0.jar:2.22.0]
12-Dec-2018 14:03:58         at org.apache.maven.surefire.junit4.JUnit4Provider.invoke(JUnit4Provider.java:159) [surefire-junit4-2.22.0.jar:2.22.0]
12-Dec-2018 14:03:58         at org.apache.maven.surefire.booter.ForkedBooter.invokeProviderInSameClassLoader(ForkedBooter.java:383) [surefire-booter-2.22.0.jar:2.22.0]
12-Dec-2018 14:03:58         at org.apache.maven.surefire.booter.ForkedBooter.runSuitesInProcess(ForkedBooter.java:344) [surefire-booter-2.22.0.jar:2.22.0]
12-Dec-2018 14:03:58         at org.apache.maven.surefire.booter.ForkedBooter.execute(ForkedBooter.java:125) [surefire-booter-2.22.0.jar:2.22.0]
12-Dec-2018 14:03:58         at org.apache.maven.surefire.booter.ForkedBooter.main(ForkedBooter.java:417) [surefire-booter-2.22.0.jar:2.22.0]
12-Dec-2018 14:03:58 Caused by: java.lang.IllegalStateException: Failed to introspect Class [org.springframework.cloud.deployer.spi.kubernetes.KubernetesAppDeployer] from ClassLoader [sun.misc.Launcher$AppClassLoader@18b4aac2]
12-Dec-2018 14:03:58         at org.springframework.util.ReflectionUtils.getDeclaredMethods(ReflectionUtils.java:686) ~[spring-core-5.1.3.RELEASE.jar:5.1.3.RELEASE]
12-Dec-2018 14:03:58         at org.springframework.util.ReflectionUtils.doWithLocalMethods(ReflectionUtils.java:546) ~[spring-core-5.1.3.RELEASE.jar:5.1.3.RELEASE]
12-Dec-2018 14:03:58         at org.springframework.orm.jpa.support.PersistenceAnnotationBeanPostProcessor.buildPersistenceMetadata(PersistenceAnnotationBeanPostProcessor.java:432) ~[spring-orm-5.1.3.RELEASE.jar:5.1.3.RELEASE]
12-Dec-2018 14:03:58         at org.springframework.orm.jpa.support.PersistenceAnnotationBeanPostProcessor.findPersistenceMetadata(PersistenceAnnotationBeanPostProcessor.java:406) ~[spring-orm-5.1.3.RELEASE.jar:5.1.3.RELEASE]
12-Dec-2018 14:03:58         at org.springframework.orm.jpa.support.PersistenceAnnotationBeanPostProcessor.postProcessMergedBeanDefinition(PersistenceAnnotationBeanPostProcessor.java:333) ~[spring-orm-5.1.3.RELEASE.jar:5.1.3.RELEASE]
12-Dec-2018 14:03:58         at org.springframework.beans.factory.support.AbstractAutowireCapableBeanFactory.applyMergedBeanDefinitionPostProcessors(AbstractAutowireCapableBeanFactory.java:1044) ~[spring-beans-5.1.3.RELEASE.jar:5.1.3.RELEASE]
12-Dec-2018 14:03:58         at org.springframework.beans.factory.support.AbstractAutowireCapableBeanFactory.doCreateBean(AbstractAutowireCapableBeanFactory.java:550) ~[spring-beans-5.1.3.RELEASE.jar:5.1.3.RELEASE]
12-Dec-2018 14:03:58         ... 42 common frames omitted
12-Dec-2018 14:03:58 Caused by: java.lang.NoClassDefFoundError: io/fabric8/kubernetes/api/model/apps/Deployment
12-Dec-2018 14:03:58         at java.lang.Class.getDeclaredMethods0(Native Method) ~[na:1.8.0_144]
12-Dec-2018 14:03:58         at java.lang.Class.privateGetDeclaredMethods(Class.java:2701) ~[na:1.8.0_144]
12-Dec-2018 14:03:58         at java.lang.Class.getDeclaredMethods(Class.java:1975) ~[na:1.8.0_144]
12-Dec-2018 14:03:58         at org.springframework.util.ReflectionUtils.getDeclaredMethods(ReflectionUtils.java:668) ~[spring-core-5.1.3.RELEASE.jar:5.1.3.RELEASE]
12-Dec-2018 14:03:58         ... 48 common frames omitted
12-Dec-2018 14:03:58 Caused by: java.lang.ClassNotFoundException: io.fabric8.kubernetes.api.model.apps.Deployment
12-Dec-2018 14:03:58         at java.net.URLClassLoader.findClass(URLClassLoader.java:381) ~[na:1.8.0_144]
12-Dec-2018 14:03:58         at java.lang.ClassLoader.loadClass(ClassLoader.java:424) ~[na:1.8.0_144]
12-Dec-2018 14:03:58         at sun.misc.Launcher$AppClassLoader.loadClass(Launcher.java:335) ~[na:1.8.0_144]
12-Dec-2018 14:03:58         at java.lang.ClassLoader.loadClass(ClassLoader.java:357) ~[na:1.8.0_144]
12-Dec-2018 14:03:58         ... 52 common frames omitted
12-Dec-2018 14:03:58
12-Dec-2018 14:03:58 2018-12-12 14:03:58.197 ERROR 31418 --- [           main] o.s.test.context.TestContextManager      : Caught exception while allowing TestExecutionListener [org.springframework.boot.test.autoconfigure.SpringBootDependencyInjectionTestExecutionListener@71664560] to prepare test instance [org.springframework.cloud.dataflow.server.kubernetes.ContextLoadsTests@9df564f]
12-Dec-2018 14:03:58
12-Dec-2018 14:03:58 java.lang.IllegalStateException: Failed to load ApplicationContext
12-Dec-2018 14:03:58         at org.springframework.test.context.cache.DefaultCacheAwareContextLoaderDelegate.loadContext(DefaultCacheAwareContextLoaderDelegate.java:125) ~[spring-test-5.1.3.RELEASE.jar:5.1.3.RELEASE]
12-Dec-2018 14:03:58         at org.springframework.test.context.support.DefaultTestContext.getApplicationContext(DefaultTestContext.java:108) ~[spring-test-5.1.3.RELEASE.jar:5.1.3.RELEASE]
12-Dec-2018 14:03:58         at org.springframework.test.context.support.DependencyInjectionTestExecutionListener.injectDependencies(DependencyInjectionTestExecutionListener.java:118) ~[spring-test-5.1.3.RELEASE.jar:5.1.3.RELEASE]
12-Dec-2018 14:03:58         at org.springframework.test.context.support.DependencyInjectionTestExecutionListener.prepareTestInstance(DependencyInjectionTestExecutionListener.java:83) ~[spring-test-5.1.3.RELEASE.jar:5.1.3.RELEASE]
12-Dec-2018 14:03:58         at org.springframework.boot.test.autoconfigure.SpringBootDependencyInjectionTestExecutionListener.prepareTestInstance(SpringBootDependencyInjectionTestExecutionListener.java:44) ~[spring-boot-test-autoconfigure-2.1.1.RELEASE.jar:2.1.1.RELEASE]
12-Dec-2018 14:03:58         at org.springframework.test.context.TestContextManager.prepareTestInstance(TestContextManager.java:246) ~[spring-test-5.1.3.RELEASE.jar:5.1.3.RELEASE]
12-Dec-2018 14:03:58         at org.springframework.test.context.junit4.SpringJUnit4ClassRunner.createTest(SpringJUnit4ClassRunner.java:227) [spring-test-5.1.3.RELEASE.jar:5.1.3.RELEASE]
12-Dec-2018 14:03:58         at org.springframework.test.context.junit4.SpringJUnit4ClassRunner$1.runReflectiveCall(SpringJUnit4ClassRunner.java:289) [spring-test-5.1.3.RELEASE.jar:5.1.3.RELEASE]
12-Dec-2018 14:03:58         at org.junit.internal.runners.model.ReflectiveCallable.run(ReflectiveCallable.java:12) [junit-4.12.jar:4.12]
12-Dec-2018 14:03:58         at org.springframework.test.context.junit4.SpringJUnit4ClassRunner.methodBlock(SpringJUnit4ClassRunner.java:291) [spring-test-5.1.3.RELEASE.jar:5.1.3.RELEASE]
12-Dec-2018 14:03:58         at org.springframework.test.context.junit4.SpringJUnit4ClassRunner.runChild(SpringJUnit4ClassRunner.java:246) [spring-test-5.1.3.RELEASE.jar:5.1.3.RELEASE]
12-Dec-2018 14:03:58         at org.springframework.test.context.junit4.SpringJUnit4ClassRunner.runChild(SpringJUnit4ClassRunner.java:97) [spring-test-5.1.3.RELEASE.jar:5.1.3.RELEASE]
12-Dec-2018 14:03:58         at org.junit.runners.ParentRunner$3.run(ParentRunner.java:290) [junit-4.12.jar:4.12]
12-Dec-2018 14:03:58         at org.junit.runners.ParentRunner$1.schedule(ParentRunner.java:71) [junit-4.12.jar:4.12]
12-Dec-2018 14:03:58         at org.junit.runners.ParentRunner.runChildren(ParentRunner.java:288) [junit-4.12.jar:4.12]
12-Dec-2018 14:03:58         at org.junit.runners.ParentRunner.access$000(ParentRunner.java:58) [junit-4.12.jar:4.12]
12-Dec-2018 14:03:58         at org.junit.runners.ParentRunner$2.evaluate(ParentRunner.java:268) [junit-4.12.jar:4.12]
12-Dec-2018 14:03:58         at org.springframework.test.context.junit4.statements.RunBeforeTestClassCallbacks.evaluate(RunBeforeTestClassCallbacks.java:61) [spring-test-5.1.3.RELEASE.jar:5.1.3.RELEASE]
12-Dec-2018 14:03:58         at org.springframework.test.context.junit4.statements.RunAfterTestClassCallbacks.evaluate(RunAfterTestClassCallbacks.java:70) [spring-test-5.1.3.RELEASE.jar:5.1.3.RELEASE]
12-Dec-2018 14:03:58         at org.junit.runners.ParentRunner.run(ParentRunner.java:363) [junit-4.12.jar:4.12]
12-Dec-2018 14:03:58         at org.springframework.test.context.junit4.SpringJUnit4ClassRunner.run(SpringJUnit4ClassRunner.java:190) [spring-test-5.1.3.RELEASE.jar:5.1.3.RELEASE]
12-Dec-2018 14:03:58         at org.apache.maven.surefire.junit4.JUnit4Provider.execute(JUnit4Provider.java:365) [surefire-junit4-2.22.0.jar:2.22.0]
12-Dec-2018 14:03:58         at org.apache.maven.surefire.junit4.JUnit4Provider.executeWithRerun(JUnit4Provider.java:273) [surefire-junit4-2.22.0.jar:2.22.0]
12-Dec-2018 14:03:58         at org.apache.maven.surefire.junit4.JUnit4Provider.executeTestSet(JUnit4Provider.java:238) [surefire-junit4-2.22.0.jar:2.22.0]
12-Dec-2018 14:03:58         at org.apache.maven.surefire.junit4.JUnit4Provider.invoke(JUnit4Provider.java:159) [surefire-junit4-2.22.0.jar:2.22.0]
12-Dec-2018 14:03:58         at org.apache.maven.surefire.booter.ForkedBooter.invokeProviderInSameClassLoader(ForkedBooter.java:383) [surefire-booter-2.22.0.jar:2.22.0]
12-Dec-2018 14:03:58         at org.apache.maven.surefire.booter.ForkedBooter.runSuitesInProcess(ForkedBooter.java:344) [surefire-booter-2.22.0.jar:2.22.0]
12-Dec-2018 14:03:58         at org.apache.maven.surefire.booter.ForkedBooter.execute(ForkedBooter.java:125) [surefire-booter-2.22.0.jar:2.22.0]
12-Dec-2018 14:03:58         at org.apache.maven.surefire.booter.ForkedBooter.main(ForkedBooter.java:417) [surefire-booter-2.22.0.jar:2.22.0]
12-Dec-2018 14:03:58 Caused by: org.springframework.beans.factory.BeanCreationException: Error creating bean with name 'appDeployer' defined in class path resource [org/springframework/cloud/deployer/spi/kubernetes/KubernetesAutoConfiguration.class]: Post-processing of merged bean definition failed; nested exception is java.lang.IllegalStateException: Failed to introspect Class [org.springframework.cloud.deployer.spi.kubernetes.KubernetesAppDeployer] from ClassLoader [sun.misc.Launcher$AppClassLoader@18b4aac2]
12-Dec-2018 14:03:58         at org.springframework.beans.factory.support.AbstractAutowireCapableBeanFactory.doCreateBean(AbstractAutowireCapableBeanFactory.java:553) ~[spring-beans-5.1.3.RELEASE.jar:5.1.3.RELEASE]
12-Dec-2018 14:03:58         at org.springframework.beans.factory.support.AbstractAutowireCapableBeanFactory.createBean(AbstractAutowireCapableBeanFactory.java:498) ~[spring-beans-5.1.3.RELEASE.jar:5.1.3.RELEASE]
12-Dec-2018 14:03:58         at org.springframework.beans.factory.support.AbstractBeanFactory.lambda$doGetBean$0(AbstractBeanFactory.java:320) ~[spring-beans-5.1.3.RELEASE.jar:5.1.3.RELEASE]
12-Dec-2018 14:03:58         at org.springframework.beans.factory.support.DefaultSingletonBeanRegistry.getSingleton(DefaultSingletonBeanRegistry.java:222) ~[spring-beans-5.1.3.RELEASE.jar:5.1.3.RELEASE]
12-Dec-2018 14:03:58         at org.springframework.beans.factory.support.AbstractBeanFactory.doGetBean(AbstractBeanFactory.java:318) ~[spring-beans-5.1.3.RELEASE.jar:5.1.3.RELEASE]
12-Dec-2018 14:03:58         at org.springframework.beans.factory.support.AbstractBeanFactory.getBean(AbstractBeanFactory.java:199) ~[spring-beans-5.1.3.RELEASE.jar:5.1.3.RELEASE]
12-Dec-2018 14:03:58         at org.springframework.beans.factory.support.DefaultListableBeanFactory.preInstantiateSingletons(DefaultListableBeanFactory.java:846) ~[spring-beans-5.1.3.RELEASE.jar:5.1.3.RELEASE]
12-Dec-2018 14:03:58         at org.springframework.context.support.AbstractApplicationContext.finishBeanFactoryInitialization(AbstractApplicationContext.java:863) ~[spring-context-5.1.3.RELEASE.jar:5.1.3.RELEASE]
12-Dec-2018 14:03:58         at org.springframework.context.support.AbstractApplicationContext.refresh(AbstractApplicationContext.java:546) ~[spring-context-5.1.3.RELEASE.jar:5.1.3.RELEASE]
12-Dec-2018 14:03:58         at org.springframework.boot.web.servlet.context.ServletWebServerApplicationContext.refresh(ServletWebServerApplicationContext.java:142) ~[spring-boot-2.1.1.RELEASE.jar:2.1.1.RELEASE]
12-Dec-2018 14:03:58         at org.springframework.boot.SpringApplication.refresh(SpringApplication.java:775) ~[spring-boot-2.1.1.RELEASE.jar:2.1.1.RELEASE]
12-Dec-2018 14:03:58         at org.springframework.boot.SpringApplication.refreshContext(SpringApplication.java:397) ~[spring-boot-2.1.1.RELEASE.jar:2.1.1.RELEASE]
12-Dec-2018 14:03:58         at org.springframework.boot.SpringApplication.run(SpringApplication.java:316) ~[spring-boot-2.1.1.RELEASE.jar:2.1.1.RELEASE]
12-Dec-2018 14:03:58         at org.springframework.boot.test.context.SpringBootContextLoader.loadContext(SpringBootContextLoader.java:127) ~[spring-boot-test-2.1.1.RELEASE.jar:2.1.1.RELEASE]
12-Dec-2018 14:03:58         at org.springframework.test.context.cache.DefaultCacheAwareContextLoaderDelegate.loadContextInternal(DefaultCacheAwareContextLoaderDelegate.java:99) ~[spring-test-5.1.3.RELEASE.jar:5.1.3.RELEASE]
12-Dec-2018 14:03:58         at org.springframework.test.context.cache.DefaultCacheAwareContextLoaderDelegate.loadContext(DefaultCacheAwareContextLoaderDelegate.java:117) ~[spring-test-5.1.3.RELEASE.jar:5.1.3.RELEASE]
12-Dec-2018 14:03:58         ... 28 common frames omitted
12-Dec-2018 14:03:58 Caused by: java.lang.IllegalStateException: Failed to introspect Class [org.springframework.cloud.deployer.spi.kubernetes.KubernetesAppDeployer] from ClassLoader [sun.misc.Launcher$AppClassLoader@18b4aac2]
12-Dec-2018 14:03:58         at org.springframework.util.ReflectionUtils.getDeclaredMethods(ReflectionUtils.java:686) ~[spring-core-5.1.3.RELEASE.jar:5.1.3.RELEASE]
12-Dec-2018 14:03:58         at org.springframework.util.ReflectionUtils.doWithLocalMethods(ReflectionUtils.java:546) ~[spring-core-5.1.3.RELEASE.jar:5.1.3.RELEASE]
12-Dec-2018 14:03:58         at org.springframework.orm.jpa.support.PersistenceAnnotationBeanPostProcessor.buildPersistenceMetadata(PersistenceAnnotationBeanPostProcessor.java:432) ~[spring-orm-5.1.3.RELEASE.jar:5.1.3.RELEASE]
12-Dec-2018 14:03:58         at org.springframework.orm.jpa.support.PersistenceAnnotationBeanPostProcessor.findPersistenceMetadata(PersistenceAnnotationBeanPostProcessor.java:406) ~[spring-orm-5.1.3.RELEASE.jar:5.1.3.RELEASE]
12-Dec-2018 14:03:58         at org.springframework.orm.jpa.support.PersistenceAnnotationBeanPostProcessor.postProcessMergedBeanDefinition(PersistenceAnnotationBeanPostProcessor.java:333) ~[spring-orm-5.1.3.RELEASE.jar:5.1.3.RELEASE]
12-Dec-2018 14:03:58         at org.springframework.beans.factory.support.AbstractAutowireCapableBeanFactory.applyMergedBeanDefinitionPostProcessors(AbstractAutowireCapableBeanFactory.java:1044) ~[spring-beans-5.1.3.RELEASE.jar:5.1.3.RELEASE]
12-Dec-2018 14:03:58         at org.springframework.beans.factory.support.AbstractAutowireCapableBeanFactory.doCreateBean(AbstractAutowireCapableBeanFactory.java:550) ~[spring-beans-5.1.3.RELEASE.jar:5.1.3.RELEASE]
12-Dec-2018 14:03:58         ... 43 common frames omitted
12-Dec-2018 14:03:58 Caused by: java.lang.NoClassDefFoundError: io/fabric8/kubernetes/api/model/apps/Deployment
12-Dec-2018 14:03:58         at java.lang.Class.getDeclaredMethods0(Native Method) ~[na:1.8.0_144]
12-Dec-2018 14:03:58         at java.lang.Class.privateGetDeclaredMethods(Class.java:2701) ~[na:1.8.0_144]
12-Dec-2018 14:03:58         at java.lang.Class.getDeclaredMethods(Class.java:1975) ~[na:1.8.0_144]
12-Dec-2018 14:03:58         at org.springframework.util.ReflectionUtils.getDeclaredMethods(ReflectionUtils.java:668) ~[spring-core-5.1.3.RELEASE.jar:5.1.3.RELEASE]
12-Dec-2018 14:03:58         ... 49 common frames omitted
12-Dec-2018 14:03:58 Caused by: java.lang.ClassNotFoundException: io.fabric8.kubernetes.api.model.apps.Deployment
12-Dec-2018 14:03:58         at java.net.URLClassLoader.findClass(URLClassLoader.java:381) ~[na:1.8.0_144]
12-Dec-2018 14:03:58         at java.lang.ClassLoader.loadClass(ClassLoader.java:424) ~[na:1.8.0_144]
12-Dec-2018 14:03:58         at sun.misc.Launcher$AppClassLoader.loadClass(Launcher.java:335) ~[na:1.8.0_144]
12-Dec-2018 14:03:58         at java.lang.ClassLoader.loadClass(ClassLoader.java:357) ~[na:1.8.0_144]
12-Dec-2018 14:03:58         ... 53 common frames omitted
12-Dec-2018 14:03:58
12-Dec-2018 14:03:58 [ERROR] Tests run: 1, Failures: 0, Errors: 1, Skipped: 0, Time elapsed: 13.91 s <<< FAILURE! - in org.springframework.cloud.dataflow.server.kubernetes.ContextLoadsTests
12-Dec-2018 14:03:58 [ERROR] contextLoads(org.springframework.cloud.dataflow.server.kubernetes.ContextLoadsTests)  Time elapsed: 0.007 s  <<< ERROR!
12-Dec-2018 14:03:58 java.lang.IllegalStateException: Failed to load ApplicationContext
12-Dec-2018 14:03:58 Caused by: org.springframework.beans.factory.BeanCreationException: Error creating bean with name 'appDeployer' defined in class path resource [org/springframework/cloud/deployer/spi/kubernetes/KubernetesAutoConfiguration.class]: Post-processing of merged bean definition failed; nested exception is java.lang.IllegalStateException: Failed to introspect Class [org.springframework.cloud.deployer.spi.kubernetes.KubernetesAppDeployer] from ClassLoader [sun.misc.Launcher$AppClassLoader@18b4aac2]
12-Dec-2018 14:03:58 Caused by: java.lang.IllegalStateException: Failed to introspect Class [org.springframework.cloud.deployer.spi.kubernetes.KubernetesAppDeployer] from ClassLoader [sun.misc.Launcher$AppClassLoader@18b4aac2]
12-Dec-2018 14:03:58 Caused by: java.lang.NoClassDefFoundError: io/fabric8/kubernetes/api/model/apps/Deployment
12-Dec-2018 14:03:58 Caused by: java.lang.ClassNotFoundException: io.fabric8.kubernetes.api.model.apps.Deployment
12-Dec-2018 14:03:58
12-Dec-2018 14:03:58 [INFO]
12-Dec-2018 14:03:58 [INFO] Results:
12-Dec-2018 14:03:58 [INFO]
12-Dec-2018 14:03:58 [ERROR] Errors:
12-Dec-2018 14:03:58 [ERROR]   ContextLoadsTests.contextLoads » IllegalState Failed to load ApplicationContex...
12-Dec-2018 14:03:58 [INFO]
12-Dec-2018 14:03:58 [ERROR] Tests run: 1, Failures: 0, Errors: 1, Skipped: 0
12-Dec-2018 14:03:58 [INFO]
12-Dec-2018 14:03:58 [INFO] ------------------------------------------------------------------------
12-Dec-2018 14:03:58 [INFO] Reactor Summary:
12-Dec-2018 14:03:58 [INFO]
12-Dec-2018 14:03:58 [INFO] spring-cloud-dataflow-server-kubernetes-parent ..... SUCCESS [  1.405 s]
12-Dec-2018 14:03:58 [INFO] spring-cloud-dataflow-server-kubernetes-autoconfig . SUCCESS [ 13.085 s]
12-Dec-2018 14:03:58 [INFO] Kubernetes Data Flow Server ........................ FAILURE [ 16.777 s]
12-Dec-2018 14:03:58 [INFO] spring-cloud-dataflow-server-kubernetes-docs ....... SKIPPED
12-Dec-2018 14:03:58 [INFO] ------------------------------------------------------------------------
12-Dec-2018 14:03:58 [INFO] BUILD FAILURE
12-Dec-2018 14:03:58 [INFO] ------------------------------------------------------------------------
12-Dec-2018 14:03:58 [INFO] Total time: 33.756 s
12-Dec-2018 14:03:58 [INFO] Finished at: 2018-12-12T14:03:58Z
12-Dec-2018 14:03:59 [INFO] Final Memory: 101M/750M
12-Dec-2018 14:03:59 [INFO] ------------------------------------------------------------------------
12-Dec-2018 14:03:59 [ERROR] Failed to execute goal org.apache.maven.plugins:maven-surefire-plugin:2.22.0:test (default-test) on project spring-cloud-dataflow-server-kubernetes: There are test failures.
12-Dec-2018 14:03:59 [ERROR]
12-Dec-2018 14:03:59 [ERROR] Please refer to /opt/bamboo-home/xml-data/build-dir/SCD-K8S110BMASTER-JOB1/spring-cloud-dataflow-server-kubernetes/target/surefire-reports for the individual test results.
12-Dec-2018 14:03:59 [ERROR] Please refer to dump files (if any exist) [date]-jvmRun[N].dump, [date].dumpstream and [date]-jvmRun[N].dumpstream.
12-Dec-2018 14:03:59 [ERROR] -> [Help 1]
12-Dec-2018 14:03:59 [ERROR]
12-Dec-2018 14:03:59 [ERROR] To see the full stack trace of the errors, re-run Maven with the -e switch.
12-Dec-2018 14:03:59 [ERROR] Re-run Maven using the -X switch to enable full debug logging.
12-Dec-2018 14:03:59 [ERROR]
12-Dec-2018 14:03:59 [ERROR] For more information about the errors and possible solutions, please read the following articles:
12-Dec-2018 14:03:59 [ERROR] [Help 1] http://cwiki.apache.org/confluence/display/MAVEN/MojoFailureException
12-Dec-2018 14:03:59 [ERROR]
12-Dec-2018 14:03:59 [ERROR] After correcting the problems, you can resume the build with the command
12-Dec-2018 14:03:59 [ERROR]   mvn <goals> -rf :spring-cloud-dataflow-server-kubernetes
12-Dec-2018 14:03:59
12-Dec-2018 14:03:59 Failing task since return code of [/opt/jdk-8/bin/java -cp /opt/maven-3.5/boot/plexus-classworlds-2.5.2.jar -Dclassworlds.conf=/tmp/artifactoryM22956585511871340731conf -DbuildInfoConfig.propertiesFile=/tmp/buildInfo995009286484737470.properties -Dmaven.home=/opt/maven-3.5 -Dmaven.multiModuleProjectDirectory=/opt/bamboo-home/xml-data/build-dir/SCD-K8S110BMASTER-JOB1 org.codehaus.plexus.classworlds.launcher.Launcher -s .settings.xml clean install -Pfull -U --batch-mode -Dartifactory.publish.password=********] was 1 while expected 0
12-Dec-2018 14:03:59 Parsing test results under /opt/bamboo-home/xml-data/build-dir/SCD-K8S110BMASTER-JOB1...
12-Dec-2018 14:03:59 Finished task 'Build and publish Spring Cloud Data' with result: Failed
12-Dec-2018 14:03:59 Running post build plugin 'Docker Container Cleanup'
12-Dec-2018 14:03:59 Running post build plugin 'NCover Results Collector'
12-Dec-2018 14:03:59 Running post build plugin 'Artifactory Release Management Staging'
12-Dec-2018 14:03:59 Running post build plugin 'Artifactory Build Info Copier'
12-Dec-2018 14:03:59 Running post build plugin 'Artifactory Gradle Properties Info Copier'
12-Dec-2018 14:03:59 Running post build plugin 'Clover Results Collector'
12-Dec-2018 14:03:59 Running post build plugin 'npm Cache Cleanup'
12-Dec-2018 14:03:59 Running post build plugin 'Artifact Copier'
12-Dec-2018 14:03:59 Publishing an artifact: Test Results
12-Dec-2018 14:03:59 Finished publishing of artifact Shared artifact: [Test Results], pattern: [**/target/surefire-reports/**/*.*] in 19.07 ms
12-Dec-2018 14:03:59 Successfully removed working directory at '/opt/bamboo-home/xml-data/build-dir/SCD-K8S110BMASTER-JOB1'
12-Dec-2018 14:03:59 Finalising the build...
12-Dec-2018 14:03:59 Stopping timer.
12-Dec-2018 14:03:59 Build SCD-K8S110BMASTER-JOB1-355 completed.
12-Dec-2018 14:03:59 Running on server: post build plugin 'NCover Results Collector'
12-Dec-2018 14:03:59 Running on server: post build plugin 'Build Hanging Detection Configuration'
12-Dec-2018 14:03:59 Running on server: post build plugin 'Clover Delta Calculator'
12-Dec-2018 14:03:59 Running on server: post build plugin 'Maven Dependencies Postprocessor'
12-Dec-2018 14:03:59 All post build plugins have finished
12-Dec-2018 14:03:59 Generating build results summary...
12-Dec-2018 14:03:59 Saving build results to disk...
12-Dec-2018 14:03:59 Logging substituted variables...
12-Dec-2018 14:03:59 Indexing build results...
12-Dec-2018 14:03:59 Finished building SCD-K8S110BMASTER-JOB1-355.