Targeting Kubernetes version 1.10 on master branch

Build: #381 failed

Job: Build Spring Cloud Dataflow Kubernetes Server failed

Stages & jobs

  1. Default Stage

  2. Build Server Docker Image and upload

Build log

The build generated 737 lines of output. Download or view full build log

19-Dec-2018 21:22:32 Build Spring Cloud Data Flow - Server - Kubernetes 1.10 - Master - Build Spring Cloud Dataflow Kubernetes Server #381 (SCD-K8S110BMASTER-JOB1-381) started building on agent bamboo-10.af.pivotal.io
19-Dec-2018 21:22:32 Remote agent on host bamboo-10.af.pivotal.io
19-Dec-2018 21:22:32 Build working directory is /opt/bamboo-home/xml-data/build-dir/SCD-K8S110BMASTER-JOB1
19-Dec-2018 21:22:32 Executing build Spring Cloud Data Flow - Server - Kubernetes 1.10 - Master - Build Spring Cloud Dataflow Kubernetes Server #381 (SCD-K8S110BMASTER-JOB1-381)
19-Dec-2018 21:22:32 Starting task 'Checkout Default Repository' of type 'com.atlassian.bamboo.plugins.vcs:task.vcs.checkout'
19-Dec-2018 21:22:32 Checking out into /opt/bamboo-home/xml-data/build-dir/SCD-K8S110BMASTER-JOB1
19-Dec-2018 21:22:32 Updating source code to revision: 06daa0323f66be96223f2bae377726091e7b5fd3
19-Dec-2018 21:22:32 Creating local git repository in '/opt/bamboo-home/xml-data/build-dir/SCD-K8S110BMASTER-JOB1/.git'.
19-Dec-2018 21:22:32 Initialized empty Git repository in /opt/bamboo-home/xml-data/build-dir/SCD-K8S110BMASTER-JOB1/.git/
19-Dec-2018 21:22:32 Fetching 'refs/heads/master' from 'https://github.com/spring-cloud/spring-cloud-dataflow-server-kubernetes.git'.
19-Dec-2018 21:22:33 From https://github.com/spring-cloud/spring-cloud-dataflow-server-kubernetes
19-Dec-2018 21:22:33 * [new branch]      master     -> master
19-Dec-2018 21:22:33 * [new tag]         v1.0.0.M1  -> v1.0.0.M1
19-Dec-2018 21:22:33 * [new tag]         v1.0.0.M2  -> v1.0.0.M2
19-Dec-2018 21:22:33 * [new tag]         v1.0.0.RC1 -> v1.0.0.RC1
19-Dec-2018 21:22:33 * [new tag]         v1.0.0.RELEASE -> v1.0.0.RELEASE
19-Dec-2018 21:22:33 * [new tag]         v1.0.1.RELEASE -> v1.0.1.RELEASE
19-Dec-2018 21:22:33 * [new tag]         v1.1.0.M1  -> v1.1.0.M1
19-Dec-2018 21:22:33 * [new tag]         v1.1.0.M2  -> v1.1.0.M2
19-Dec-2018 21:22:33 * [new tag]         v1.1.0.RC1 -> v1.1.0.RC1
19-Dec-2018 21:22:33 * [new tag]         v1.1.0.RELEASE -> v1.1.0.RELEASE
19-Dec-2018 21:22:33 * [new tag]         v1.1.1.RELEASE -> v1.1.1.RELEASE
19-Dec-2018 21:22:33 * [new tag]         v1.1.2.RELEASE -> v1.1.2.RELEASE
19-Dec-2018 21:22:33 * [new tag]         v1.2.0.M1  -> v1.2.0.M1
19-Dec-2018 21:22:33 * [new tag]         v1.2.0.M2  -> v1.2.0.M2
19-Dec-2018 21:22:33 * [new tag]         v1.2.0.RC1 -> v1.2.0.RC1
19-Dec-2018 21:22:33 * [new tag]         v1.2.0.RC2 -> v1.2.0.RC2
19-Dec-2018 21:22:33 * [new tag]         v1.2.0.RELEASE -> v1.2.0.RELEASE
19-Dec-2018 21:22:33 * [new tag]         v1.2.1.RELEASE -> v1.2.1.RELEASE
19-Dec-2018 21:22:33 * [new tag]         v1.2.2.RELEASE -> v1.2.2.RELEASE
19-Dec-2018 21:22:33 * [new tag]         v1.3.0.M1  -> v1.3.0.M1
19-Dec-2018 21:22:33 * [new tag]         v1.3.0.M2  -> v1.3.0.M2
19-Dec-2018 21:22:33 * [new tag]         v1.3.0.M3  -> v1.3.0.M3
19-Dec-2018 21:22:33 * [new tag]         v1.3.0.RC1 -> v1.3.0.RC1
19-Dec-2018 21:22:33 * [new tag]         v1.3.0.RC2 -> v1.3.0.RC2
19-Dec-2018 21:22:33 * [new tag]         v1.3.0.RELEASE -> v1.3.0.RELEASE
19-Dec-2018 21:22:33 * [new tag]         v1.3.1.RELEASE -> v1.3.1.RELEASE
19-Dec-2018 21:22:33 * [new tag]         v1.4.0.M1  -> v1.4.0.M1
19-Dec-2018 21:22:33 * [new tag]         v1.4.0.RC1 -> v1.4.0.RC1
19-Dec-2018 21:22:33 * [new tag]         v1.4.0.RELEASE -> v1.4.0.RELEASE
19-Dec-2018 21:22:33 * [new tag]         v1.5.0.M1  -> v1.5.0.M1
19-Dec-2018 21:22:33 * [new tag]         v1.5.0.RC1 -> v1.5.0.RC1
19-Dec-2018 21:22:33 * [new tag]         v1.5.0.RELEASE -> v1.5.0.RELEASE
19-Dec-2018 21:22:33 * [new tag]         v1.5.1.RELEASE -> v1.5.1.RELEASE
19-Dec-2018 21:22:33 * [new tag]         v1.6.0.M1  -> v1.6.0.M1
19-Dec-2018 21:22:33 * [new tag]         v1.6.0.M2  -> v1.6.0.M2
19-Dec-2018 21:22:33 * [new tag]         v1.6.0.RC1 -> v1.6.0.RC1
19-Dec-2018 21:22:33 * [new tag]         v1.6.0.RELEASE -> v1.6.0.RELEASE
19-Dec-2018 21:22:33 * [new tag]         v1.7.0.M1  -> v1.7.0.M1
19-Dec-2018 21:22:33 * [new tag]         v1.7.0.RC1 -> v1.7.0.RC1
19-Dec-2018 21:22:33 * [new tag]         v1.7.0.RELEASE -> v1.7.0.RELEASE
19-Dec-2018 21:22:33 Checking out revision 06daa0323f66be96223f2bae377726091e7b5fd3.
19-Dec-2018 21:22:33 Already on 'master'
19-Dec-2018 21:22:33 Updated source code to revision: 06daa0323f66be96223f2bae377726091e7b5fd3
19-Dec-2018 21:22:33 Finished task 'Checkout Default Repository' with result: Success
19-Dec-2018 21:22:33 Running pre-build action: Artifactory Release Staging
19-Dec-2018 21:22:33 Running pre-build action: VCS Version Collector
19-Dec-2018 21:22:36 Starting task 'Build and publish Spring Cloud Data' of type 'org.jfrog.bamboo.bamboo-artifactory-plugin:maven3Task'
19-Dec-2018 21:22:36 Bamboo Artifactory Plugin version: 2.5.x-SNAPSHOT
19-Dec-2018 21:22:36
Beginning to execute external process for build 'Spring Cloud Data Flow - Server - Kubernetes 1.10 - Master - Build Spring Cloud Dataflow Kubernetes Server #381 (SCD-K8S110BMASTER-JOB1-381)'
... running command line:
/opt/jdk-8/bin/java -cp /opt/maven-3.5/boot/plexus-classworlds-2.5.2.jar -Dclassworlds.conf=/tmp/artifactoryM21290563521228874520conf -DbuildInfoConfig.propertiesFile=/tmp/buildInfo4931690927534646109.properties -Dmaven.home=/opt/maven-3.5 -Dmaven.multiModuleProjectDirectory=/opt/bamboo-home/xml-data/build-dir/SCD-K8S110BMASTER-JOB1 org.codehaus.plexus.classworlds.launcher.Launcher -s .settings.xml clean install -Pfull -U --batch-mode -Dartifactory.publish.password=********
... in: /opt/bamboo-home/xml-data/build-dir/SCD-K8S110BMASTER-JOB1
... using extra environment variables:
bamboo_planRepository_1_branch=master
IRBRC=/home/bamboo/.rvm/rubies/ruby-2.3.0/.irbrc
bamboo_********_username_password=********
bamboo_signing_store_password=********
bamboo_capability_system_builder_ant_Ant_1_9=/opt/ant-1.9
bamboo_capability_system_builder_ant_Ant_1_8=/opt/ant-1.8
bamboo_planRepository_1_branchDisplayName=master
bamboo_repository_revision_number=06daa0323f66be96223f2bae377726091e7b5fd3
bamboo_repository_268501035_previous_revision_number=06daa0323f66be96223f2bae377726091e7b5fd3
bamboo_capability_system_builder_node_Node_js_6=/usr/bin/node
bamboo_RIAK_BIN=/usr/sbin/riak
WRAPPER_BITS=32
bamboo_buildKey=SCD-K8S110BMASTER-JOB1
rvm_loaded_flag=1
bamboo_sonar_token_password=********
rvm_version=1.27.0 (latest)
PWD=/opt/bamboo-home/bin
bamboo_shortJobName=Build Spring Cloud Dataflow Kubernetes Server
KUBERNETES_MASTER=https://35.227.88.51
bamboo_capability_system_builder_gradle___gradlew=./gradlew
bamboo_buildResultsUrl=https://build.spring.io/browse/SCD-K8S110BMASTER-JOB1-381
bamboo_capability_system_builder_mvn3_Maven_3_3=/opt/maven-3.3
bamboo_capability_system_builder_mvn3_Maven_3_2=/opt/maven-3.2
bamboo_capability_system_builder_mvn3_Maven_3_1=/opt/maven-3.1
bamboo_planRepository_repositoryUrl=https://github.com/spring-cloud/spring-cloud-dataflow-server-kubernetes.git
bamboo_repository_268501035_git_username=spring-buildmaster
bamboo_agentId=208568334
bamboo_capability_system_builder_mvn3_Maven_3_5=/opt/maven-3.5
MY_RUBY_HOME=/home/bamboo/.rvm/rubies/ruby-2.3.0
bamboo_capability_system_builder_mvn3_Maven_3_0=/opt/maven-3.0
KUBERNETES_AUTH_BASIC_PASSWORD=********
rvm_path=/home/bamboo/.rvm
bamboo_planRepository_revision=06daa0323f66be96223f2bae377726091e7b5fd3
bamboo_repository_268501035_branch_name=master
bamboo_planRepository_previousRevision=06daa0323f66be96223f2bae377726091e7b5fd3
bamboo_capability_remote_build=true
bamboo_repository_branch_name=master
KUBERNETES_NAMESPACE=default
SHLVL=1
bamboo_org_jfrog_bamboo_buildInfo_serverUrl=https://repo.spring.io
bamboo_scdf_acceptance_tests_password=********
WRAPPER_OS=linux
EC2_HOME=/opt/ec2-api-tools
XDG_SESSION_ID=c1
bamboo_capability_Agent=bamboo-10.af.pivotal.io
bamboo_planRepository_branch=master
bamboo_org_jfrog_bamboo_release_activated=false
EXTERNAL_SERVERS_REQUIRED=true
bamboo_repository_268501035_git_repositoryUrl=https://github.com/spring-cloud/spring-cloud-dataflow-server-kubernetes.git
bamboo_planRepository_1_type=gitv2
bamboo_planRepository_branchName=master
WRAPPER_FILE_SEPARATOR=/
_=/opt/bamboo-home/bin/bamboo-agent.sh
WRAPPER_PATH_SEPARATOR=:
bamboo_sonar_password=********
bamboo_hg_cache_directory=/opt/bamboo-home/xml-data/build-dir/_hg-repositories-cache
bamboo_planRepository_1_username=spring-buildmaster
bamboo_planRepository_type=gitv2
bamboo_git_cache_directory=/opt/bamboo-home/xml-data/build-dir/_git-repositories-cache
bamboo_artifactory_username=buildmaster
rvm_stored_umask=0002
bamboo_tmp_directory=/opt/bamboo-home/temp
GEM_PATH=/home/bamboo/.rvm/gems/ruby-2.3.0:/home/bamboo/.rvm/gems/ruby-2.3.0@global
bamboo_planKey=SCD-K8S110BMASTER
bamboo_planRepository_username=spring-buildmaster
bamboo_JDK8_HOME=/opt/jdk-8
NLSPATH=/usr/dt/lib/nls/msg/%L/%N.cat
bamboo_repository_268501035_revision_number=06daa0323f66be96223f2bae377726091e7b5fd3
bamboo_repository_268501035_git_branch=master
bamboo_planRepository_1_branchName=master
bamboo_dependency_parent_0=SCD-SCDDK8S110-39
bamboo_sonar_version=5.6.3
XDG_DATA_DIRS=/usr/local/share:/usr/share:/var/lib/snapd/desktop
bamboo_dependency_parent_total=1
bamboo_resultsUrl=https://build.spring.io/browse/SCD-K8S110BMASTER-JOB1-381
bamboo_build_working_directory=/opt/bamboo-home/xml-data/build-dir/SCD-K8S110BMASTER-JOB1
bamboo_planRepository_1_name=Git
bamboo_capability_system_os=ubuntu1604
bamboo_nexusPush_stagingProfile=buildmaster
bamboo_shortPlanName=Server - Kubernetes 1.10 - Master
MAIL=/var/mail/bamboo
bamboo_planRepository_name=Git
LOGNAME=bamboo
bamboo_buildNumber=381
rvm_user_install_flag=1
SHELL=/bin/bash
bamboo_planName=Spring Cloud Data Flow - Server - Kubernetes 1.10 - Master
bamboo_JDK7_HOME=/opt/jdk-7
bamboo_shortPlanKey=K8S110BMASTER
OLDPWD=/opt/users/bamboo
GEM_HOME=/home/bamboo/.rvm/gems/ruby-2.3.0
bamboo_shortJobKey=JOB1
bamboo_artifactory_password=********
bamboo_buildTimeStamp=2018-12-19T21:22:32.215Z
bamboo_repository_previous_revision_number=06daa0323f66be96223f2bae377726091e7b5fd3
RUBY_VERSION=ruby-2.3.0
bamboo_repository_268501035_name=Git
bamboo_sonar_username=buildmaster
_system_name=Ubuntu
bamboo_********_password=********
bamboo_repository_git_branch=master
bamboo_buildResultKey=SCD-K8S110BMASTER-JOB1-381
bamboo_nexusPush_close=true
bamboo_buildPlanName=Spring Cloud Data Flow - Server - Kubernetes 1.10 - Master - Build Spring Cloud Dataflow Kubernetes Server
bamboo_planRepository_1_revision=06daa0323f66be96223f2bae377726091e7b5fd3
_system_arch=x86_64
bamboo_repository_name=Git
rvm_bin_path=/home/bamboo/.rvm/bin
bamboo_signing_key_password=********
KUBERNETES_AUTH_BASIC_USERNAME=admin
XFILESEARCHPATH=/usr/dt/app-defaults/%L/Dt
rvm_prefix=/home/bamboo
LANG=en_US.UTF-8
bamboo_buildFailed=false
bamboo_capability_system_docker_executable=/usr/bin/docker
DISPLAY=:0
bamboo_capability_system_builder_groovy_Groovy_2_4=/opt/groovy-2.4
bamboo_capability_system_builder_command_Bash=/bin/bash
bamboo_artifactory_password_mask_a=********
bamboo_agentWorkingDirectory=/opt/bamboo-home/xml-data/build-dir
bamboo_capability_system_git_executable=/usr/bin/git
bamboo_repository_git_username=spring-buildmaster
bamboo_planRepository_1_previousRevision=06daa0323f66be96223f2bae377726091e7b5fd3
bamboo_capability_os_family=unix
NVM_NODEJS_ORG_MIRROR=http://nodejs.org/dist
bamboo_planRepository_branchDisplayName=master
KUBERNETES_CERTS_CA_DATA=LS0tLS1CRUdJTiBDRVJUSUZJQ0FURS0tLS0tCk1JSURERENDQWZTZ0F3SUJBZ0lSQUlSVDh0YXQ5TUNCT2dvWjc4cGEydVV3RFFZSktvWklodmNOQVFFTEJRQXcKTHpFdE1Dc0dBMVVFQXhNa05ESmhOREZqTXpVdFpqWmpaaTAwT1RBekxXRTJNRE10TlRnMk9XWTFaV05oTmpBMQpNQjRYRFRFNE1EVXlNakUxTURFek1sb1hEVEl6TURVeU1URTJNREV6TWxvd0x6RXRNQ3NHQTFVRUF4TWtOREpoCk5ERmpNelV0WmpaalppMDBPVEF6TFdFMk1ETXROVGcyT1dZMVpXTmhOakExTUlJQklqQU5CZ2txaGtpRzl3MEIKQVFFRkFBT0NBUThBTUlJQkNnS0NBUUVBbFg0SCsxWCtUb01qL0xZbkJFLytrcG4rSWpFSE4xUGJUSE1TaC81egpEZE9PN2RXN3J0ZVpDeDluRUdjeHkwTnd2ekRyS0pNL2ZmOFJiN0ZpUUNrTEE2RXR3Z2EvZDd6TStUOWx2R3FUCkN5cXliNlIxaXlEakRuamZiZWlTbk5vN1N2eWgwL1FoWnE1V0NIOUlXV0Fid2VkQVRMeGM4UlJ3TFBidjlldTMKbXQ2VkZHOG8rNGpFS0ZEalY4NDA0a0kra2VmaStvSjRFbFRMUVhmRXRoaXFqTmw2bXRqNFE0emF5VDcvWDA3TgpZUnRvUFdKbjRmY21NcmQ2NXpmL251N1lkczJrSEliMVhUY2kyU01VSUh6SE9HdWx5K0hxcC8zbFNxLzU0Y2I3CmpSTUlwbU45dlZKRUo3R2ZRcmtOMGdISmZRaHZXSjN6aWdOWnp3MHZLcncwNXdJREFRQUJveU13SVRBT0JnTlYKSFE4QkFmOEVCQU1DQWdRd0R3WURWUjBUQVFIL0JBVXdBd0VCL3pBTkJna3Foa2lHOXcwQkFRc0ZBQU9DQVFFQQpCWXJVQkh2VkxoTW1XZUY0ZlBHZmVreHgrWmVyV3VxdnV3SDhBcklVRy9GYzdnL3JBenJodWd3RTZsWGU0bEJyCjZVRFVPOW5pa2hmcGpVeFhMY3RvNG5lZGZYUUNQcnBGVkVsMzZZWG1EZkdUUmVUVUdlZ2lrZ253U2wvNHAwM0EKL1ZleENZc2FOTXEzY3lMMFlZN29oUXRiNTg2OGFicytvTmt5YUdBRzRobG82MlE4L1d3NDJNZzhkTVZQUEZnYgpyemVVRnJvM0JxVEtXMG1FaVNsTkpKLzdIQ3NIQTFXbE5KRG1xbm84ZStrMVQ0bkhPVzREQTVnR1VzUnE5SHZSClhrZzJOaXE3YWVaSTltVkd5d1pjejlhK3dQSm1wblM3TDlpK3pjU2R5S0JZRThuSU5XdDg3allWSTdjeVpWOUkKaG9ySFI0cE4rNFdsNU1sdjN0QndYQT09Ci0tLS0tRU5EIENFUlRJRklDQVRFLS0tLS0K
NODE_PATH=/usr/lib/nodejs:/usr/lib/node_modules:/usr/share/javascript
bamboo_capability_system_builder_maven_Artifactory_Maven_3_5=/opt/maven-3.5
GIT_SSL_NO_VERIFY=true
bamboo_capability_system_builder_maven_Artifactory_Maven_3_3=/opt/maven-3.3
NVM_DIR=/home/bamboo/.nvm
bamboo_capability_system_builder_maven_Artifactory_Maven_3_2=/opt/maven-3.2
bamboo_s3_properties=/home/bamboo/tools/s3.properties
bamboo_capability_system_builder_maven_Artifactory_Maven_3_1=/opt/maven-3.1
bamboo_capability_system_builder_maven_Artifactory_Maven_3_0=/opt/maven-3.0
_system_type=Linux
bamboo_plan_storageTag=plan-268238945
_system_version=16.04
USER=bamboo
bamboo_repository_git_repositoryUrl=https://github.com/spring-cloud/spring-cloud-dataflow-server-kubernetes.git
bamboo_working_directory=/opt/bamboo-home/xml-data/build-dir/SCD-K8S110BMASTER-JOB1
bamboo_org_jfrog_bamboo_buildInfo_activated=true
bamboo_planRepository_1_repositoryUrl=https://github.com/spring-cloud/spring-cloud-dataflow-server-kubernetes.git
bamboo_capability_system_jdk_JDK_1_8=/opt/jdk-8
bamboo_capability_system_jdk_JDK_1_9=/opt/jdk-9
WRAPPER_ARCH=x86
bamboo_capability_system_jdk_JDK_1_6=/opt/jdk-6
bamboo_capability_system_jdk_JDK_1_7=/opt/jdk-7
bamboo_sonar_ip=10.194.6.9
XDG_RUNTIME_DIR=/run/user/505
HOME=/home/bamboo
PATH=/bin:/home/bamboo/.rvm/gems/ruby-2.3.0/bin:/home/bamboo/.rvm/gems/ruby-2.3.0@global/bin:/home/bamboo/.rvm/rubies/ruby-2.3.0/bin:/home/bamboo/bin:/usr/local/bin:/usr/bin:/bin:/usr/local/games:/usr/games:/snap/bin:/home/bamboo/bin:/usr/local/bin:/opt/ec2-api-tools/bin:/home/bamboo/.rvm/bin:/bin:/home/bamboo/.rvm/gems/ruby-2.3.0/bin:/home/bamboo/.rvm/gems/ruby-2.3.0@global/bin:/home/bamboo/.rvm/rubies/ruby-2.3.0/bin:/home/bamboo/bin:/usr/local/bin:/usr/bin:/bin:/usr/local/games:/usr/games:/snap/bin:/home/bamboo/bin:/usr/local/bin:/opt/ec2-api-tools/bin:/home/bamboo/.rvm/bin
19-Dec-2018 21:22:37 [INFO] Scanning for projects...
19-Dec-2018 21:22:37 [INFO] Downloading: http://repo.spring.io/libs-snapshot-local/org/springframework/cloud/spring-cloud-dataflow-parent/2.0.0.BUILD-SNAPSHOT/maven-metadata.xml
19-Dec-2018 21:22:38 [INFO] Downloaded: http://repo.spring.io/libs-snapshot-local/org/springframework/cloud/spring-cloud-dataflow-parent/2.0.0.BUILD-SNAPSHOT/maven-metadata.xml (646 B at 2.9 kB/s)
19-Dec-2018 21:22:38 [INFO] Downloading: http://repo.spring.io/libs-snapshot-local/org/springframework/cloud/spring-cloud-task-dependencies/2.1.0.BUILD-SNAPSHOT/maven-metadata.xml
19-Dec-2018 21:22:38 [INFO] Downloaded: http://repo.spring.io/libs-snapshot-local/org/springframework/cloud/spring-cloud-task-dependencies/2.1.0.BUILD-SNAPSHOT/maven-metadata.xml (646 B at 4.1 kB/s)
19-Dec-2018 21:22:38 [INFO] Downloading: http://repo.spring.io/libs-snapshot-local/org/springframework/cloud/spring-cloud-dataflow-dependencies/2.0.0.BUILD-SNAPSHOT/maven-metadata.xml
19-Dec-2018 21:22:38 [INFO] Downloaded: http://repo.spring.io/libs-snapshot-local/org/springframework/cloud/spring-cloud-dataflow-dependencies/2.0.0.BUILD-SNAPSHOT/maven-metadata.xml (652 B at 3.9 kB/s)
19-Dec-2018 21:22:38 [INFO] Initializing Artifactory Build-Info Recording
19-Dec-2018 21:22:38 [INFO] ------------------------------------------------------------------------
19-Dec-2018 21:22:38 [INFO] Reactor Build Order:
19-Dec-2018 21:22:38 [INFO]
19-Dec-2018 21:22:38 [INFO] spring-cloud-dataflow-server-kubernetes-parent
19-Dec-2018 21:22:38 [INFO] spring-cloud-dataflow-server-kubernetes-autoconfig
19-Dec-2018 21:22:38 [INFO] Kubernetes Data Flow Server
19-Dec-2018 21:22:38 [INFO] spring-cloud-dataflow-server-kubernetes-docs
19-Dec-2018 21:22:38 [INFO]
19-Dec-2018 21:22:38 [INFO] ------------------------------------------------------------------------
19-Dec-2018 21:22:38 [INFO] Building spring-cloud-dataflow-server-kubernetes-parent 2.0.0.BUILD-SNAPSHOT
19-Dec-2018 21:22:38 [INFO] ------------------------------------------------------------------------
19-Dec-2018 21:22:38 [INFO]
19-Dec-2018 21:22:38 [INFO] --- maven-clean-plugin:2.5:clean (default-clean) @ spring-cloud-dataflow-server-kubernetes-parent ---
19-Dec-2018 21:22:39 [INFO]
19-Dec-2018 21:22:39 [INFO] --- maven-checkstyle-plugin:2.17:check (checkstyle-validation) @ spring-cloud-dataflow-server-kubernetes-parent ---
19-Dec-2018 21:22:39 [INFO] Starting audit...
19-Dec-2018 21:22:39 Audit done.
19-Dec-2018 21:22:39 [INFO]
19-Dec-2018 21:22:39 [INFO] --- jacoco-maven-plugin:0.7.9:prepare-agent (agent) @ spring-cloud-dataflow-server-kubernetes-parent ---
19-Dec-2018 21:22:39 [INFO] argLine set to -javaagent:/home/bamboo/.m2/repository/org/jacoco/org.jacoco.agent/0.7.9/org.jacoco.agent-0.7.9-runtime.jar=destfile=/opt/bamboo-home/xml-data/build-dir/SCD-K8S110BMASTER-JOB1/target/jacoco.exec
19-Dec-2018 21:22:39 [INFO]
19-Dec-2018 21:22:39 [INFO] --- jacoco-maven-plugin:0.7.9:report (report) @ spring-cloud-dataflow-server-kubernetes-parent ---
19-Dec-2018 21:22:39 [INFO] Skipping JaCoCo execution due to missing execution data file.
19-Dec-2018 21:22:39 [INFO]
19-Dec-2018 21:22:39 [INFO] --- maven-javadoc-plugin:3.0.1:jar (attach-javadocs) @ spring-cloud-dataflow-server-kubernetes-parent ---
19-Dec-2018 21:22:40 [INFO] Not executing Javadoc as the project is not a Java classpath-capable package
19-Dec-2018 21:22:40 [INFO]
19-Dec-2018 21:22:40 [INFO] --- maven-javadoc-plugin:3.0.1:jar (javadoc) @ spring-cloud-dataflow-server-kubernetes-parent ---
19-Dec-2018 21:22:40 [INFO] Not executing Javadoc as the project is not a Java classpath-capable package
19-Dec-2018 21:22:40 [INFO]
19-Dec-2018 21:22:40 [INFO] >>> maven-source-plugin:3.0.1:jar (attach-sources) > generate-sources @ spring-cloud-dataflow-server-kubernetes-parent >>>
19-Dec-2018 21:22:40 [INFO]
19-Dec-2018 21:22:40 [INFO] --- maven-checkstyle-plugin:2.17:check (checkstyle-validation) @ spring-cloud-dataflow-server-kubernetes-parent ---
19-Dec-2018 21:22:40 [INFO] Starting audit...
19-Dec-2018 21:22:40 Audit done.
19-Dec-2018 21:22:40 [INFO]
19-Dec-2018 21:22:40 [INFO] --- jacoco-maven-plugin:0.7.9:prepare-agent (agent) @ spring-cloud-dataflow-server-kubernetes-parent ---
19-Dec-2018 21:22:40 [INFO] argLine set to -javaagent:/home/bamboo/.m2/repository/org/jacoco/org.jacoco.agent/0.7.9/org.jacoco.agent-0.7.9-runtime.jar=destfile=/opt/bamboo-home/xml-data/build-dir/SCD-K8S110BMASTER-JOB1/target/jacoco.exec
19-Dec-2018 21:22:40 [INFO]
19-Dec-2018 21:22:40 [INFO] <<< maven-source-plugin:3.0.1:jar (attach-sources) < generate-sources @ spring-cloud-dataflow-server-kubernetes-parent <<<
19-Dec-2018 21:22:40 [INFO]
19-Dec-2018 21:22:40 [INFO]
19-Dec-2018 21:22:40 [INFO] --- maven-source-plugin:3.0.1:jar (attach-sources) @ spring-cloud-dataflow-server-kubernetes-parent ---
19-Dec-2018 21:22:40 [INFO]
19-Dec-2018 21:22:40 [INFO] --- maven-install-plugin:2.4:install (default-install) @ spring-cloud-dataflow-server-kubernetes-parent ---
19-Dec-2018 21:22:40 [INFO] Installing /opt/bamboo-home/xml-data/build-dir/SCD-K8S110BMASTER-JOB1/pom.xml to /home/bamboo/.m2/repository/org/springframework/cloud/spring-cloud-dataflow-server-kubernetes-parent/2.0.0.BUILD-SNAPSHOT/spring-cloud-dataflow-server-kubernetes-parent-2.0.0.BUILD-SNAPSHOT.pom
19-Dec-2018 21:22:40 [INFO]
19-Dec-2018 21:22:40 [INFO] ------------------------------------------------------------------------
19-Dec-2018 21:22:40 [INFO] Building spring-cloud-dataflow-server-kubernetes-autoconfig 2.0.0.BUILD-SNAPSHOT
19-Dec-2018 21:22:40 [INFO] ------------------------------------------------------------------------
19-Dec-2018 21:22:40 [INFO] Downloading: http://repo.spring.io/libs-snapshot-local/org/springframework/cloud/spring-cloud-deployer-kubernetes/2.0.0.BUILD-SNAPSHOT/maven-metadata.xml
19-Dec-2018 21:22:40 [INFO] Downloaded: http://repo.spring.io/libs-snapshot-local/org/springframework/cloud/spring-cloud-deployer-kubernetes/2.0.0.BUILD-SNAPSHOT/maven-metadata.xml (1.3 kB at 8.1 kB/s)
19-Dec-2018 21:22:40 [INFO] Downloading: http://repo.spring.io/libs-snapshot-local/org/springframework/cloud/spring-cloud-deployer-kubernetes/2.0.0.BUILD-SNAPSHOT/spring-cloud-deployer-kubernetes-2.0.0.BUILD-20181219.205904-3.pom
19-Dec-2018 21:22:40 [INFO] Downloaded: http://repo.spring.io/libs-snapshot-local/org/springframework/cloud/spring-cloud-deployer-kubernetes/2.0.0.BUILD-SNAPSHOT/spring-cloud-deployer-kubernetes-2.0.0.BUILD-20181219.205904-3.pom (5.2 kB at 24 kB/s)
19-Dec-2018 21:22:40 [INFO] Downloading: http://repo.spring.io/libs-snapshot-local/org/springframework/cloud/spring-cloud-dataflow-server-core/2.0.0.BUILD-SNAPSHOT/maven-metadata.xml
19-Dec-2018 21:22:41 [INFO] Downloaded: http://repo.spring.io/libs-snapshot-local/org/springframework/cloud/spring-cloud-dataflow-server-core/2.0.0.BUILD-SNAPSHOT/maven-metadata.xml (1.3 kB at 8.1 kB/s)
19-Dec-2018 21:22:41 [INFO] Downloading: http://repo.spring.io/libs-snapshot-local/org/springframework/cloud/spring-cloud-dataflow-configuration-metadata/2.0.0.BUILD-SNAPSHOT/maven-metadata.xml
19-Dec-2018 21:22:41 [INFO] Downloaded: http://repo.spring.io/libs-snapshot-local/org/springframework/cloud/spring-cloud-dataflow-configuration-metadata/2.0.0.BUILD-SNAPSHOT/maven-metadata.xml (1.3 kB at 8.2 kB/s)
19-Dec-2018 21:22:41 [INFO] Downloading: http://repo.spring.io/libs-snapshot-local/org/springframework/cloud/spring-cloud-dataflow-completion/2.0.0.BUILD-SNAPSHOT/maven-metadata.xml
19-Dec-2018 21:22:41 [INFO] Downloaded: http://repo.spring.io/libs-snapshot-local/org/springframework/cloud/spring-cloud-dataflow-completion/2.0.0.BUILD-SNAPSHOT/maven-metadata.xml (1.3 kB at 8.2 kB/s)
19-Dec-2018 21:22:41 [INFO] Downloading: http://repo.spring.io/libs-snapshot-local/org/springframework/cloud/spring-cloud-dataflow-core/2.0.0.BUILD-SNAPSHOT/maven-metadata.xml
19-Dec-2018 21:22:41 [INFO] Downloaded: http://repo.spring.io/libs-snapshot-local/org/springframework/cloud/spring-cloud-dataflow-core/2.0.0.BUILD-SNAPSHOT/maven-metadata.xml (1.3 kB at 8.0 kB/s)
19-Dec-2018 21:22:41 [INFO] Downloading: http://repo.spring.io/libs-snapshot-local/org/springframework/cloud/spring-cloud-dataflow-registry/2.0.0.BUILD-SNAPSHOT/maven-metadata.xml
19-Dec-2018 21:22:41 [INFO] Downloaded: http://repo.spring.io/libs-snapshot-local/org/springframework/cloud/spring-cloud-dataflow-registry/2.0.0.BUILD-SNAPSHOT/maven-metadata.xml (1.3 kB at 8.2 kB/s)
19-Dec-2018 21:22:41 [INFO] Downloading: http://repo.spring.io/libs-snapshot-local/org/springframework/cloud/spring-cloud-dataflow-rest-resource/2.0.0.BUILD-SNAPSHOT/maven-metadata.xml
19-Dec-2018 21:22:41 [INFO] Downloaded: http://repo.spring.io/libs-snapshot-local/org/springframework/cloud/spring-cloud-dataflow-rest-resource/2.0.0.BUILD-SNAPSHOT/maven-metadata.xml (1.3 kB at 8.1 kB/s)
19-Dec-2018 21:22:41 [INFO] Downloading: http://repo.spring.io/libs-snapshot-local/org/springframework/cloud/spring-cloud-task-core/2.1.0.BUILD-SNAPSHOT/maven-metadata.xml
19-Dec-2018 21:22:42 [INFO] Downloaded: http://repo.spring.io/libs-snapshot-local/org/springframework/cloud/spring-cloud-task-core/2.1.0.BUILD-SNAPSHOT/maven-metadata.xml (1.3 kB at 8.1 kB/s)
19-Dec-2018 21:22:42 [INFO] Downloading: http://repo.spring.io/libs-snapshot-local/org/springframework/cloud/spring-cloud-task-parent/2.1.0.BUILD-SNAPSHOT/maven-metadata.xml
19-Dec-2018 21:22:42 [INFO] Downloaded: http://repo.spring.io/libs-snapshot-local/org/springframework/cloud/spring-cloud-task-parent/2.1.0.BUILD-SNAPSHOT/maven-metadata.xml (640 B at 4.1 kB/s)
19-Dec-2018 21:22:42 [INFO] Downloading: http://repo.spring.io/libs-snapshot-local/org/springframework/cloud/spring-cloud-skipper/2.0.0.BUILD-SNAPSHOT/maven-metadata.xml
19-Dec-2018 21:22:42 [INFO] Downloaded: http://repo.spring.io/libs-snapshot-local/org/springframework/cloud/spring-cloud-skipper/2.0.0.BUILD-SNAPSHOT/maven-metadata.xml (1.3 kB at 8.0 kB/s)
19-Dec-2018 21:22:42 [INFO] Downloading: http://repo.spring.io/libs-snapshot-local/org/springframework/cloud/spring-cloud-skipper/2.0.0.BUILD-SNAPSHOT/spring-cloud-skipper-2.0.0.BUILD-20181219.204954-37.pom
19-Dec-2018 21:22:42 [INFO] Downloaded: http://repo.spring.io/libs-snapshot-local/org/springframework/cloud/spring-cloud-skipper/2.0.0.BUILD-SNAPSHOT/spring-cloud-skipper-2.0.0.BUILD-20181219.204954-37.pom (2.9 kB at 18 kB/s)
19-Dec-2018 21:22:42 [INFO] Downloading: http://repo.spring.io/libs-snapshot-local/org/springframework/cloud/spring-cloud-skipper-parent/2.0.0.BUILD-SNAPSHOT/maven-metadata.xml
19-Dec-2018 21:22:42 [INFO] Downloaded: http://repo.spring.io/libs-snapshot-local/org/springframework/cloud/spring-cloud-skipper-parent/2.0.0.BUILD-SNAPSHOT/maven-metadata.xml (643 B at 3.2 kB/s)
19-Dec-2018 21:22:42 [INFO] Downloading: http://repo.spring.io/libs-snapshot-local/org/springframework/cloud/spring-cloud-skipper-parent/2.0.0.BUILD-SNAPSHOT/spring-cloud-skipper-parent-2.0.0.BUILD-20181219.204954-37.pom
19-Dec-2018 21:22:42 [INFO] Downloaded: http://repo.spring.io/libs-snapshot-local/org/springframework/cloud/spring-cloud-skipper-parent/2.0.0.BUILD-SNAPSHOT/spring-cloud-skipper-parent-2.0.0.BUILD-20181219.204954-37.pom (21 kB at 130 kB/s)
19-Dec-2018 21:22:43 [INFO] Downloading: http://repo.spring.io/libs-snapshot-local/org/springframework/cloud/spring-cloud-dataflow-ui/2.0.0.BUILD-SNAPSHOT/maven-metadata.xml
19-Dec-2018 21:22:43 [INFO] Downloaded: http://repo.spring.io/libs-snapshot-local/org/springframework/cloud/spring-cloud-dataflow-ui/2.0.0.BUILD-SNAPSHOT/maven-metadata.xml (820 B at 5.3 kB/s)
19-Dec-2018 21:22:43 [INFO] Downloading: http://repo.spring.io/libs-snapshot-local/org/springframework/cloud/spring-cloud-skipper-client/2.0.0.BUILD-SNAPSHOT/maven-metadata.xml
19-Dec-2018 21:22:43 [INFO] Downloaded: http://repo.spring.io/libs-snapshot-local/org/springframework/cloud/spring-cloud-skipper-client/2.0.0.BUILD-SNAPSHOT/maven-metadata.xml (1.3 kB at 8.2 kB/s)
19-Dec-2018 21:22:43 [INFO] Downloading: http://repo.spring.io/libs-snapshot-local/org/springframework/cloud/spring-cloud-skipper-client/2.0.0.BUILD-SNAPSHOT/spring-cloud-skipper-client-2.0.0.BUILD-20181219.204954-37.pom
19-Dec-2018 21:22:43 [INFO] Downloaded: http://repo.spring.io/libs-snapshot-local/org/springframework/cloud/spring-cloud-skipper-client/2.0.0.BUILD-SNAPSHOT/spring-cloud-skipper-client-2.0.0.BUILD-20181219.204954-37.pom (1.8 kB at 12 kB/s)
19-Dec-2018 21:22:43 [INFO] Downloading: http://repo.spring.io/libs-snapshot-local/org/springframework/cloud/spring-cloud-scheduler-kubernetes/1.1.0.BUILD-SNAPSHOT/maven-metadata.xml
19-Dec-2018 21:22:43 [INFO] Downloaded: http://repo.spring.io/libs-snapshot-local/org/springframework/cloud/spring-cloud-scheduler-kubernetes/1.1.0.BUILD-SNAPSHOT/maven-metadata.xml (1.3 kB at 8.1 kB/s)
19-Dec-2018 21:22:43 [INFO] Downloading: http://repo.spring.io/libs-snapshot-local/org/springframework/cloud/spring-cloud-skipper-client/2.0.0.BUILD-SNAPSHOT/spring-cloud-skipper-client-2.0.0.BUILD-20181219.204954-37.jar
19-Dec-2018 21:22:43 [INFO] Downloading: http://repo.spring.io/libs-snapshot-local/org/springframework/cloud/spring-cloud-deployer-kubernetes/2.0.0.BUILD-SNAPSHOT/spring-cloud-deployer-kubernetes-2.0.0.BUILD-20181219.205904-3.jar
19-Dec-2018 21:22:43 [INFO] Downloading: http://repo.spring.io/libs-snapshot-local/org/springframework/cloud/spring-cloud-skipper/2.0.0.BUILD-SNAPSHOT/spring-cloud-skipper-2.0.0.BUILD-20181219.204954-37.jar
19-Dec-2018 21:22:44 [INFO] Downloaded: http://repo.spring.io/libs-snapshot-local/org/springframework/cloud/spring-cloud-skipper-client/2.0.0.BUILD-SNAPSHOT/spring-cloud-skipper-client-2.0.0.BUILD-20181219.204954-37.jar (32 kB at 156 kB/s)
19-Dec-2018 21:22:44 [INFO] Downloaded: http://repo.spring.io/libs-snapshot-local/org/springframework/cloud/spring-cloud-skipper/2.0.0.BUILD-SNAPSHOT/spring-cloud-skipper-2.0.0.BUILD-20181219.204954-37.jar (104 kB at 351 kB/s)
19-Dec-2018 21:22:44 [INFO] Downloaded: http://repo.spring.io/libs-snapshot-local/org/springframework/cloud/spring-cloud-deployer-kubernetes/2.0.0.BUILD-SNAPSHOT/spring-cloud-deployer-kubernetes-2.0.0.BUILD-20181219.205904-3.jar (82 kB at 270 kB/s)
19-Dec-2018 21:22:44 [INFO]
19-Dec-2018 21:22:44 [INFO] --- maven-clean-plugin:2.5:clean (default-clean) @ spring-cloud-dataflow-server-kubernetes-autoconfig ---
19-Dec-2018 21:22:44 [INFO]
19-Dec-2018 21:22:44 [INFO] --- maven-checkstyle-plugin:2.17:check (checkstyle-validation) @ spring-cloud-dataflow-server-kubernetes-autoconfig ---
19-Dec-2018 21:22:44 [INFO] Starting audit...
19-Dec-2018 21:22:44 Audit done.
19-Dec-2018 21:22:44 [INFO]
19-Dec-2018 21:22:44 [INFO] --- jacoco-maven-plugin:0.7.9:prepare-agent (agent) @ spring-cloud-dataflow-server-kubernetes-autoconfig ---
19-Dec-2018 21:22:44 [INFO] argLine set to -javaagent:/home/bamboo/.m2/repository/org/jacoco/org.jacoco.agent/0.7.9/org.jacoco.agent-0.7.9-runtime.jar=destfile=/opt/bamboo-home/xml-data/build-dir/SCD-K8S110BMASTER-JOB1/spring-cloud-dataflow-server-kubernetes-autoconfig/target/jacoco.exec
19-Dec-2018 21:22:44 [INFO]
19-Dec-2018 21:22:44 [INFO] --- maven-resources-plugin:3.1.0:resources (default-resources) @ spring-cloud-dataflow-server-kubernetes-autoconfig ---
19-Dec-2018 21:22:44 [INFO] Using 'UTF-8' encoding to copy filtered resources.
19-Dec-2018 21:22:44 [INFO] Copying 1 resource
19-Dec-2018 21:22:44 [INFO]
19-Dec-2018 21:22:44 [INFO] --- maven-compiler-plugin:3.8.0:compile (default-compile) @ spring-cloud-dataflow-server-kubernetes-autoconfig ---
19-Dec-2018 21:22:44 [INFO] Changes detected - recompiling the module!
19-Dec-2018 21:22:44 [INFO] Compiling 2 source files to /opt/bamboo-home/xml-data/build-dir/SCD-K8S110BMASTER-JOB1/spring-cloud-dataflow-server-kubernetes-autoconfig/target/classes
19-Dec-2018 21:22:45 [INFO]
19-Dec-2018 21:22:45 [INFO] --- maven-resources-plugin:3.1.0:testResources (default-testResources) @ spring-cloud-dataflow-server-kubernetes-autoconfig ---
19-Dec-2018 21:22:45 [INFO] Using 'UTF-8' encoding to copy filtered resources.
19-Dec-2018 21:22:45 [INFO] skip non existing resourceDirectory /opt/bamboo-home/xml-data/build-dir/SCD-K8S110BMASTER-JOB1/spring-cloud-dataflow-server-kubernetes-autoconfig/src/test/resources
19-Dec-2018 21:22:45 [INFO]
19-Dec-2018 21:22:45 [INFO] --- maven-compiler-plugin:3.8.0:testCompile (default-testCompile) @ spring-cloud-dataflow-server-kubernetes-autoconfig ---
19-Dec-2018 21:22:45 [INFO] No sources to compile
19-Dec-2018 21:22:45 [INFO]
19-Dec-2018 21:22:45 [INFO] --- maven-surefire-plugin:2.22.0:test (default-test) @ spring-cloud-dataflow-server-kubernetes-autoconfig ---
19-Dec-2018 21:22:45 [INFO] No tests to run.
19-Dec-2018 21:22:45 [INFO]
19-Dec-2018 21:22:45 [INFO] --- jacoco-maven-plugin:0.7.9:report (report) @ spring-cloud-dataflow-server-kubernetes-autoconfig ---
19-Dec-2018 21:22:45 [INFO] Skipping JaCoCo execution due to missing execution data file.
19-Dec-2018 21:22:45 [INFO]
19-Dec-2018 21:22:45 [INFO] --- maven-jar-plugin:3.0.2:jar (default-jar) @ spring-cloud-dataflow-server-kubernetes-autoconfig ---
19-Dec-2018 21:22:45 [INFO] Building jar: /opt/bamboo-home/xml-data/build-dir/SCD-K8S110BMASTER-JOB1/spring-cloud-dataflow-server-kubernetes-autoconfig/target/spring-cloud-dataflow-server-kubernetes-autoconfig-2.0.0.BUILD-SNAPSHOT.jar
19-Dec-2018 21:22:45 [INFO]
19-Dec-2018 21:22:45 [INFO] --- maven-javadoc-plugin:3.0.1:jar (attach-javadocs) @ spring-cloud-dataflow-server-kubernetes-autoconfig ---
19-Dec-2018 21:22:46 [INFO]
19-Dec-2018 21:22:46 1 error
19-Dec-2018 21:22:46 [ERROR] MavenReportException: Error while generating Javadoc:
19-Dec-2018 21:22:46 Exit code: 1 - /opt/bamboo-home/xml-data/build-dir/SCD-K8S110BMASTER-JOB1/spring-cloud-dataflow-server-kubernetes-autoconfig/src/main/java/org/springframework/cloud/dataflow/server/kubernetes/config/KubernetesDataFlowServerAutoConfiguration.java:33: error: reference not found
19-Dec-2018 21:22:46 * AutoConfiguration for the {@link KubernetesDataFlowServer}
19-Dec-2018 21:22:46                                     ^
19-Dec-2018 21:22:46
19-Dec-2018 21:22:46 Command line was: /opt/jdk1.8.0_144/jre/../bin/javadoc @options @packages
19-Dec-2018 21:22:46
19-Dec-2018 21:22:46 Refer to the generated Javadoc files in '/opt/bamboo-home/xml-data/build-dir/SCD-K8S110BMASTER-JOB1/spring-cloud-dataflow-server-kubernetes-autoconfig/target/apidocs' dir.
19-Dec-2018 21:22:46
19-Dec-2018 21:22:46 org.apache.maven.reporting.MavenReportException:
19-Dec-2018 21:22:46 Exit code: 1 - /opt/bamboo-home/xml-data/build-dir/SCD-K8S110BMASTER-JOB1/spring-cloud-dataflow-server-kubernetes-autoconfig/src/main/java/org/springframework/cloud/dataflow/server/kubernetes/config/KubernetesDataFlowServerAutoConfiguration.java:33: error: reference not found
19-Dec-2018 21:22:46 * AutoConfiguration for the {@link KubernetesDataFlowServer}
19-Dec-2018 21:22:46                                     ^
19-Dec-2018 21:22:46
19-Dec-2018 21:22:46 Command line was: /opt/jdk1.8.0_144/jre/../bin/javadoc @options @packages
19-Dec-2018 21:22:46
19-Dec-2018 21:22:46 Refer to the generated Javadoc files in '/opt/bamboo-home/xml-data/build-dir/SCD-K8S110BMASTER-JOB1/spring-cloud-dataflow-server-kubernetes-autoconfig/target/apidocs' dir.
19-Dec-2018 21:22:46
19-Dec-2018 21:22:46         at org.apache.maven.plugins.javadoc.AbstractJavadocMojo.executeJavadocCommandLine(AbstractJavadocMojo.java:5298)
19-Dec-2018 21:22:46         at org.apache.maven.plugins.javadoc.AbstractJavadocMojo.executeReport(AbstractJavadocMojo.java:2134)
19-Dec-2018 21:22:46         at org.apache.maven.plugins.javadoc.JavadocJar.doExecute(JavadocJar.java:190)
19-Dec-2018 21:22:46         at org.apache.maven.plugins.javadoc.AbstractJavadocMojo.execute(AbstractJavadocMojo.java:1912)
19-Dec-2018 21:22:46         at org.apache.maven.plugin.DefaultBuildPluginManager.executeMojo(DefaultBuildPluginManager.java:134)
19-Dec-2018 21:22:46         at org.apache.maven.lifecycle.internal.MojoExecutor.execute(MojoExecutor.java:208)
19-Dec-2018 21:22:46         at org.apache.maven.lifecycle.internal.MojoExecutor.execute(MojoExecutor.java:154)
19-Dec-2018 21:22:46         at org.apache.maven.lifecycle.internal.MojoExecutor.execute(MojoExecutor.java:146)
19-Dec-2018 21:22:46         at org.apache.maven.lifecycle.internal.LifecycleModuleBuilder.buildProject(LifecycleModuleBuilder.java:117)
19-Dec-2018 21:22:46         at org.apache.maven.lifecycle.internal.LifecycleModuleBuilder.buildProject(LifecycleModuleBuilder.java:81)
19-Dec-2018 21:22:46         at org.apache.maven.lifecycle.internal.builder.singlethreaded.SingleThreadedBuilder.build(SingleThreadedBuilder.java:51)
19-Dec-2018 21:22:46         at org.apache.maven.lifecycle.internal.LifecycleStarter.execute(LifecycleStarter.java:128)
19-Dec-2018 21:22:46         at org.apache.maven.DefaultMaven.doExecute(DefaultMaven.java:309)
19-Dec-2018 21:22:46         at org.apache.maven.DefaultMaven.doExecute(DefaultMaven.java:194)
19-Dec-2018 21:22:46         at org.apache.maven.DefaultMaven.execute(DefaultMaven.java:107)
19-Dec-2018 21:22:46         at org.apache.maven.cli.MavenCli.execute(MavenCli.java:993)
19-Dec-2018 21:22:46         at org.apache.maven.cli.MavenCli.doMain(MavenCli.java:345)
19-Dec-2018 21:22:46         at org.apache.maven.cli.MavenCli.main(MavenCli.java:191)
19-Dec-2018 21:22:46         at sun.reflect.NativeMethodAccessorImpl.invoke0(Native Method)
19-Dec-2018 21:22:46         at sun.reflect.NativeMethodAccessorImpl.invoke(NativeMethodAccessorImpl.java:62)
19-Dec-2018 21:22:46         at sun.reflect.DelegatingMethodAccessorImpl.invoke(DelegatingMethodAccessorImpl.java:43)
19-Dec-2018 21:22:46         at java.lang.reflect.Method.invoke(Method.java:498)
19-Dec-2018 21:22:46         at org.codehaus.plexus.classworlds.launcher.Launcher.launchEnhanced(Launcher.java:289)
19-Dec-2018 21:22:46         at org.codehaus.plexus.classworlds.launcher.Launcher.launch(Launcher.java:229)
19-Dec-2018 21:22:46         at org.codehaus.plexus.classworlds.launcher.Launcher.mainWithExitCode(Launcher.java:415)
19-Dec-2018 21:22:46         at org.codehaus.plexus.classworlds.launcher.Launcher.main(Launcher.java:356)
19-Dec-2018 21:22:46 [INFO] Building jar: /opt/bamboo-home/xml-data/build-dir/SCD-K8S110BMASTER-JOB1/spring-cloud-dataflow-server-kubernetes-autoconfig/target/spring-cloud-dataflow-server-kubernetes-autoconfig-2.0.0.BUILD-SNAPSHOT-javadoc.jar
19-Dec-2018 21:22:46 [INFO]
19-Dec-2018 21:22:46 [INFO] --- maven-javadoc-plugin:3.0.1:jar (javadoc) @ spring-cloud-dataflow-server-kubernetes-autoconfig ---
19-Dec-2018 21:22:47 [INFO]
19-Dec-2018 21:22:47 1 error
19-Dec-2018 21:22:47 [ERROR] MavenReportException: Error while generating Javadoc:
19-Dec-2018 21:22:47 Exit code: 1 - /opt/bamboo-home/xml-data/build-dir/SCD-K8S110BMASTER-JOB1/spring-cloud-dataflow-server-kubernetes-autoconfig/src/main/java/org/springframework/cloud/dataflow/server/kubernetes/config/KubernetesDataFlowServerAutoConfiguration.java:33: error: reference not found
19-Dec-2018 21:22:47 * AutoConfiguration for the {@link KubernetesDataFlowServer}
19-Dec-2018 21:22:47                                     ^
19-Dec-2018 21:22:47
19-Dec-2018 21:22:47 Command line was: /opt/jdk1.8.0_144/jre/../bin/javadoc @options @packages
19-Dec-2018 21:22:47
19-Dec-2018 21:22:47 Refer to the generated Javadoc files in '/opt/bamboo-home/xml-data/build-dir/SCD-K8S110BMASTER-JOB1/spring-cloud-dataflow-server-kubernetes-autoconfig/target/apidocs' dir.
19-Dec-2018 21:22:47
19-Dec-2018 21:22:47 org.apache.maven.reporting.MavenReportException:
19-Dec-2018 21:22:47 Exit code: 1 - /opt/bamboo-home/xml-data/build-dir/SCD-K8S110BMASTER-JOB1/spring-cloud-dataflow-server-kubernetes-autoconfig/src/main/java/org/springframework/cloud/dataflow/server/kubernetes/config/KubernetesDataFlowServerAutoConfiguration.java:33: error: reference not found
19-Dec-2018 21:22:47 * AutoConfiguration for the {@link KubernetesDataFlowServer}
19-Dec-2018 21:22:47                                     ^
19-Dec-2018 21:22:47
19-Dec-2018 21:22:47 Command line was: /opt/jdk1.8.0_144/jre/../bin/javadoc @options @packages
19-Dec-2018 21:22:47
19-Dec-2018 21:22:47 Refer to the generated Javadoc files in '/opt/bamboo-home/xml-data/build-dir/SCD-K8S110BMASTER-JOB1/spring-cloud-dataflow-server-kubernetes-autoconfig/target/apidocs' dir.
19-Dec-2018 21:22:47
19-Dec-2018 21:22:47         at org.apache.maven.plugins.javadoc.AbstractJavadocMojo.executeJavadocCommandLine(AbstractJavadocMojo.java:5298)
19-Dec-2018 21:22:47         at org.apache.maven.plugins.javadoc.AbstractJavadocMojo.executeReport(AbstractJavadocMojo.java:2134)
19-Dec-2018 21:22:47         at org.apache.maven.plugins.javadoc.JavadocJar.doExecute(JavadocJar.java:190)
19-Dec-2018 21:22:47         at org.apache.maven.plugins.javadoc.AbstractJavadocMojo.execute(AbstractJavadocMojo.java:1912)
19-Dec-2018 21:22:47         at org.apache.maven.plugin.DefaultBuildPluginManager.executeMojo(DefaultBuildPluginManager.java:134)
19-Dec-2018 21:22:47         at org.apache.maven.lifecycle.internal.MojoExecutor.execute(MojoExecutor.java:208)
19-Dec-2018 21:22:47         at org.apache.maven.lifecycle.internal.MojoExecutor.execute(MojoExecutor.java:154)
19-Dec-2018 21:22:47         at org.apache.maven.lifecycle.internal.MojoExecutor.execute(MojoExecutor.java:146)
19-Dec-2018 21:22:47         at org.apache.maven.lifecycle.internal.LifecycleModuleBuilder.buildProject(LifecycleModuleBuilder.java:117)
19-Dec-2018 21:22:47         at org.apache.maven.lifecycle.internal.LifecycleModuleBuilder.buildProject(LifecycleModuleBuilder.java:81)
19-Dec-2018 21:22:47         at org.apache.maven.lifecycle.internal.builder.singlethreaded.SingleThreadedBuilder.build(SingleThreadedBuilder.java:51)
19-Dec-2018 21:22:47         at org.apache.maven.lifecycle.internal.LifecycleStarter.execute(LifecycleStarter.java:128)
19-Dec-2018 21:22:47         at org.apache.maven.DefaultMaven.doExecute(DefaultMaven.java:309)
19-Dec-2018 21:22:47         at org.apache.maven.DefaultMaven.doExecute(DefaultMaven.java:194)
19-Dec-2018 21:22:47         at org.apache.maven.DefaultMaven.execute(DefaultMaven.java:107)
19-Dec-2018 21:22:47         at org.apache.maven.cli.MavenCli.execute(MavenCli.java:993)
19-Dec-2018 21:22:47         at org.apache.maven.cli.MavenCli.doMain(MavenCli.java:345)
19-Dec-2018 21:22:47         at org.apache.maven.cli.MavenCli.main(MavenCli.java:191)
19-Dec-2018 21:22:47         at sun.reflect.NativeMethodAccessorImpl.invoke0(Native Method)
19-Dec-2018 21:22:47         at sun.reflect.NativeMethodAccessorImpl.invoke(NativeMethodAccessorImpl.java:62)
19-Dec-2018 21:22:47         at sun.reflect.DelegatingMethodAccessorImpl.invoke(DelegatingMethodAccessorImpl.java:43)
19-Dec-2018 21:22:47         at java.lang.reflect.Method.invoke(Method.java:498)
19-Dec-2018 21:22:47         at org.codehaus.plexus.classworlds.launcher.Launcher.launchEnhanced(Launcher.java:289)
19-Dec-2018 21:22:47         at org.codehaus.plexus.classworlds.launcher.Launcher.launch(Launcher.java:229)
19-Dec-2018 21:22:47         at org.codehaus.plexus.classworlds.launcher.Launcher.mainWithExitCode(Launcher.java:415)
19-Dec-2018 21:22:47         at org.codehaus.plexus.classworlds.launcher.Launcher.main(Launcher.java:356)
19-Dec-2018 21:22:47 [INFO] Building jar: /opt/bamboo-home/xml-data/build-dir/SCD-K8S110BMASTER-JOB1/spring-cloud-dataflow-server-kubernetes-autoconfig/target/spring-cloud-dataflow-server-kubernetes-autoconfig-2.0.0.BUILD-SNAPSHOT-javadoc.jar
19-Dec-2018 21:22:47 [INFO]
19-Dec-2018 21:22:47 [INFO] >>> maven-source-plugin:3.0.1:jar (attach-sources) > generate-sources @ spring-cloud-dataflow-server-kubernetes-autoconfig >>>
19-Dec-2018 21:22:47 [INFO]
19-Dec-2018 21:22:47 [INFO] --- maven-checkstyle-plugin:2.17:check (checkstyle-validation) @ spring-cloud-dataflow-server-kubernetes-autoconfig ---
19-Dec-2018 21:22:47 [INFO] Starting audit...
19-Dec-2018 21:22:47 Audit done.
19-Dec-2018 21:22:47 [INFO]
19-Dec-2018 21:22:47 [INFO] --- jacoco-maven-plugin:0.7.9:prepare-agent (agent) @ spring-cloud-dataflow-server-kubernetes-autoconfig ---
19-Dec-2018 21:22:47 [INFO] argLine set to -javaagent:/home/bamboo/.m2/repository/org/jacoco/org.jacoco.agent/0.7.9/org.jacoco.agent-0.7.9-runtime.jar=destfile=/opt/bamboo-home/xml-data/build-dir/SCD-K8S110BMASTER-JOB1/spring-cloud-dataflow-server-kubernetes-autoconfig/target/jacoco.exec
19-Dec-2018 21:22:47 [INFO]
19-Dec-2018 21:22:47 [INFO] <<< maven-source-plugin:3.0.1:jar (attach-sources) < generate-sources @ spring-cloud-dataflow-server-kubernetes-autoconfig <<<
19-Dec-2018 21:22:47 [INFO]
19-Dec-2018 21:22:47 [INFO]
19-Dec-2018 21:22:47 [INFO] --- maven-source-plugin:3.0.1:jar (attach-sources) @ spring-cloud-dataflow-server-kubernetes-autoconfig ---
19-Dec-2018 21:22:47 [INFO] Building jar: /opt/bamboo-home/xml-data/build-dir/SCD-K8S110BMASTER-JOB1/spring-cloud-dataflow-server-kubernetes-autoconfig/target/spring-cloud-dataflow-server-kubernetes-autoconfig-2.0.0.BUILD-SNAPSHOT-sources.jar
19-Dec-2018 21:22:47 [INFO]
19-Dec-2018 21:22:47 [INFO] --- maven-install-plugin:2.4:install (default-install) @ spring-cloud-dataflow-server-kubernetes-autoconfig ---
19-Dec-2018 21:22:47 [INFO] Installing /opt/bamboo-home/xml-data/build-dir/SCD-K8S110BMASTER-JOB1/spring-cloud-dataflow-server-kubernetes-autoconfig/target/spring-cloud-dataflow-server-kubernetes-autoconfig-2.0.0.BUILD-SNAPSHOT.jar to /home/bamboo/.m2/repository/org/springframework/cloud/spring-cloud-dataflow-server-kubernetes-autoconfig/2.0.0.BUILD-SNAPSHOT/spring-cloud-dataflow-server-kubernetes-autoconfig-2.0.0.BUILD-SNAPSHOT.jar
19-Dec-2018 21:22:47 [INFO] Installing /opt/bamboo-home/xml-data/build-dir/SCD-K8S110BMASTER-JOB1/spring-cloud-dataflow-server-kubernetes-autoconfig/pom.xml to /home/bamboo/.m2/repository/org/springframework/cloud/spring-cloud-dataflow-server-kubernetes-autoconfig/2.0.0.BUILD-SNAPSHOT/spring-cloud-dataflow-server-kubernetes-autoconfig-2.0.0.BUILD-SNAPSHOT.pom
19-Dec-2018 21:22:47 [INFO] Installing /opt/bamboo-home/xml-data/build-dir/SCD-K8S110BMASTER-JOB1/spring-cloud-dataflow-server-kubernetes-autoconfig/target/spring-cloud-dataflow-server-kubernetes-autoconfig-2.0.0.BUILD-SNAPSHOT-javadoc.jar to /home/bamboo/.m2/repository/org/springframework/cloud/spring-cloud-dataflow-server-kubernetes-autoconfig/2.0.0.BUILD-SNAPSHOT/spring-cloud-dataflow-server-kubernetes-autoconfig-2.0.0.BUILD-SNAPSHOT-javadoc.jar
19-Dec-2018 21:22:47 [INFO] Installing /opt/bamboo-home/xml-data/build-dir/SCD-K8S110BMASTER-JOB1/spring-cloud-dataflow-server-kubernetes-autoconfig/target/spring-cloud-dataflow-server-kubernetes-autoconfig-2.0.0.BUILD-SNAPSHOT-javadoc.jar to /home/bamboo/.m2/repository/org/springframework/cloud/spring-cloud-dataflow-server-kubernetes-autoconfig/2.0.0.BUILD-SNAPSHOT/spring-cloud-dataflow-server-kubernetes-autoconfig-2.0.0.BUILD-SNAPSHOT-javadoc.jar
19-Dec-2018 21:22:47 [INFO] Installing /opt/bamboo-home/xml-data/build-dir/SCD-K8S110BMASTER-JOB1/spring-cloud-dataflow-server-kubernetes-autoconfig/target/spring-cloud-dataflow-server-kubernetes-autoconfig-2.0.0.BUILD-SNAPSHOT-sources.jar to /home/bamboo/.m2/repository/org/springframework/cloud/spring-cloud-dataflow-server-kubernetes-autoconfig/2.0.0.BUILD-SNAPSHOT/spring-cloud-dataflow-server-kubernetes-autoconfig-2.0.0.BUILD-SNAPSHOT-sources.jar
19-Dec-2018 21:22:48 [INFO]
19-Dec-2018 21:22:48 [INFO] ------------------------------------------------------------------------
19-Dec-2018 21:22:48 [INFO] Building Kubernetes Data Flow Server 2.0.0.BUILD-SNAPSHOT
19-Dec-2018 21:22:48 [INFO] ------------------------------------------------------------------------
19-Dec-2018 21:22:48 [INFO]
19-Dec-2018 21:22:48 [INFO] --- maven-clean-plugin:2.5:clean (default-clean) @ spring-cloud-dataflow-server-kubernetes ---
19-Dec-2018 21:22:48 [INFO]
19-Dec-2018 21:22:48 [INFO] --- maven-checkstyle-plugin:2.17:check (checkstyle-validation) @ spring-cloud-dataflow-server-kubernetes ---
19-Dec-2018 21:22:48 [INFO] Starting audit...
19-Dec-2018 21:22:48 Audit done.
19-Dec-2018 21:22:48 [INFO]
19-Dec-2018 21:22:48 [INFO] --- jacoco-maven-plugin:0.7.9:prepare-agent (agent) @ spring-cloud-dataflow-server-kubernetes ---
19-Dec-2018 21:22:48 [INFO] argLine set to -javaagent:/home/bamboo/.m2/repository/org/jacoco/org.jacoco.agent/0.7.9/org.jacoco.agent-0.7.9-runtime.jar=destfile=/opt/bamboo-home/xml-data/build-dir/SCD-K8S110BMASTER-JOB1/spring-cloud-dataflow-server-kubernetes/target/jacoco.exec
19-Dec-2018 21:22:48 [INFO]
19-Dec-2018 21:22:48 [INFO] --- maven-resources-plugin:3.1.0:resources (default-resources) @ spring-cloud-dataflow-server-kubernetes ---
19-Dec-2018 21:22:48 [INFO] Using 'UTF-8' encoding to copy filtered resources.
19-Dec-2018 21:22:48 [INFO] Copying 1 resource
19-Dec-2018 21:22:48 [INFO]
19-Dec-2018 21:22:48 [INFO] --- maven-compiler-plugin:3.8.0:compile (default-compile) @ spring-cloud-dataflow-server-kubernetes ---
19-Dec-2018 21:22:48 [INFO] Changes detected - recompiling the module!
19-Dec-2018 21:22:48 [INFO] Compiling 1 source file to /opt/bamboo-home/xml-data/build-dir/SCD-K8S110BMASTER-JOB1/spring-cloud-dataflow-server-kubernetes/target/classes
19-Dec-2018 21:22:48 [INFO]
19-Dec-2018 21:22:48 [INFO] --- maven-resources-plugin:3.1.0:testResources (default-testResources) @ spring-cloud-dataflow-server-kubernetes ---
19-Dec-2018 21:22:48 [INFO] Using 'UTF-8' encoding to copy filtered resources.
19-Dec-2018 21:22:48 [INFO] skip non existing resourceDirectory /opt/bamboo-home/xml-data/build-dir/SCD-K8S110BMASTER-JOB1/spring-cloud-dataflow-server-kubernetes/src/test/resources
19-Dec-2018 21:22:48 [INFO]
19-Dec-2018 21:22:48 [INFO] --- maven-compiler-plugin:3.8.0:testCompile (default-testCompile) @ spring-cloud-dataflow-server-kubernetes ---
19-Dec-2018 21:22:48 [INFO] Changes detected - recompiling the module!
19-Dec-2018 21:22:48 [INFO] Compiling 1 source file to /opt/bamboo-home/xml-data/build-dir/SCD-K8S110BMASTER-JOB1/spring-cloud-dataflow-server-kubernetes/target/test-classes
19-Dec-2018 21:22:48 [INFO]
19-Dec-2018 21:22:48 [INFO] --- maven-surefire-plugin:2.22.0:test (default-test) @ spring-cloud-dataflow-server-kubernetes ---
19-Dec-2018 21:22:48 [INFO]
19-Dec-2018 21:22:48 [INFO] -------------------------------------------------------
19-Dec-2018 21:22:48 [INFO]  T E S T S
19-Dec-2018 21:22:48 [INFO] -------------------------------------------------------
19-Dec-2018 21:22:49 [INFO] Running org.springframework.cloud.dataflow.server.kubernetes.ContextLoadsTests
19-Dec-2018 21:22:49 21:22:49.695 [main] DEBUG org.springframework.test.context.junit4.SpringJUnit4ClassRunner - SpringJUnit4ClassRunner constructor called with [class org.springframework.cloud.dataflow.server.kubernetes.ContextLoadsTests]
19-Dec-2018 21:22:49 21:22:49.703 [main] DEBUG org.springframework.test.context.BootstrapUtils - Instantiating CacheAwareContextLoaderDelegate from class [org.springframework.test.context.cache.DefaultCacheAwareContextLoaderDelegate]
19-Dec-2018 21:22:49 21:22:49.717 [main] DEBUG org.springframework.test.context.BootstrapUtils - Instantiating BootstrapContext using constructor [public org.springframework.test.context.support.DefaultBootstrapContext(java.lang.Class,org.springframework.test.context.CacheAwareContextLoaderDelegate)]
19-Dec-2018 21:22:49 21:22:49.747 [main] DEBUG org.springframework.test.context.BootstrapUtils - Instantiating TestContextBootstrapper for test class [org.springframework.cloud.dataflow.server.kubernetes.ContextLoadsTests] from class [org.springframework.boot.test.context.SpringBootTestContextBootstrapper]
19-Dec-2018 21:22:49 21:22:49.767 [main] INFO org.springframework.boot.test.context.SpringBootTestContextBootstrapper - Neither @ContextConfiguration nor @ContextHierarchy found for test class [org.springframework.cloud.dataflow.server.kubernetes.ContextLoadsTests], using SpringBootContextLoader
19-Dec-2018 21:22:49 21:22:49.772 [main] DEBUG org.springframework.test.context.support.AbstractContextLoader - Did not detect default resource location for test class [org.springframework.cloud.dataflow.server.kubernetes.ContextLoadsTests]: class path resource [org/springframework/cloud/dataflow/server/kubernetes/ContextLoadsTests-context.xml] does not exist
19-Dec-2018 21:22:49 21:22:49.773 [main] DEBUG org.springframework.test.context.support.AbstractContextLoader - Did not detect default resource location for test class [org.springframework.cloud.dataflow.server.kubernetes.ContextLoadsTests]: class path resource [org/springframework/cloud/dataflow/server/kubernetes/ContextLoadsTestsContext.groovy] does not exist
19-Dec-2018 21:22:49 21:22:49.773 [main] INFO org.springframework.test.context.support.AbstractContextLoader - Could not detect default resource locations for test class [org.springframework.cloud.dataflow.server.kubernetes.ContextLoadsTests]: no resource found for suffixes {-context.xml, Context.groovy}.
19-Dec-2018 21:22:49 21:22:49.834 [main] DEBUG org.springframework.test.context.support.ActiveProfilesUtils - Could not find an 'annotation declaring class' for annotation type [org.springframework.test.context.ActiveProfiles] and class [org.springframework.cloud.dataflow.server.kubernetes.ContextLoadsTests]
19-Dec-2018 21:22:50 21:22:50.079 [main] DEBUG org.springframework.boot.test.context.SpringBootTestContextBootstrapper - @TestExecutionListeners is not present for class [org.springframework.cloud.dataflow.server.kubernetes.ContextLoadsTests]: using defaults.
19-Dec-2018 21:22:50 21:22:50.080 [main] INFO org.springframework.boot.test.context.SpringBootTestContextBootstrapper - Loaded default TestExecutionListener class names from location [META-INF/spring.factories]: [org.springframework.boot.test.mock.mockito.MockitoTestExecutionListener, org.springframework.boot.test.mock.mockito.ResetMocksTestExecutionListener, org.springframework.boot.test.autoconfigure.restdocs.RestDocsTestExecutionListener, org.springframework.boot.test.autoconfigure.web.client.MockRestServiceServerResetTestExecutionListener, org.springframework.boot.test.autoconfigure.web.servlet.MockMvcPrintOnlyOnFailureTestExecutionListener, org.springframework.boot.test.autoconfigure.web.servlet.WebDriverTestExecutionListener, org.springframework.test.context.web.ServletTestExecutionListener, org.springframework.test.context.support.DirtiesContextBeforeModesTestExecutionListener, org.springframework.test.context.support.DependencyInjectionTestExecutionListener, org.springframework.test.context.support.DirtiesContextTestExecutionListener, org.springframework.test.context.transaction.TransactionalTestExecutionListener, org.springframework.test.context.jdbc.SqlScriptsTestExecutionListener]
19-Dec-2018 21:22:50 21:22:50.106 [main] INFO org.springframework.boot.test.context.SpringBootTestContextBootstrapper - Using TestExecutionListeners: [org.springframework.test.context.web.ServletTestExecutionListener@71664560, org.springframework.test.context.support.DirtiesContextBeforeModesTestExecutionListener@4d4436d0, org.springframework.boot.test.mock.mockito.MockitoTestExecutionListener@39da5e49, org.springframework.boot.test.autoconfigure.SpringBootDependencyInjectionTestExecutionListener@2443abd6, org.springframework.test.context.support.DirtiesContextTestExecutionListener@674da77b, org.springframework.test.context.transaction.TransactionalTestExecutionListener@bd3eff4, org.springframework.test.context.jdbc.SqlScriptsTestExecutionListener@6010d0d1, org.springframework.boot.test.mock.mockito.ResetMocksTestExecutionListener@5934ca1e, org.springframework.boot.test.autoconfigure.restdocs.RestDocsTestExecutionListener@5348d83c, org.springframework.boot.test.autoconfigure.web.client.MockRestServiceServerResetTestExecutionListener@477021ee, org.springframework.boot.test.autoconfigure.web.servlet.MockMvcPrintOnlyOnFailureTestExecutionListener@2180e789, org.springframework.boot.test.autoconfigure.web.servlet.WebDriverTestExecutionListener@5e9bbd9d]
19-Dec-2018 21:22:50 21:22:50.108 [main] DEBUG org.springframework.test.annotation.ProfileValueUtils - Retrieved @ProfileValueSourceConfiguration [null] for test class [org.springframework.cloud.dataflow.server.kubernetes.ContextLoadsTests]
19-Dec-2018 21:22:50 21:22:50.109 [main] DEBUG org.springframework.test.annotation.ProfileValueUtils - Retrieved ProfileValueSource type [class org.springframework.test.annotation.SystemProfileValueSource] for class [org.springframework.cloud.dataflow.server.kubernetes.ContextLoadsTests]
19-Dec-2018 21:22:50 21:22:50.111 [main] DEBUG org.springframework.test.annotation.ProfileValueUtils - Retrieved @ProfileValueSourceConfiguration [null] for test class [org.springframework.cloud.dataflow.server.kubernetes.ContextLoadsTests]
19-Dec-2018 21:22:50 21:22:50.111 [main] DEBUG org.springframework.test.annotation.ProfileValueUtils - Retrieved ProfileValueSource type [class org.springframework.test.annotation.SystemProfileValueSource] for class [org.springframework.cloud.dataflow.server.kubernetes.ContextLoadsTests]
19-Dec-2018 21:22:50 21:22:50.112 [main] DEBUG org.springframework.test.annotation.ProfileValueUtils - Retrieved @ProfileValueSourceConfiguration [null] for test class [org.springframework.cloud.dataflow.server.kubernetes.ContextLoadsTests]
19-Dec-2018 21:22:50 21:22:50.112 [main] DEBUG org.springframework.test.annotation.ProfileValueUtils - Retrieved ProfileValueSource type [class org.springframework.test.annotation.SystemProfileValueSource] for class [org.springframework.cloud.dataflow.server.kubernetes.ContextLoadsTests]
19-Dec-2018 21:22:50 21:22:50.119 [main] DEBUG org.springframework.test.context.support.AbstractDirtiesContextTestExecutionListener - Before test class: context [DefaultTestContext@3434a4f0 testClass = ContextLoadsTests, testInstance = [null], testMethod = [null], testException = [null], mergedContextConfiguration = [WebMergedContextConfiguration@79afa369 testClass = ContextLoadsTests, locations = '{}', classes = '{class org.springframework.cloud.dataflow.server.kubernetes.KubernetesDataFlowServer, class org.springframework.cloud.dataflow.server.kubernetes.KubernetesDataFlowServer}', contextInitializerClasses = '[]', activeProfiles = '{}', propertySourceLocations = '{}', propertySourceProperties = '{org.springframework.boot.test.context.SpringBootTestContextBootstrapper=true, server.port=0}', contextCustomizers = set[org.springframework.boot.test.context.filter.ExcludeFilterContextCustomizer@7e75bf2d, org.springframework.boot.test.json.DuplicateJsonObjectContextCustomizerFactory$DuplicateJsonObjectContextCustomizer@3bb8aabc, org.springframework.boot.test.mock.mockito.MockitoContextCustomizer@0, org.springframework.boot.test.web.client.TestRestTemplateContextCustomizer@e04ccf8, org.springframework.boot.test.autoconfigure.properties.PropertyMappingContextCustomizer@0, org.springframework.boot.test.autoconfigure.web.servlet.WebDriverContextCustomizerFactory$Customizer@252f626c], resourceBasePath = 'src/main/webapp', contextLoader = 'org.springframework.boot.test.context.SpringBootContextLoader', parent = [null]], attributes = map['org.springframework.test.context.web.ServletTestExecutionListener.activateListener' -> false]], class annotated with @DirtiesContext [false] with mode [null].
19-Dec-2018 21:22:50 21:22:50.120 [main] DEBUG org.springframework.test.annotation.ProfileValueUtils - Retrieved @ProfileValueSourceConfiguration [null] for test class [org.springframework.cloud.dataflow.server.kubernetes.ContextLoadsTests]
19-Dec-2018 21:22:50 21:22:50.120 [main] DEBUG org.springframework.test.annotation.ProfileValueUtils - Retrieved ProfileValueSource type [class org.springframework.test.annotation.SystemProfileValueSource] for class [org.springframework.cloud.dataflow.server.kubernetes.ContextLoadsTests]
19-Dec-2018 21:22:50 21:22:50.127 [main] DEBUG org.springframework.test.context.support.DependencyInjectionTestExecutionListener - Performing dependency injection for test context [[DefaultTestContext@3434a4f0 testClass = ContextLoadsTests, testInstance = org.springframework.cloud.dataflow.server.kubernetes.ContextLoadsTests@241fbec, testMethod = [null], testException = [null], mergedContextConfiguration = [WebMergedContextConfiguration@79afa369 testClass = ContextLoadsTests, locations = '{}', classes = '{class org.springframework.cloud.dataflow.server.kubernetes.KubernetesDataFlowServer, class org.springframework.cloud.dataflow.server.kubernetes.KubernetesDataFlowServer}', contextInitializerClasses = '[]', activeProfiles = '{}', propertySourceLocations = '{}', propertySourceProperties = '{org.springframework.boot.test.context.SpringBootTestContextBootstrapper=true, server.port=0}', contextCustomizers = set[org.springframework.boot.test.context.filter.ExcludeFilterContextCustomizer@7e75bf2d, org.springframework.boot.test.json.DuplicateJsonObjectContextCustomizerFactory$DuplicateJsonObjectContextCustomizer@3bb8aabc, org.springframework.boot.test.mock.mockito.MockitoContextCustomizer@0, org.springframework.boot.test.web.client.TestRestTemplateContextCustomizer@e04ccf8, org.springframework.boot.test.autoconfigure.properties.PropertyMappingContextCustomizer@0, org.springframework.boot.test.autoconfigure.web.servlet.WebDriverContextCustomizerFactory$Customizer@252f626c], resourceBasePath = 'src/main/webapp', contextLoader = 'org.springframework.boot.test.context.SpringBootContextLoader', parent = [null]], attributes = map['org.springframework.test.context.web.ServletTestExecutionListener.activateListener' -> false]]].
19-Dec-2018 21:22:50 21:22:50.182 [main] DEBUG org.springframework.test.context.support.TestPropertySourceUtils - Adding inlined properties to environment: {spring.jmx.enabled=false, org.springframework.boot.test.context.SpringBootTestContextBootstrapper=true, server.port=0}
19-Dec-2018 21:22:52 2018-12-19 21:22:52.069  INFO 28655 --- [           main] trationDelegate$BeanPostProcessorChecker : Bean 'org.springframework.cloud.autoconfigure.ConfigurationPropertiesRebinderAutoConfiguration' of type [org.springframework.cloud.autoconfigure.ConfigurationPropertiesRebinderAutoConfiguration$$EnhancerBySpringCGLIB$$f881d72] is not eligible for getting processed by all BeanPostProcessors (for example: not eligible for auto-proxying)
19-Dec-2018 21:22:52   ____                              ____ _                __
19-Dec-2018 21:22:52 / ___| _ __  _ __(_)_ __   __ _   / ___| | ___  _   _  __| |
19-Dec-2018 21:22:52 \___ \| '_ \| '__| | '_ \ / _` | | |   | |/ _ \| | | |/ _` |
19-Dec-2018 21:22:52   ___) | |_) | |  | | | | | (_| | | |___| | (_) | |_| | (_| |
19-Dec-2018 21:22:52 |____/| .__/|_|  |_|_| |_|\__, |  \____|_|\___/ \__,_|\__,_|
19-Dec-2018 21:22:52   ____ |_|    _          __|___/                 __________
19-Dec-2018 21:22:52 |  _ \  __ _| |_ __ _  |  ___| | _____      __  \ \ \ \ \ \
19-Dec-2018 21:22:52 | | | |/ _` | __/ _` | | |_  | |/ _ \ \ /\ / /   \ \ \ \ \ \
19-Dec-2018 21:22:52 | |_| | (_| | || (_| | |  _| | | (_) \ V  V /    / / / / / /
19-Dec-2018 21:22:52 |____/ \__,_|\__\__,_| |_|   |_|\___/ \_/\_/    /_/_/_/_/_/
19-Dec-2018 21:22:52
19-Dec-2018 21:22:52
19-Dec-2018 21:22:52
19-Dec-2018 21:22:52 2018-12-19 21:22:52.458  INFO 28655 --- [           main] c.c.c.ConfigServicePropertySourceLocator : Fetching config from server at : http://localhost:8888
19-Dec-2018 21:22:52 2018-12-19 21:22:52.510  INFO 28655 --- [           main] c.c.c.ConfigServicePropertySourceLocator : Connect Timeout Exception on Url - http://localhost:8888. Will be trying the next url if available
19-Dec-2018 21:22:52 2018-12-19 21:22:52.511  WARN 28655 --- [           main] c.c.c.ConfigServicePropertySourceLocator : Could not locate PropertySource: I/O error on GET request for "http://localhost:8888/spring-cloud-dataflow-server-kubernetes/default": Connection refused (Connection refused); nested exception is java.net.ConnectException: Connection refused (Connection refused)
19-Dec-2018 21:22:53 2018-12-19 21:22:53.209  WARN 28655 --- [           main] o.s.c.k.config.ConfigMapPropertySource   : Can't read configMap with name: [spring-cloud-dataflow-server-kubernetes] in namespace:[default]. Ignoring
19-Dec-2018 21:22:53
19-Dec-2018 21:22:53 io.fabric8.kubernetes.client.KubernetesClientException: Failure executing: GET at: https://35.227.88.51/api/v1/namespaces/default/configmaps/spring-cloud-dataflow-server-kubernetes. Message: Unauthorized! Token may have expired! Please log-in again. Unauthorized.
19-Dec-2018 21:22:53         at io.fabric8.kubernetes.client.dsl.base.OperationSupport.requestFailure(OperationSupport.java:472) ~[kubernetes-client-4.0.4.jar:na]
19-Dec-2018 21:22:53         at io.fabric8.kubernetes.client.dsl.base.OperationSupport.assertResponseCode(OperationSupport.java:409) ~[kubernetes-client-4.0.4.jar:na]
19-Dec-2018 21:22:53         at io.fabric8.kubernetes.client.dsl.base.OperationSupport.handleResponse(OperationSupport.java:381) ~[kubernetes-client-4.0.4.jar:na]
19-Dec-2018 21:22:53         at io.fabric8.kubernetes.client.dsl.base.OperationSupport.handleResponse(OperationSupport.java:344) ~[kubernetes-client-4.0.4.jar:na]
19-Dec-2018 21:22:53         at io.fabric8.kubernetes.client.dsl.base.OperationSupport.handleGet(OperationSupport.java:313) ~[kubernetes-client-4.0.4.jar:na]
19-Dec-2018 21:22:53         at io.fabric8.kubernetes.client.dsl.base.OperationSupport.handleGet(OperationSupport.java:296) ~[kubernetes-client-4.0.4.jar:na]
19-Dec-2018 21:22:53         at io.fabric8.kubernetes.client.dsl.base.BaseOperation.handleGet(BaseOperation.java:794) ~[kubernetes-client-4.0.4.jar:na]
19-Dec-2018 21:22:53         at io.fabric8.kubernetes.client.dsl.base.BaseOperation.getMandatory(BaseOperation.java:210) ~[kubernetes-client-4.0.4.jar:na]
19-Dec-2018 21:22:53         at io.fabric8.kubernetes.client.dsl.base.BaseOperation.get(BaseOperation.java:177) ~[kubernetes-client-4.0.4.jar:na]
19-Dec-2018 21:22:53         at org.springframework.cloud.kubernetes.config.ConfigMapPropertySource.getData(ConfigMapPropertySource.java:86) [spring-cloud-kubernetes-config-1.0.0.RC1.jar:1.0.0.RC1]
19-Dec-2018 21:22:53         at org.springframework.cloud.kubernetes.config.ConfigMapPropertySource.<init>(ConfigMapPropertySource.java:66) [spring-cloud-kubernetes-config-1.0.0.RC1.jar:1.0.0.RC1]
19-Dec-2018 21:22:53         at org.springframework.cloud.kubernetes.config.ConfigMapPropertySourceLocator.getMapPropertySourceForSingleConfigMap(ConfigMapPropertySourceLocator.java:77) [spring-cloud-kubernetes-config-1.0.0.RC1.jar:1.0.0.RC1]
19-Dec-2018 21:22:53         at org.springframework.cloud.kubernetes.config.ConfigMapPropertySourceLocator.locate(ConfigMapPropertySourceLocator.java:55) [spring-cloud-kubernetes-config-1.0.0.RC1.jar:1.0.0.RC1]
19-Dec-2018 21:22:53         at org.springframework.cloud.bootstrap.config.PropertySourceBootstrapConfiguration.initialize(PropertySourceBootstrapConfiguration.java:94) [spring-cloud-context-2.1.0.RC2.jar:2.1.0.RC2]
19-Dec-2018 21:22:53         at org.springframework.boot.SpringApplication.applyInitializers(SpringApplication.java:649) [spring-boot-2.1.1.RELEASE.jar:2.1.1.RELEASE]
19-Dec-2018 21:22:53         at org.springframework.boot.SpringApplication.prepareContext(SpringApplication.java:373) [spring-boot-2.1.1.RELEASE.jar:2.1.1.RELEASE]
19-Dec-2018 21:22:53         at org.springframework.boot.SpringApplication.run(SpringApplication.java:314) [spring-boot-2.1.1.RELEASE.jar:2.1.1.RELEASE]
19-Dec-2018 21:22:53         at org.springframework.boot.test.context.SpringBootContextLoader.loadContext(SpringBootContextLoader.java:127) [spring-boot-test-2.1.1.RELEASE.jar:2.1.1.RELEASE]
19-Dec-2018 21:22:53         at org.springframework.test.context.cache.DefaultCacheAwareContextLoaderDelegate.loadContextInternal(DefaultCacheAwareContextLoaderDelegate.java:99) [spring-test-5.1.3.RELEASE.jar:5.1.3.RELEASE]
19-Dec-2018 21:22:53         at org.springframework.test.context.cache.DefaultCacheAwareContextLoaderDelegate.loadContext(DefaultCacheAwareContextLoaderDelegate.java:117) [spring-test-5.1.3.RELEASE.jar:5.1.3.RELEASE]
19-Dec-2018 21:22:53         at org.springframework.test.context.support.DefaultTestContext.getApplicationContext(DefaultTestContext.java:108) [spring-test-5.1.3.RELEASE.jar:5.1.3.RELEASE]
19-Dec-2018 21:22:53         at org.springframework.test.context.support.DependencyInjectionTestExecutionListener.injectDependencies(DependencyInjectionTestExecutionListener.java:118) [spring-test-5.1.3.RELEASE.jar:5.1.3.RELEASE]
19-Dec-2018 21:22:53         at org.springframework.test.context.support.DependencyInjectionTestExecutionListener.prepareTestInstance(DependencyInjectionTestExecutionListener.java:83) [spring-test-5.1.3.RELEASE.jar:5.1.3.RELEASE]
19-Dec-2018 21:22:53         at org.springframework.boot.test.autoconfigure.SpringBootDependencyInjectionTestExecutionListener.prepareTestInstance(SpringBootDependencyInjectionTestExecutionListener.java:44) [spring-boot-test-autoconfigure-2.1.1.RELEASE.jar:2.1.1.RELEASE]
19-Dec-2018 21:22:53         at org.springframework.test.context.TestContextManager.prepareTestInstance(TestContextManager.java:246) [spring-test-5.1.3.RELEASE.jar:5.1.3.RELEASE]
19-Dec-2018 21:22:53         at org.springframework.test.context.junit4.SpringJUnit4ClassRunner.createTest(SpringJUnit4ClassRunner.java:227) [spring-test-5.1.3.RELEASE.jar:5.1.3.RELEASE]
19-Dec-2018 21:22:53         at org.springframework.test.context.junit4.SpringJUnit4ClassRunner$1.runReflectiveCall(SpringJUnit4ClassRunner.java:289) [spring-test-5.1.3.RELEASE.jar:5.1.3.RELEASE]
19-Dec-2018 21:22:53         at org.junit.internal.runners.model.ReflectiveCallable.run(ReflectiveCallable.java:12) [junit-4.12.jar:4.12]
19-Dec-2018 21:22:53         at org.springframework.test.context.junit4.SpringJUnit4ClassRunner.methodBlock(SpringJUnit4ClassRunner.java:291) [spring-test-5.1.3.RELEASE.jar:5.1.3.RELEASE]
19-Dec-2018 21:22:53         at org.springframework.test.context.junit4.SpringJUnit4ClassRunner.runChild(SpringJUnit4ClassRunner.java:246) [spring-test-5.1.3.RELEASE.jar:5.1.3.RELEASE]
19-Dec-2018 21:22:53         at org.springframework.test.context.junit4.SpringJUnit4ClassRunner.runChild(SpringJUnit4ClassRunner.java:97) [spring-test-5.1.3.RELEASE.jar:5.1.3.RELEASE]
19-Dec-2018 21:22:53         at org.junit.runners.ParentRunner$3.run(ParentRunner.java:290) [junit-4.12.jar:4.12]
19-Dec-2018 21:22:53         at org.junit.runners.ParentRunner$1.schedule(ParentRunner.java:71) [junit-4.12.jar:4.12]
19-Dec-2018 21:22:53         at org.junit.runners.ParentRunner.runChildren(ParentRunner.java:288) [junit-4.12.jar:4.12]
19-Dec-2018 21:22:53         at org.junit.runners.ParentRunner.access$000(ParentRunner.java:58) [junit-4.12.jar:4.12]
19-Dec-2018 21:22:53         at org.junit.runners.ParentRunner$2.evaluate(ParentRunner.java:268) [junit-4.12.jar:4.12]
19-Dec-2018 21:22:53         at org.springframework.test.context.junit4.statements.RunBeforeTestClassCallbacks.evaluate(RunBeforeTestClassCallbacks.java:61) [spring-test-5.1.3.RELEASE.jar:5.1.3.RELEASE]
19-Dec-2018 21:22:53         at org.springframework.test.context.junit4.statements.RunAfterTestClassCallbacks.evaluate(RunAfterTestClassCallbacks.java:70) [spring-test-5.1.3.RELEASE.jar:5.1.3.RELEASE]
19-Dec-2018 21:22:53         at org.junit.runners.ParentRunner.run(ParentRunner.java:363) [junit-4.12.jar:4.12]
19-Dec-2018 21:22:53         at org.springframework.test.context.junit4.SpringJUnit4ClassRunner.run(SpringJUnit4ClassRunner.java:190) [spring-test-5.1.3.RELEASE.jar:5.1.3.RELEASE]
19-Dec-2018 21:22:53         at org.apache.maven.surefire.junit4.JUnit4Provider.execute(JUnit4Provider.java:365) [surefire-junit4-2.22.0.jar:2.22.0]
19-Dec-2018 21:22:53         at org.apache.maven.surefire.junit4.JUnit4Provider.executeWithRerun(JUnit4Provider.java:273) [surefire-junit4-2.22.0.jar:2.22.0]
19-Dec-2018 21:22:53         at org.apache.maven.surefire.junit4.JUnit4Provider.executeTestSet(JUnit4Provider.java:238) [surefire-junit4-2.22.0.jar:2.22.0]
19-Dec-2018 21:22:53         at org.apache.maven.surefire.junit4.JUnit4Provider.invoke(JUnit4Provider.java:159) [surefire-junit4-2.22.0.jar:2.22.0]
19-Dec-2018 21:22:53         at org.apache.maven.surefire.booter.ForkedBooter.invokeProviderInSameClassLoader(ForkedBooter.java:383) [surefire-booter-2.22.0.jar:2.22.0]
19-Dec-2018 21:22:53         at org.apache.maven.surefire.booter.ForkedBooter.runSuitesInProcess(ForkedBooter.java:344) [surefire-booter-2.22.0.jar:2.22.0]
19-Dec-2018 21:22:53         at org.apache.maven.surefire.booter.ForkedBooter.execute(ForkedBooter.java:125) [surefire-booter-2.22.0.jar:2.22.0]
19-Dec-2018 21:22:53         at org.apache.maven.surefire.booter.ForkedBooter.main(ForkedBooter.java:417) [surefire-booter-2.22.0.jar:2.22.0]
19-Dec-2018 21:22:53
19-Dec-2018 21:22:53 2018-12-19 21:22:53.213  INFO 28655 --- [           main] b.c.PropertySourceBootstrapConfiguration : Located property source: ConfigMapPropertySource {name='configmap.spring-cloud-dataflow-server-kubernetes.default'}
19-Dec-2018 21:22:53 2018-12-19 21:22:53.214  INFO 28655 --- [           main] b.c.PropertySourceBootstrapConfiguration : Located property source: SecretsPropertySource {name='secrets.spring-cloud-dataflow-server-kubernetes.default'}
19-Dec-2018 21:22:53 2018-12-19 21:22:53.274  INFO 28655 --- [           main] o.s.c.d.s.kubernetes.ContextLoadsTests   : No active profile set, falling back to default profiles: default
19-Dec-2018 21:22:54 2018-12-19 21:22:54.459  INFO 28655 --- [           main] .s.d.r.c.RepositoryConfigurationDelegate : Multiple Spring Data modules found, entering strict repository configuration mode!
19-Dec-2018 21:22:54 2018-12-19 21:22:54.462  INFO 28655 --- [           main] .s.d.r.c.RepositoryConfigurationDelegate : Bootstrapping Spring Data repositories in DEFAULT mode.
19-Dec-2018 21:22:54 2018-12-19 21:22:54.491  INFO 28655 --- [           main] .s.d.r.c.RepositoryConfigurationDelegate : Finished Spring Data repository scanning in 17ms. Found 0 repository interfaces.
19-Dec-2018 21:22:54 2018-12-19 21:22:54.563  INFO 28655 --- [           main] .s.d.r.c.RepositoryConfigurationDelegate : Multiple Spring Data modules found, entering strict repository configuration mode!
19-Dec-2018 21:22:54 2018-12-19 21:22:54.563  INFO 28655 --- [           main] .s.d.r.c.RepositoryConfigurationDelegate : Bootstrapping Spring Data repositories in DEFAULT mode.
19-Dec-2018 21:22:54 2018-12-19 21:22:54.760  INFO 28655 --- [           main] .s.d.r.c.RepositoryConfigurationDelegate : Finished Spring Data repository scanning in 192ms. Found 1 repository interfaces.
19-Dec-2018 21:22:54 2018-12-19 21:22:54.932  INFO 28655 --- [           main] .s.d.r.c.RepositoryConfigurationDelegate : Multiple Spring Data modules found, entering strict repository configuration mode!
19-Dec-2018 21:22:54 2018-12-19 21:22:54.932  INFO 28655 --- [           main] .s.d.r.c.RepositoryConfigurationDelegate : Bootstrapping Spring Data repositories in DEFAULT mode.
19-Dec-2018 21:22:54 2018-12-19 21:22:54.967  INFO 28655 --- [           main] .s.d.r.c.RepositoryConfigurationDelegate : Finished Spring Data repository scanning in 35ms. Found 4 repository interfaces.
19-Dec-2018 21:22:54 2018-12-19 21:22:54.987  WARN 28655 --- [           main] o.s.boot.actuate.endpoint.EndpointId     : Endpoint ID 'hystrix.stream' contains invalid characters, please migrate to a valid format.
19-Dec-2018 21:22:55 2018-12-19 21:22:55.406  INFO 28655 --- [           main] o.s.cloud.context.scope.GenericScope     : BeanFactory id=5e92f7e0-76ed-3808-83c3-160d890b8512
19-Dec-2018 21:22:56 2018-12-19 21:22:56.645  INFO 28655 --- [           main] o.apache.catalina.core.StandardService   : Starting service [Tomcat]
19-Dec-2018 21:22:56 2018-12-19 21:22:56.646  INFO 28655 --- [           main] org.apache.catalina.core.StandardEngine  : Starting Servlet Engine: Apache Tomcat/9.0.13
19-Dec-2018 21:22:56 2018-12-19 21:22:56.662  INFO 28655 --- [           main] o.a.catalina.core.AprLifecycleListener   : The APR based Apache Tomcat Native library which allows optimal performance in production environments was not found on the java.library.path: [/usr/java/packages/lib/amd64:/usr/lib64:/lib64:/lib:/usr/lib]
19-Dec-2018 21:22:56 2018-12-19 21:22:56.800  INFO 28655 --- [           main] o.a.c.c.C.[Tomcat].[localhost].[/]       : Initializing Spring embedded WebApplicationContext
19-Dec-2018 21:22:57 2018-12-19 21:22:57.046  WARN 28655 --- [           main] c.n.c.sources.URLConfigurationSource     : No URLs will be polled as dynamic configuration sources.
19-Dec-2018 21:22:57 2018-12-19 21:22:57.046  INFO 28655 --- [           main] c.n.c.sources.URLConfigurationSource     : To enable URLs as dynamic configuration sources, define System property archaius.configurationSource.additionalUrls or make config.properties available on classpath.
19-Dec-2018 21:22:57 2018-12-19 21:22:57.071  INFO 28655 --- [           main] c.netflix.config.DynamicPropertyFactory  : DynamicPropertyFactory is initialized with configuration sources: com.netflix.config.ConcurrentCompositeConfiguration@787c7027
19-Dec-2018 21:22:58 2018-12-19 21:22:58.790  INFO 28655 --- [           main] com.zaxxer.hikari.HikariDataSource       : HikariPool-1 - Starting...
19-Dec-2018 21:22:59 2018-12-19 21:22:59.107  INFO 28655 --- [           main] com.zaxxer.hikari.HikariDataSource       : HikariPool-1 - Start completed.
19-Dec-2018 21:22:59 2018-12-19 21:22:59.294  INFO 28655 --- [           main] o.hibernate.jpa.internal.util.LogHelper  : HHH000204: Processing PersistenceUnitInfo [
19-Dec-2018 21:22:59         name: default
19-Dec-2018 21:22:59         ...]
19-Dec-2018 21:22:59 2018-12-19 21:22:59.405  INFO 28655 --- [           main] org.hibernate.Version                    : HHH000412: Hibernate Core {5.3.7.Final}
19-Dec-2018 21:22:59 2018-12-19 21:22:59.407  INFO 28655 --- [           main] org.hibernate.cfg.Environment            : HHH000206: hibernate.properties not found
19-Dec-2018 21:22:59 2018-12-19 21:22:59.637  INFO 28655 --- [           main] o.hibernate.annotations.common.Version   : HCANN000001: Hibernate Commons Annotations {5.0.4.Final}
19-Dec-2018 21:22:59 2018-12-19 21:22:59.872  INFO 28655 --- [           main] org.hibernate.dialect.Dialect            : HHH000400: Using dialect: org.hibernate.dialect.H2Dialect
19-Dec-2018 21:23:01 2018-12-19 21:23:01.020  INFO 28655 --- [           main] o.h.t.schema.internal.SchemaCreatorImpl  : HHH000476: Executing import script 'org.hibernate.tool.schema.internal.exec.ScriptSourceInputNonExistentImpl@1308b7bd'
19-Dec-2018 21:23:01 2018-12-19 21:23:01.024  INFO 28655 --- [           main] j.LocalContainerEntityManagerFactoryBean : Initialized JPA EntityManagerFactory for persistence unit 'default'
19-Dec-2018 21:23:01 2018-12-19 21:23:01.311  WARN 28655 --- [           main] c.n.c.sources.URLConfigurationSource     : No URLs will be polled as dynamic configuration sources.
19-Dec-2018 21:23:01 2018-12-19 21:23:01.311  INFO 28655 --- [           main] c.n.c.sources.URLConfigurationSource     : To enable URLs as dynamic configuration sources, define System property archaius.configurationSource.additionalUrls or make config.properties available on classpath.
19-Dec-2018 21:23:02 2018-12-19 21:23:02.473  INFO 28655 --- [           main] o.s.s.concurrent.ThreadPoolTaskExecutor  : Initializing ExecutorService 'applicationTaskExecutor'
19-Dec-2018 21:23:02 2018-12-19 21:23:02.591  WARN 28655 --- [           main] aWebConfiguration$JpaWebMvcConfiguration : spring.jpa.open-in-view is enabled by default. Therefore, database queries may be performed during view rendering. Explicitly configure spring.jpa.open-in-view to disable this warning
19-Dec-2018 21:23:03 2018-12-19 21:23:03.427  INFO 28655 --- [           main] .s.s.UserDetailsServiceAutoConfiguration :
19-Dec-2018 21:23:03
19-Dec-2018 21:23:03 Using generated security password: ff02e521-0b50-48a1-8d74-81e851fa969a
19-Dec-2018 21:23:03
19-Dec-2018 21:23:04 2018-12-19 21:23:04.290  INFO 28655 --- [           main] o.s.b.c.r.s.JobRepositoryFactoryBean     : No database type set, using meta data indicating: H2
19-Dec-2018 21:23:04 2018-12-19 21:23:04.581  INFO 28655 --- [           main] o.s.c.d.s.b.SimpleJobServiceFactoryBean  : No database type set, using meta data indicating: H2
19-Dec-2018 21:23:04 2018-12-19 21:23:04.640  INFO 28655 --- [           main] o.s.c.d.s.r.s.DataflowRdbmsInitializer   : Adding dataflow schema classpath:schemas/h2/common.sql for h2 database
19-Dec-2018 21:23:04 2018-12-19 21:23:04.640  INFO 28655 --- [           main] o.s.c.d.s.r.s.DataflowRdbmsInitializer   : Adding dataflow schema classpath:schemas/h2/streams.sql for h2 database
19-Dec-2018 21:23:04 2018-12-19 21:23:04.640  INFO 28655 --- [           main] o.s.c.d.s.r.s.DataflowRdbmsInitializer   : Adding dataflow schema classpath:schemas/h2/tasks.sql for h2 database
19-Dec-2018 21:23:04 2018-12-19 21:23:04.641  INFO 28655 --- [           main] o.s.c.d.s.r.s.DataflowRdbmsInitializer   : Adding dataflow schema classpath:schemas/h2/deployment.sql for h2 database
19-Dec-2018 21:23:04 2018-12-19 21:23:04.641  INFO 28655 --- [           main] o.s.c.d.s.r.s.DataflowRdbmsInitializer   : Adding dataflow schema classpath:schemas/h2/jpa.sql for h2 database
19-Dec-2018 21:23:05 2018-12-19 21:23:05.007  INFO 28655 --- [           main] o.s.c.d.s.c.support.MetricStore          : Metrics Collector URI = []
19-Dec-2018 21:23:05 2018-12-19 21:23:05.248  INFO 28655 --- [           main] .s.c.DataFlowControllerAutoConfiguration : Skipper URI [http://localhost:7577/api]
19-Dec-2018 21:23:05 2018-12-19 21:23:05.521  INFO 28655 --- [           main] o.s.c.d.s.kubernetes.ContextLoadsTests   : Started ContextLoadsTests in 15.334 seconds (JVM running for 16.642)
19-Dec-2018 21:23:05 2018-12-19 21:23:05.561  INFO 28655 --- [           main] .s.c.d.s.s.LauncherInitializationService : Creating Local Task Launcher named 'default' since no Task Launchers configured.
19-Dec-2018 21:23:05 2018-12-19 21:23:05.581  INFO 28655 --- [           main] .s.c.d.s.s.LauncherInitializationService : Added 'Local' platform account 'default' into Task Launcher repository.
19-Dec-2018 21:23:05 [INFO] Tests run: 1, Failures: 0, Errors: 0, Skipped: 0, Time elapsed: 16.151 s - in org.springframework.cloud.dataflow.server.kubernetes.ContextLoadsTests
19-Dec-2018 21:23:05 2018-12-19 21:23:05.919  INFO 28655 --- [       Thread-9] o.s.s.concurrent.ThreadPoolTaskExecutor  : Shutting down ExecutorService 'applicationTaskExecutor'
19-Dec-2018 21:23:05 2018-12-19 21:23:05.927  INFO 28655 --- [       Thread-9] j.LocalContainerEntityManagerFactoryBean : Closing JPA EntityManagerFactory for persistence unit 'default'
19-Dec-2018 21:23:05 2018-12-19 21:23:05.928  INFO 28655 --- [       Thread-9] .SchemaDropperImpl$DelayedDropActionImpl : HHH000477: Starting delayed evictData of schema as part of SessionFactory shut-down'
19-Dec-2018 21:23:05 2018-12-19 21:23:05.978  INFO 28655 --- [       Thread-9] com.zaxxer.hikari.HikariDataSource       : HikariPool-1 - Shutdown initiated...
19-Dec-2018 21:23:05 2018-12-19 21:23:05.984  INFO 28655 --- [       Thread-9] com.zaxxer.hikari.HikariDataSource       : HikariPool-1 - Shutdown completed.
19-Dec-2018 21:23:06 [INFO]
19-Dec-2018 21:23:06 [INFO] Results:
19-Dec-2018 21:23:06 [INFO]
19-Dec-2018 21:23:06 [INFO] Tests run: 1, Failures: 0, Errors: 0, Skipped: 0
19-Dec-2018 21:23:06 [INFO]
19-Dec-2018 21:23:06 [INFO]
19-Dec-2018 21:23:06 [INFO] --- jacoco-maven-plugin:0.7.9:report (report) @ spring-cloud-dataflow-server-kubernetes ---
19-Dec-2018 21:23:06 [INFO] Loading execution data file /opt/bamboo-home/xml-data/build-dir/SCD-K8S110BMASTER-JOB1/spring-cloud-dataflow-server-kubernetes/target/jacoco.exec
19-Dec-2018 21:23:06 [INFO] Analyzed bundle 'Kubernetes Data Flow Server' with 1 classes
19-Dec-2018 21:23:06 [INFO]
19-Dec-2018 21:23:06 [INFO] --- maven-jar-plugin:3.0.2:jar (default-jar) @ spring-cloud-dataflow-server-kubernetes ---
19-Dec-2018 21:23:06 [INFO] Building jar: /opt/bamboo-home/xml-data/build-dir/SCD-K8S110BMASTER-JOB1/spring-cloud-dataflow-server-kubernetes/target/spring-cloud-dataflow-server-kubernetes-2.0.0.BUILD-SNAPSHOT.jar
19-Dec-2018 21:23:06 [INFO]
19-Dec-2018 21:23:06 [INFO] --- maven-javadoc-plugin:3.0.1:jar (attach-javadocs) @ spring-cloud-dataflow-server-kubernetes ---
19-Dec-2018 21:23:07 [INFO] Building jar: /opt/bamboo-home/xml-data/build-dir/SCD-K8S110BMASTER-JOB1/spring-cloud-dataflow-server-kubernetes/target/spring-cloud-dataflow-server-kubernetes-2.0.0.BUILD-SNAPSHOT-javadoc.jar
19-Dec-2018 21:23:07 [INFO]
19-Dec-2018 21:23:07 [INFO] --- maven-javadoc-plugin:3.0.1:jar (javadoc) @ spring-cloud-dataflow-server-kubernetes ---
19-Dec-2018 21:23:08 [INFO] Building jar: /opt/bamboo-home/xml-data/build-dir/SCD-K8S110BMASTER-JOB1/spring-cloud-dataflow-server-kubernetes/target/spring-cloud-dataflow-server-kubernetes-2.0.0.BUILD-SNAPSHOT-javadoc.jar
19-Dec-2018 21:23:08 [INFO]
19-Dec-2018 21:23:08 [INFO] >>> maven-source-plugin:3.0.1:jar (attach-sources) > generate-sources @ spring-cloud-dataflow-server-kubernetes >>>
19-Dec-2018 21:23:08 [INFO]
19-Dec-2018 21:23:08 [INFO] --- maven-checkstyle-plugin:2.17:check (checkstyle-validation) @ spring-cloud-dataflow-server-kubernetes ---
19-Dec-2018 21:23:08 [INFO] Starting audit...
19-Dec-2018 21:23:08 Audit done.
19-Dec-2018 21:23:08 [INFO]
19-Dec-2018 21:23:08 [INFO] --- jacoco-maven-plugin:0.7.9:prepare-agent (agent) @ spring-cloud-dataflow-server-kubernetes ---
19-Dec-2018 21:23:08 [INFO] argLine set to -javaagent:/home/bamboo/.m2/repository/org/jacoco/org.jacoco.agent/0.7.9/org.jacoco.agent-0.7.9-runtime.jar=destfile=/opt/bamboo-home/xml-data/build-dir/SCD-K8S110BMASTER-JOB1/spring-cloud-dataflow-server-kubernetes/target/jacoco.exec
19-Dec-2018 21:23:08 [INFO]
19-Dec-2018 21:23:08 [INFO] <<< maven-source-plugin:3.0.1:jar (attach-sources) < generate-sources @ spring-cloud-dataflow-server-kubernetes <<<
19-Dec-2018 21:23:08 [INFO]
19-Dec-2018 21:23:08 [INFO]
19-Dec-2018 21:23:08 [INFO] --- maven-source-plugin:3.0.1:jar (attach-sources) @ spring-cloud-dataflow-server-kubernetes ---
19-Dec-2018 21:23:08 [INFO] Building jar: /opt/bamboo-home/xml-data/build-dir/SCD-K8S110BMASTER-JOB1/spring-cloud-dataflow-server-kubernetes/target/spring-cloud-dataflow-server-kubernetes-2.0.0.BUILD-SNAPSHOT-sources.jar
19-Dec-2018 21:23:08 [INFO]
19-Dec-2018 21:23:08 [INFO] --- spring-boot-maven-plugin:2.1.1.RELEASE:repackage (default) @ spring-cloud-dataflow-server-kubernetes ---
19-Dec-2018 21:23:08 [INFO] Replacing main artifact with repackaged archive
19-Dec-2018 21:23:08 [INFO]
19-Dec-2018 21:23:08 [INFO] --- maven-install-plugin:2.4:install (default-install) @ spring-cloud-dataflow-server-kubernetes ---
19-Dec-2018 21:23:08 [INFO] Installing /opt/bamboo-home/xml-data/build-dir/SCD-K8S110BMASTER-JOB1/spring-cloud-dataflow-server-kubernetes/target/spring-cloud-dataflow-server-kubernetes-2.0.0.BUILD-SNAPSHOT.jar to /home/bamboo/.m2/repository/org/springframework/cloud/spring-cloud-dataflow-server-kubernetes/2.0.0.BUILD-SNAPSHOT/spring-cloud-dataflow-server-kubernetes-2.0.0.BUILD-SNAPSHOT.jar
19-Dec-2018 21:23:09 [INFO] Installing /opt/bamboo-home/xml-data/build-dir/SCD-K8S110BMASTER-JOB1/spring-cloud-dataflow-server-kubernetes/pom.xml to /home/bamboo/.m2/repository/org/springframework/cloud/spring-cloud-dataflow-server-kubernetes/2.0.0.BUILD-SNAPSHOT/spring-cloud-dataflow-server-kubernetes-2.0.0.BUILD-SNAPSHOT.pom
19-Dec-2018 21:23:09 [INFO] Installing /opt/bamboo-home/xml-data/build-dir/SCD-K8S110BMASTER-JOB1/spring-cloud-dataflow-server-kubernetes/target/spring-cloud-dataflow-server-kubernetes-2.0.0.BUILD-SNAPSHOT-javadoc.jar to /home/bamboo/.m2/repository/org/springframework/cloud/spring-cloud-dataflow-server-kubernetes/2.0.0.BUILD-SNAPSHOT/spring-cloud-dataflow-server-kubernetes-2.0.0.BUILD-SNAPSHOT-javadoc.jar
19-Dec-2018 21:23:09 [INFO] Installing /opt/bamboo-home/xml-data/build-dir/SCD-K8S110BMASTER-JOB1/spring-cloud-dataflow-server-kubernetes/target/spring-cloud-dataflow-server-kubernetes-2.0.0.BUILD-SNAPSHOT-javadoc.jar to /home/bamboo/.m2/repository/org/springframework/cloud/spring-cloud-dataflow-server-kubernetes/2.0.0.BUILD-SNAPSHOT/spring-cloud-dataflow-server-kubernetes-2.0.0.BUILD-SNAPSHOT-javadoc.jar
19-Dec-2018 21:23:09 [INFO] Installing /opt/bamboo-home/xml-data/build-dir/SCD-K8S110BMASTER-JOB1/spring-cloud-dataflow-server-kubernetes/target/spring-cloud-dataflow-server-kubernetes-2.0.0.BUILD-SNAPSHOT-sources.jar to /home/bamboo/.m2/repository/org/springframework/cloud/spring-cloud-dataflow-server-kubernetes/2.0.0.BUILD-SNAPSHOT/spring-cloud-dataflow-server-kubernetes-2.0.0.BUILD-SNAPSHOT-sources.jar
19-Dec-2018 21:23:09 [INFO]
19-Dec-2018 21:23:09 [INFO] ------------------------------------------------------------------------
19-Dec-2018 21:23:09 [INFO] Building spring-cloud-dataflow-server-kubernetes-docs 2.0.0.BUILD-SNAPSHOT
19-Dec-2018 21:23:09 [INFO] ------------------------------------------------------------------------
19-Dec-2018 21:23:09 [INFO]
19-Dec-2018 21:23:09 [INFO] --- maven-clean-plugin:2.5:clean (default-clean) @ spring-cloud-dataflow-server-kubernetes-docs ---
19-Dec-2018 21:23:09 [INFO]
19-Dec-2018 21:23:09 [INFO] --- maven-checkstyle-plugin:2.17:check (checkstyle-validation) @ spring-cloud-dataflow-server-kubernetes-docs ---
19-Dec-2018 21:23:09 [INFO] Starting audit...
19-Dec-2018 21:23:09 Audit done.
19-Dec-2018 21:23:09 [INFO]
19-Dec-2018 21:23:09 [INFO] --- maven-antrun-plugin:1.8:run (setup-maven-properties) @ spring-cloud-dataflow-server-kubernetes-docs ---
19-Dec-2018 21:23:10 [INFO] Executing tasks
19-Dec-2018 21:23:10
19-Dec-2018 21:23:10 main:
19-Dec-2018 21:23:10 [INFO] Executed tasks
19-Dec-2018 21:23:10 [INFO]
19-Dec-2018 21:23:10 [INFO] --- jacoco-maven-plugin:0.7.9:prepare-agent (agent) @ spring-cloud-dataflow-server-kubernetes-docs ---
19-Dec-2018 21:23:10 [INFO] argLine set to -javaagent:/home/bamboo/.m2/repository/org/jacoco/org.jacoco.agent/0.7.9/org.jacoco.agent-0.7.9-runtime.jar=destfile=/opt/bamboo-home/xml-data/build-dir/SCD-K8S110BMASTER-JOB1/spring-cloud-dataflow-server-kubernetes-docs/target/jacoco.exec
19-Dec-2018 21:23:10 [INFO]
19-Dec-2018 21:23:10 [INFO] --- asciidoctor-maven-plugin:1.5.3:process-asciidoc (generate-html5) @ spring-cloud-dataflow-server-kubernetes-docs ---
19-Dec-2018 21:23:16 asciidoctor: WARNING: https://raw.githubusercontent.com/spring-cloud/spring-cloud-dataflow/master/spring-cloud-dataflow-docs/src/main/asciidoc/streams.adoc: line 1039: invalid style for listing block: Source
19-Dec-2018 21:23:17 asciidoctor: ERROR: appendix.adoc: line 2: invalid part, must have at least one section (e.g., chapter, appendix, etc.)
19-Dec-2018 21:23:17 asciidoctor: ERROR: howto.adoc: line 3: invalid part, must have at least one section (e.g., chapter, appendix, etc.)
19-Dec-2018 21:23:17 asciidoctor: WARNING: howto.adoc: line 16: section title out of sequence: expected level 2, got level 1
19-Dec-2018 21:23:17 asciidoctor: WARNING: https://raw.githubusercontent.com/spring-cloud/spring-cloud-dataflow/master/spring-cloud-dataflow-docs/src/main/asciidoc/appendix-dataflow-template.adoc: line 3: section title out of sequence: expected level 2, got level 1
19-Dec-2018 21:23:17 asciidoctor: WARNING: appendix.adoc: line 17: include uri not readable: https://raw.githubusercontent.com/spring-cloud/spring-cloud-dataflow/master/spring-cloud-dataflow-docs/src/main/asciidoc/appendix-migration-guide.adoc
19-Dec-2018 21:23:18 asciidoctor: WARNING: https://raw.githubusercontent.com/spring-cloud/spring-cloud-dataflow/master/spring-cloud-dataflow-docs/src/main/asciidoc/appendix-contributing.adoc: line 3: section title out of sequence: expected level 2, got level 1
19-Dec-2018 21:23:18 asciidoctor: WARNING: skipping reference to missing attribute: scs-app-starters-docs-htmlsingle
19-Dec-2018 21:23:18 asciidoctor: WARNING: skipping reference to missing attribute: scs-app-starters-docs-htmlsingle
19-Dec-2018 21:23:18 asciidoctor: WARNING: skipping reference to missing attribute: scs-app-starters-docs-htmlsingle
19-Dec-2018 21:23:18 asciidoctor: WARNING: skipping reference to missing attribute: scs-app-starters-docs-htmlsingle
19-Dec-2018 21:23:18 asciidoctor: WARNING: skipping reference to missing attribute: scs-app-starters-docs-htmlsingle
19-Dec-2018 21:23:18 asciidoctor: WARNING: skipping reference to missing attribute: scs-app-starters-docs-htmlsingle
19-Dec-2018 21:23:18 asciidoctor: WARNING: skipping reference to missing attribute: scs-app-starters-docs-htmlsingle
19-Dec-2018 21:23:18 asciidoctor: WARNING: skipping reference to missing attribute: scs-app-starters-docs-htmlsingle
19-Dec-2018 21:23:18 asciidoctor: WARNING: skipping reference to missing attribute: scs-app-starters-docs-htmlsingle
19-Dec-2018 21:23:18 asciidoctor: WARNING: skipping reference to missing attribute: scs-app-starters-docs-htmlsingle
19-Dec-2018 21:23:18 asciidoctor: WARNING: skipping reference to missing attribute: scs-app-starters-docs-htmlsingle
19-Dec-2018 21:23:18 asciidoctor: WARNING: skipping reference to missing attribute: scs-app-starters-docs-htmlsingle
19-Dec-2018 21:23:18 asciidoctor: WARNING: skipping reference to missing attribute: scs-app-starters-docs-htmlsingle
19-Dec-2018 21:23:18 asciidoctor: WARNING: skipping reference to missing attribute: scs-app-starters-docs-htmlsingle
19-Dec-2018 21:23:18 asciidoctor: WARNING: skipping reference to missing attribute: scs-app-starters-docs-htmlsingle
19-Dec-2018 21:23:18 asciidoctor: WARNING: skipping reference to missing attribute: scs-app-starters-docs-htmlsingle
19-Dec-2018 21:23:18 asciidoctor: WARNING: skipping reference to missing attribute: scs-app-starters-docs-htmlsingle
19-Dec-2018 21:23:18 asciidoctor: WARNING: skipping reference to missing attribute: scs-app-starters-docs-htmlsingle
19-Dec-2018 21:23:18 asciidoctor: WARNING: skipping reference to missing attribute: scs-app-starters-docs-htmlsingle
19-Dec-2018 21:23:18 asciidoctor: WARNING: skipping reference to missing attribute: scs-app-starters-docs-htmlsingle
19-Dec-2018 21:23:18 asciidoctor: WARNING: skipping reference to missing attribute: scs-app-starters-docs-htmlsingle
19-Dec-2018 21:23:18 asciidoctor: WARNING: skipping reference to missing attribute: scs-app-starters-docs-htmlsingle
19-Dec-2018 21:23:18 asciidoctor: WARNING: skipping reference to missing attribute: scs-app-starters-docs-htmlsingle
19-Dec-2018 21:23:18 asciidoctor: WARNING: skipping reference to missing attribute: scs-app-starters-docs-htmlsingle
19-Dec-2018 21:23:18 asciidoctor: WARNING: skipping reference to missing attribute: scs-app-starters-docs-htmlsingle
19-Dec-2018 21:23:18 asciidoctor: WARNING: skipping reference to missing attribute: scs-app-starters-docs-htmlsingle
19-Dec-2018 21:23:18 asciidoctor: WARNING: skipping reference to missing attribute: scs-app-starters-docs-htmlsingle
19-Dec-2018 21:23:18 asciidoctor: WARNING: skipping reference to missing attribute: scs-app-starters-docs-htmlsingle
19-Dec-2018 21:23:18 asciidoctor: WARNING: skipping reference to missing attribute: scs-app-starters-docs-htmlsingle
19-Dec-2018 21:23:18 asciidoctor: WARNING: skipping reference to missing attribute: scs-app-starters-docs-htmlsingle
19-Dec-2018 21:23:18 asciidoctor: WARNING: skipping reference to missing attribute: scs-app-starters-docs-htmlsingle
19-Dec-2018 21:23:18 asciidoctor: WARNING: skipping reference to missing attribute: scs-app-starters-docs-htmlsingle
19-Dec-2018 21:23:18 asciidoctor: WARNING: skipping reference to missing attribute: scs-app-starters-docs-htmlsingle
19-Dec-2018 21:23:18 asciidoctor: WARNING: skipping reference to missing attribute: scs-app-starters-docs-htmlsingle
19-Dec-2018 21:23:18 asciidoctor: WARNING: skipping reference to missing attribute: scs-app-starters-docs-htmlsingle
19-Dec-2018 21:23:18 asciidoctor: WARNING: skipping reference to missing attribute: scs-app-starters-docs-htmlsingle
19-Dec-2018 21:23:18 asciidoctor: WARNING: skipping reference to missing attribute: scs-app-starters-docs-htmlsingle
19-Dec-2018 21:23:18 asciidoctor: WARNING: skipping reference to missing attribute: scs-app-starters-docs-htmlsingle
19-Dec-2018 21:23:18 asciidoctor: WARNING: skipping reference to missing attribute: scs-app-starters-docs-htmlsingle
19-Dec-2018 21:23:18 asciidoctor: WARNING: skipping reference to missing attribute: scs-app-starters-docs-htmlsingle
19-Dec-2018 21:23:18 asciidoctor: WARNING: skipping reference to missing attribute: scs-app-starters-docs-htmlsingle
19-Dec-2018 21:23:18 asciidoctor: WARNING: skipping reference to missing attribute: scs-app-starters-docs-htmlsingle
19-Dec-2018 21:23:18 asciidoctor: WARNING: skipping reference to missing attribute: scs-app-starters-docs-htmlsingle
19-Dec-2018 21:23:18 asciidoctor: WARNING: skipping reference to missing attribute: scs-app-starters-docs-htmlsingle
19-Dec-2018 21:23:18 asciidoctor: WARNING: skipping reference to missing attribute: scs-app-starters-docs-htmlsingle
19-Dec-2018 21:23:18 asciidoctor: WARNING: skipping reference to missing attribute: scs-app-starters-docs-htmlsingle
19-Dec-2018 21:23:18 asciidoctor: WARNING: skipping reference to missing attribute: scs-app-starters-docs-htmlsingle
19-Dec-2018 21:23:18 asciidoctor: WARNING: skipping reference to missing attribute: scs-app-starters-docs-htmlsingle
19-Dec-2018 21:23:18 asciidoctor: WARNING: skipping reference to missing attribute: scs-app-starters-docs-htmlsingle
19-Dec-2018 21:23:18 asciidoctor: WARNING: skipping reference to missing attribute: scs-app-starters-docs-htmlsingle
19-Dec-2018 21:23:18 asciidoctor: WARNING: skipping reference to missing attribute: scs-app-starters-docs-htmlsingle
19-Dec-2018 21:23:18 asciidoctor: WARNING: skipping reference to missing attribute: scs-app-starters-docs-htmlsingle
19-Dec-2018 21:23:18 asciidoctor: WARNING: skipping reference to missing attribute: scs-app-starters-docs-htmlsingle
19-Dec-2018 21:23:18 asciidoctor: WARNING: skipping reference to missing attribute: scs-app-starters-docs-htmlsingle
19-Dec-2018 21:23:18 asciidoctor: WARNING: skipping reference to missing attribute: scs-app-starters-docs-htmlsingle
19-Dec-2018 21:23:18 asciidoctor: WARNING: skipping reference to missing attribute: scs-app-starters-docs-htmlsingle
19-Dec-2018 21:23:18 asciidoctor: WARNING: skipping reference to missing attribute: scs-app-starters-docs-htmlsingle
19-Dec-2018 21:23:18 asciidoctor: WARNING: skipping reference to missing attribute: scs-app-starters-docs-htmlsingle
19-Dec-2018 21:23:18 asciidoctor: WARNING: skipping reference to missing attribute: scs-app-starters-docs-htmlsingle
19-Dec-2018 21:23:18 asciidoctor: WARNING: skipping reference to missing attribute: scs-app-starters-docs-htmlsingle
19-Dec-2018 21:23:18 asciidoctor: WARNING: skipping reference to missing attribute: spring-cloud-stream-docs
19-Dec-2018 21:23:18 asciidoctor: WARNING: skipping reference to missing attribute: spring-cloud-stream-docs
19-Dec-2018 21:23:18 asciidoctor: WARNING: skipping reference to missing attribute: spring-cloud-stream-docs
19-Dec-2018 21:23:18 asciidoctor: WARNING: skipping reference to missing attribute: spring-cloud-stream-docs
19-Dec-2018 21:23:18 asciidoctor: WARNING: skipping reference to missing attribute: spring-cloud-stream-docs
19-Dec-2018 21:23:18 asciidoctor: WARNING: skipping reference to missing attribute: spring-cloud-stream-docs
19-Dec-2018 21:23:18 asciidoctor: WARNING: skipping reference to missing attribute: spring-cloud-stream-docs
19-Dec-2018 21:23:18 asciidoctor: WARNING: skipping reference to missing attribute: spring-cloud-stream-docs
19-Dec-2018 21:23:18 asciidoctor: WARNING: skipping reference to missing attribute: spring-cloud-stream-docs
19-Dec-2018 21:23:18 asciidoctor: WARNING: skipping reference to missing attribute: spring-cloud-stream-docs
19-Dec-2018 21:23:18 asciidoctor: WARNING: skipping reference to missing attribute: spring-cloud-stream-docs
19-Dec-2018 21:23:18 asciidoctor: WARNING: skipping reference to missing attribute: scs-app-starters-docs
19-Dec-2018 21:23:18 asciidoctor: WARNING: skipping reference to missing attribute: spring-cloud-stream-docs
19-Dec-2018 21:23:18 asciidoctor: WARNING: skipping reference to missing attribute: spring-cloud-stream-docs
19-Dec-2018 21:23:18 asciidoctor: WARNING: skipping reference to missing attribute: scs-app-starters-docs
19-Dec-2018 21:23:18 asciidoctor: WARNING: skipping reference to missing attribute: spring-cloud-task-version
19-Dec-2018 21:23:18 asciidoctor: WARNING: skipping reference to missing attribute: spring-cloud-task-version
19-Dec-2018 21:23:18 asciidoctor: WARNING: skipping reference to missing attribute: spring-batch-version
19-Dec-2018 21:23:18 asciidoctor: WARNING: skipping reference to missing attribute: spring-boot-docs-reference
19-Dec-2018 21:23:18 [INFO] Rendered /opt/bamboo-home/xml-data/build-dir/SCD-K8S110BMASTER-JOB1/spring-cloud-dataflow-server-kubernetes-docs/src/main/asciidoc/index.adoc
19-Dec-2018 21:23:18 [INFO]
19-Dec-2018 21:23:18 [INFO] --- docbkx-maven-plugin:2.0.15:generate-html (html) @ spring-cloud-dataflow-server-kubernetes-docs ---
19-Dec-2018 21:23:18 [INFO] Executing tasks
19-Dec-2018 21:23:18      [copy] Copying 24 files to /opt/bamboo-home/xml-data/build-dir/SCD-K8S110BMASTER-JOB1/spring-cloud-dataflow-server-kubernetes-docs/target/generated-docs/images
19-Dec-2018 21:23:18 [INFO] Executed tasks
19-Dec-2018 21:23:18 [INFO] Executing tasks
19-Dec-2018 21:23:18      [copy] Copying 25 files to /opt/bamboo-home/xml-data/build-dir/SCD-K8S110BMASTER-JOB1/spring-cloud-dataflow-server-kubernetes-docs/target/contents/reference/html/images
19-Dec-2018 21:23:18      [copy] Copying 4 files to /opt/bamboo-home/xml-data/build-dir/SCD-K8S110BMASTER-JOB1/spring-cloud-dataflow-server-kubernetes-docs/target/contents/reference/html/css
19-Dec-2018 21:23:18 [INFO] Executed tasks
19-Dec-2018 21:23:18 [INFO]
19-Dec-2018 21:23:18 [INFO] --- maven-resources-plugin:3.1.0:resources (default-resources) @ spring-cloud-dataflow-server-kubernetes-docs ---
19-Dec-2018 21:23:18 [INFO] Using 'UTF-8' encoding to copy filtered resources.
19-Dec-2018 21:23:18 [INFO] skip non existing resourceDirectory /opt/bamboo-home/xml-data/build-dir/SCD-K8S110BMASTER-JOB1/spring-cloud-dataflow-server-kubernetes-docs/src/main/resources
19-Dec-2018 21:23:18 [INFO] skip non existing resourceDirectory /opt/bamboo-home/xml-data/build-dir/SCD-K8S110BMASTER-JOB1/spring-cloud-dataflow-server-kubernetes-docs/src/main/resources
19-Dec-2018 21:23:18 [INFO]
19-Dec-2018 21:23:18 [INFO] --- maven-compiler-plugin:3.8.0:compile (default-compile) @ spring-cloud-dataflow-server-kubernetes-docs ---
19-Dec-2018 21:23:18 [INFO] No sources to compile
19-Dec-2018 21:23:18 [INFO]
19-Dec-2018 21:23:18 [INFO] --- maven-resources-plugin:3.1.0:testResources (default-testResources) @ spring-cloud-dataflow-server-kubernetes-docs ---
19-Dec-2018 21:23:18 [INFO] Using 'UTF-8' encoding to copy filtered resources.
19-Dec-2018 21:23:18 [INFO] skip non existing resourceDirectory /opt/bamboo-home/xml-data/build-dir/SCD-K8S110BMASTER-JOB1/spring-cloud-dataflow-server-kubernetes-docs/src/test/resources
19-Dec-2018 21:23:18 [INFO]
19-Dec-2018 21:23:18 [INFO] --- maven-compiler-plugin:3.8.0:testCompile (default-testCompile) @ spring-cloud-dataflow-server-kubernetes-docs ---
19-Dec-2018 21:23:18 [INFO] No sources to compile
19-Dec-2018 21:23:18 [INFO]
19-Dec-2018 21:23:18 [INFO] --- maven-surefire-plugin:2.22.0:test (default-test) @ spring-cloud-dataflow-server-kubernetes-docs ---
19-Dec-2018 21:23:18 [INFO] No tests to run.
19-Dec-2018 21:23:18 [INFO]
19-Dec-2018 21:23:18 [INFO] --- jacoco-maven-plugin:0.7.9:report (report) @ spring-cloud-dataflow-server-kubernetes-docs ---
19-Dec-2018 21:23:18 [INFO] Skipping JaCoCo execution due to missing execution data file.
19-Dec-2018 21:23:18 [INFO]
19-Dec-2018 21:23:18 [INFO] --- grep-maven-plugin:1.0:grep (default) @ spring-cloud-dataflow-server-kubernetes-docs ---
19-Dec-2018 21:23:18 [info] grepping for Unresolved directive in .*\.adoc - include:: in /opt/bamboo-home/xml-data/build-dir/SCD-K8S110BMASTER-JOB1/spring-cloud-dataflow-server-kubernetes-docs/target/generated-docs/index.html
19-Dec-2018 21:23:18 [info] <p>Unresolved directive in appendix.adoc - include::https://raw.githubusercontent.com/spring-cloud/spring-cloud-dataflow/master/spring-cloud-dataflow-docs/src/main/asciidoc/appendix-migration-guide.adoc[]</p>
19-Dec-2018 21:23:18 [error] Unresolved directive in .*\.adoc - include:: found in  /opt/bamboo-home/xml-data/build-dir/SCD-K8S110BMASTER-JOB1/spring-cloud-dataflow-server-kubernetes-docs/target/generated-docs/index.html:10940 (<p>Unresolved directive in appendix.adoc - include::https://raw.githubusercontent.com/spring-cloud/spring-cloud-dataflow/master/spring-cloud-dataflow-docs/src/main/asciidoc/appendix-migration-guide.adoc[]</p>)
19-Dec-2018 21:23:18 [INFO] ------------------------------------------------------------------------
19-Dec-2018 21:23:18 [INFO] Reactor Summary:
19-Dec-2018 21:23:18 [INFO]
19-Dec-2018 21:23:18 [INFO] spring-cloud-dataflow-server-kubernetes-parent ..... SUCCESS [  1.496 s]
19-Dec-2018 21:23:18 [INFO] spring-cloud-dataflow-server-kubernetes-autoconfig . SUCCESS [  7.269 s]
19-Dec-2018 21:23:18 [INFO] Kubernetes Data Flow Server ........................ SUCCESS [ 20.788 s]
19-Dec-2018 21:23:18 [INFO] spring-cloud-dataflow-server-kubernetes-docs ....... FAILURE [  9.110 s]
19-Dec-2018 21:23:18 [INFO] ------------------------------------------------------------------------
19-Dec-2018 21:23:18 [INFO] BUILD FAILURE
19-Dec-2018 21:23:18 [INFO] ------------------------------------------------------------------------
19-Dec-2018 21:23:18 [INFO] Total time: 41.445 s
19-Dec-2018 21:23:18 [INFO] Finished at: 2018-12-19T21:23:18Z
19-Dec-2018 21:23:19 [INFO] Final Memory: 153M/1356M
19-Dec-2018 21:23:19 [INFO] ------------------------------------------------------------------------
19-Dec-2018 21:23:19 [ERROR] Failed to execute goal net.radai:grep-maven-plugin:1.0:grep (default) on project spring-cloud-dataflow-server-kubernetes-docs: Unresolved directive in .*\.adoc - include:: found in  /opt/bamboo-home/xml-data/build-dir/SCD-K8S110BMASTER-JOB1/spring-cloud-dataflow-server-kubernetes-docs/target/generated-docs/index.html:10940 (<p>Unresolved directive in appendix.adoc - include::https://raw.githubusercontent.com/spring-cloud/spring-cloud-dataflow/master/spring-cloud-dataflow-docs/src/main/asciidoc/appendix-migration-guide.adoc[]</p>) -> [Help 1]
19-Dec-2018 21:23:19 [ERROR]
19-Dec-2018 21:23:19 [ERROR] To see the full stack trace of the errors, re-run Maven with the -e switch.
19-Dec-2018 21:23:19 [ERROR] Re-run Maven using the -X switch to enable full debug logging.
19-Dec-2018 21:23:19 [ERROR]
19-Dec-2018 21:23:19 [ERROR] For more information about the errors and possible solutions, please read the following articles:
19-Dec-2018 21:23:19 [ERROR] [Help 1] http://cwiki.apache.org/confluence/display/MAVEN/MojoFailureException
19-Dec-2018 21:23:19 [ERROR]
19-Dec-2018 21:23:19 [ERROR] After correcting the problems, you can resume the build with the command
19-Dec-2018 21:23:19 [ERROR]   mvn <goals> -rf :spring-cloud-dataflow-server-kubernetes-docs
19-Dec-2018 21:23:19
19-Dec-2018 21:23:19 Failing task since return code of [/opt/jdk-8/bin/java -cp /opt/maven-3.5/boot/plexus-classworlds-2.5.2.jar -Dclassworlds.conf=/tmp/artifactoryM21290563521228874520conf -DbuildInfoConfig.propertiesFile=/tmp/buildInfo4931690927534646109.properties -Dmaven.home=/opt/maven-3.5 -Dmaven.multiModuleProjectDirectory=/opt/bamboo-home/xml-data/build-dir/SCD-K8S110BMASTER-JOB1 org.codehaus.plexus.classworlds.launcher.Launcher -s .settings.xml clean install -Pfull -U --batch-mode -Dartifactory.publish.password=********] was 1 while expected 0
19-Dec-2018 21:23:19 Parsing test results under /opt/bamboo-home/xml-data/build-dir/SCD-K8S110BMASTER-JOB1...
19-Dec-2018 21:23:19 Finished task 'Build and publish Spring Cloud Data' with result: Failed
19-Dec-2018 21:23:19 Running post build plugin 'Docker Container Cleanup'
19-Dec-2018 21:23:19 Running post build plugin 'NCover Results Collector'
19-Dec-2018 21:23:19 Running post build plugin 'Artifactory Release Management Staging'
19-Dec-2018 21:23:19 Running post build plugin 'Artifactory Build Info Copier'
19-Dec-2018 21:23:19 Running post build plugin 'Artifactory Gradle Properties Info Copier'
19-Dec-2018 21:23:19 Running post build plugin 'Clover Results Collector'
19-Dec-2018 21:23:19 Running post build plugin 'npm Cache Cleanup'
19-Dec-2018 21:23:19 Running post build plugin 'Artifact Copier'
19-Dec-2018 21:23:19 Publishing an artifact: Test Results
19-Dec-2018 21:23:20 Finished publishing of artifact Shared artifact: [Test Results], pattern: [**/target/surefire-reports/**/*.*] in 1.433 s
19-Dec-2018 21:23:20 Successfully removed working directory at '/opt/bamboo-home/xml-data/build-dir/SCD-K8S110BMASTER-JOB1'
19-Dec-2018 21:23:20 Finalising the build...
19-Dec-2018 21:23:20 Stopping timer.
19-Dec-2018 21:23:20 Build SCD-K8S110BMASTER-JOB1-381 completed.
19-Dec-2018 21:23:20 Running on server: post build plugin 'NCover Results Collector'
19-Dec-2018 21:23:20 Running on server: post build plugin 'Build Hanging Detection Configuration'
19-Dec-2018 21:23:20 Running on server: post build plugin 'Clover Delta Calculator'
19-Dec-2018 21:23:20 Running on server: post build plugin 'Maven Dependencies Postprocessor'
19-Dec-2018 21:23:20 All post build plugins have finished
19-Dec-2018 21:23:20 Generating build results summary...
19-Dec-2018 21:23:21 Saving build results to disk...
19-Dec-2018 21:23:21 Logging substituted variables...
19-Dec-2018 21:23:21 Indexing build results...
19-Dec-2018 21:23:21 Finished building SCD-K8S110BMASTER-JOB1-381.