Build: #21 failed Changes by Ilayaperumal Gopinathan

Stages & jobs

  1. Default Stage

  2. Build Docker Images and upload

Test results

  • 1,178 tests in total
  • 1 test failed
  • 1 failure is new
  • 8 tests were quarantined / skipped
  • 1 minute taken in total.
New test failures 1
Status Test View job Duration
Collapse Failed LocalServerSecurityWithLdapSimpleBindGroupMappingTests org.springframework.cloud.dataflow.server.local.security.LocalServerSecurityWithLdapSimpleBindGroupMappingTests History
Build and install SCDF < 1 sec
java.lang.RuntimeException: Server startup failed
Caused by: org.apache.directory.shared.ldap.exception.LdapConfigurationException: Failed to bind an LDAP service (47986) to the service registry.
Caused by: java.net.BindException: Address already in use
Skipped tests 8
Status Test Failing since View job
Skipped StreamDefinitionToDslConverterTests testXD2416_1 History
Build and install SCDF
Skipped StreamDefinitionToDslConverterTests quotesInParams History
Build and install SCDF
Skipped StreamDefinitionToDslConverterTests testXD2416_2 History
Build and install SCDF
Skipped TaskParserTests transitionToSplit History
Build and install SCDF
Skipped DataFlowServerConfigurationTests testNoServer History
Build and install SCDF
Skipped DataFlowServerConfigurationTests testStartEmbeddedH2Server History
Build and install SCDF
Skipped RuntimeAppsControllerSkipperTests testFindNonExistentAppInstance History
Build and install SCDF
Skipped LocalServerSecurityWithLdapSearchAndBindSslTests org.springframework.cloud.dataflow.server.local.security.LocalServerSecurityWithLdapSearchAndBindSslTests History
Build and install SCDF