Build: #62 failed Manual run by Gunnar Hillert

Stages & jobs

  1. Default Stage

  2. Build Docker Images and upload

Logs

The following logs have been generated by the jobs in this plan.
  • Expand all
  • Collapse all
Job Logs
Collapse Build and install SCDF Default Stage Download or View
21-Feb-2019 22:13:01 [INFO] Spring Cloud Data Flow Docs for Classic mode ....... SKIPPED
21-Feb-2019 22:13:01 [INFO] Spring Cloud Data Flow Skipper Docs ................ SKIPPED
21-Feb-2019 22:13:01 [INFO] Spring Cloud Data Flow Docs ........................ SKIPPED
21-Feb-2019 22:13:01 [INFO] spring-cloud-dataflow-dependencies ................. SKIPPED
21-Feb-2019 22:13:01 [INFO] ------------------------------------------------------------------------
21-Feb-2019 22:13:01 [INFO] BUILD FAILURE
21-Feb-2019 22:13:01 [INFO] ------------------------------------------------------------------------
21-Feb-2019 22:13:01 [INFO] Total time: 03:16 min
21-Feb-2019 22:13:01 [INFO] Finished at: 2019-02-21T22:13:01Z
21-Feb-2019 22:13:02 [INFO] Final Memory: 102M/826M
21-Feb-2019 22:13:02 [INFO] ------------------------------------------------------------------------
21-Feb-2019 22:13:02 [ERROR] Failed to execute goal org.apache.maven.plugins:maven-surefire-plugin:2.22.0:test (default-test) on project spring-cloud-dataflow-server-core: There are test failures.
21-Feb-2019 22:13:02 [ERROR]
21-Feb-2019 22:13:02 [ERROR] Please refer to /opt/bamboo-home/xml-data/build-dir/SCD-SCDF17X-JOB1/spring-cloud-dataflow-server-core/target/surefire-reports for the individual test results.
21-Feb-2019 22:13:02 [ERROR] Please refer to dump files (if any exist) [date]-jvmRun[N].dump, [date].dumpstream and [date]-jvmRun[N].dumpstream.
21-Feb-2019 22:13:02 [ERROR] -> [Help 1]
21-Feb-2019 22:13:02 [ERROR]
21-Feb-2019 22:13:02 [ERROR] To see the full stack trace of the errors, re-run Maven with the -e switch.
21-Feb-2019 22:13:02 [ERROR] Re-run Maven using the -X switch to enable full debug logging.
21-Feb-2019 22:13:02 [ERROR]
21-Feb-2019 22:13:02 [ERROR] For more information about the errors and possible solutions, please read the following articles:
21-Feb-2019 22:13:02 [ERROR] [Help 1] http://cwiki.apache.org/confluence/display/MAVEN/MojoFailureException
21-Feb-2019 22:13:02 [ERROR]
21-Feb-2019 22:13:02 [ERROR] After correcting the problems, you can resume the build with the command
21-Feb-2019 22:13:02 [ERROR]   mvn <goals> -rf :spring-cloud-dataflow-server-core