Build: #70 failed Manual run by Ilayaperumal Gopinathan

Stages & jobs

  1. Default Stage

  2. Build Docker Images and upload

Logs

The following logs have been generated by the jobs in this plan.
  • Expand all
  • Collapse all
Job Logs
Collapse Build and install SCDF Default Stage Download or View
02-Jul-2019 06:01:47 [INFO] spring-cloud-dataflow-shell ........................ SKIPPED
02-Jul-2019 06:01:47 [INFO] Spring Cloud Data Flow Docs for Classic mode ....... SKIPPED
02-Jul-2019 06:01:47 [INFO] Spring Cloud Data Flow Skipper Docs ................ SKIPPED
02-Jul-2019 06:01:47 [INFO] Spring Cloud Data Flow Docs ........................ SKIPPED
02-Jul-2019 06:01:47 [INFO] spring-cloud-dataflow-dependencies 1.7.5.BUILD-SNAPSHOT SKIPPED
02-Jul-2019 06:01:47 [INFO] ------------------------------------------------------------------------
02-Jul-2019 06:01:47 [INFO] BUILD FAILURE
02-Jul-2019 06:01:47 [INFO] ------------------------------------------------------------------------
02-Jul-2019 06:01:47 [INFO] Total time: 03:53 min
02-Jul-2019 06:01:47 [INFO] Finished at: 2019-07-02T06:01:47Z
02-Jul-2019 06:01:47 [INFO] ------------------------------------------------------------------------
02-Jul-2019 06:01:47 [ERROR] Failed to execute goal org.apache.maven.plugins:maven-surefire-plugin:2.22.0:test (default-test) on project spring-cloud-dataflow-server-core: There are test failures.
02-Jul-2019 06:01:47 [ERROR]
02-Jul-2019 06:01:47 [ERROR] Please refer to /opt/bamboo-home/xml-data/build-dir/SCD-SCDF17X-JOB1/spring-cloud-dataflow-server-core/target/surefire-reports for the individual test results.
02-Jul-2019 06:01:47 [ERROR] Please refer to dump files (if any exist) [date]-jvmRun[N].dump, [date].dumpstream and [date]-jvmRun[N].dumpstream.
02-Jul-2019 06:01:47 [ERROR] -> [Help 1]
02-Jul-2019 06:01:47 [ERROR]
02-Jul-2019 06:01:47 [ERROR] To see the full stack trace of the errors, re-run Maven with the -e switch.
02-Jul-2019 06:01:47 [ERROR] Re-run Maven using the -X switch to enable full debug logging.
02-Jul-2019 06:01:47 [ERROR]
02-Jul-2019 06:01:47 [ERROR] For more information about the errors and possible solutions, please read the following articles:
02-Jul-2019 06:01:47 [ERROR] [Help 1] http://cwiki.apache.org/confluence/display/MAVEN/MojoFailureException
02-Jul-2019 06:01:47 [ERROR]
02-Jul-2019 06:01:47 [ERROR] After correcting the problems, you can resume the build with the command
02-Jul-2019 06:01:47 [ERROR]   mvn <goals> -rf :spring-cloud-dataflow-server-core