Build: #21 failed

Job: Build and install SCDF failed

Stages & jobs

  1. Default Stage

  2. Build Docker Images and upload

Test results

  • 1,178 tests in total
  • 1 test failed
  • 1 failure is new
  • 8 tests were quarantined / skipped
  • 1 minute taken in total.

Build 21 has the following 1 errors: 1 new failure(s) occurred since the previous build.

New test failures 1
Status Test Duration
Collapse Failed LocalServerSecurityWithLdapSimpleBindGroupMappingTests org.springframework.cloud.dataflow.server.local.security.LocalServerSecurityWithLdapSimpleBindGroupMappingTests History
< 1 sec
java.lang.RuntimeException: Server startup failed
Caused by: org.apache.directory.shared.ldap.exception.LdapConfigurationException: Failed to bind an LDAP service (47986) to the service registry.
Caused by: java.net.BindException: Address already in use