Build: #62 failed

Job: Build and install SCDF failed

Stages & jobs

  1. Default Stage

  2. Build Docker Images and upload

Build log

The build generated 14,748 lines of output.The output is too long and has been truncated to the last 1,000 lines. Download or view full build log

21-Feb-2019 22:12:55
21-Feb-2019 22:12:55 Resolved Exception:
21-Feb-2019 22:12:55              Type = null
21-Feb-2019 22:12:55
21-Feb-2019 22:12:55 ModelAndView:
21-Feb-2019 22:12:55         View name = null
21-Feb-2019 22:12:55              View = null
21-Feb-2019 22:12:55             Model = null
21-Feb-2019 22:12:55
21-Feb-2019 22:12:55 FlashMap:
21-Feb-2019 22:12:55        Attributes = null
21-Feb-2019 22:12:55
21-Feb-2019 22:12:55 MockHttpServletResponse:
21-Feb-2019 22:12:55            Status = 200
21-Feb-2019 22:12:55     Error message = null
21-Feb-2019 22:12:55           Headers = {Content-Type=[application/json;charset=UTF-8]}
21-Feb-2019 22:12:55      Content type = application/json;charset=UTF-8
21-Feb-2019 22:12:55              Body = {"featureInfo":{"analyticsEnabled":true,"streamsEnabled":true,"tasksEnabled":true,"skipperEnabled":false,"schedulerEnabled":false},"versionInfo":{"implementation":{"name":"${info.app.name}","version":"${info.app.version}"},"core":{"name":"Spring Cloud Data Flow Core","version":"1.7.5.BUILD-SNAPSHOT"},"dashboard":{"name":"Spring Cloud Dataflow UI","version":"1.7.3.RELEASE"},"shell":{"name":"Spring Cloud Data Flow Shell","version":"1.2.3.RC1","url":"https://repo.spring.io/libs-milestone/org/springframework/cloud/spring-cloud-dataflow-shell/1.2.3.RC1/spring-cloud-dataflow-shell-1.2.3.RC1.jar"}},"securityInfo":{"authenticationEnabled":false,"authorizationEnabled":false,"formLogin":false,"authenticated":false,"username":null,"roles":[]},"runtimeEnvironment":{"appDeployer":{"deployerImplementationVersion":"testAppDepImplementationVersion","deployerName":"testAppDepImplementationName","deployerSpiVersion":"1.8.0_144","javaVersion":"1.8.0_144","platformApiVersion":"testAppDepPlatformApiVersion","platformClientVersion":"testAppDepPlatformClientVersion","platformHostVersion":"testAppDepPlatformHostVersion","platformSpecificInfo":{},"platformType":"testAppDepPlatformType","springBootVersion":"1.5.16.RELEASE","springVersion":"4.3.19.RELEASE"},"taskLauncher":{"deployerImplementationVersion":"testTaskDepImplementationVersion","deployerName":"testTaskDepImplementationName","deployerSpiVersion":"1.8.0_144","javaVersion":"1.8.0_144","platformApiVersion":"testTaskDepPlatformApiVersion","platformClientVersion":"testTaskDepPlatformClientVersion","platformHostVersion":"testTaskDepPlatformHostVersion","platformSpecificInfo":{},"platformType":"testTaskDepPlatformType","springBootVersion":"1.5.16.RELEASE","springVersion":"4.3.19.RELEASE"}},"links":[{"rel":"self","href":"http://localhost/about"}]}
21-Feb-2019 22:12:55     Forwarded URL = null
21-Feb-2019 22:12:55    Redirected URL = null
21-Feb-2019 22:12:55           Cookies = []
21-Feb-2019 22:12:55 2019-02-21 22:12:55.098  INFO 24380 --- [           main] j.LocalContainerEntityManagerFactoryBean : Closing JPA EntityManagerFactory for persistence unit 'default'
21-Feb-2019 22:12:55 2019-02-21 22:12:55.098  INFO 24380 --- [           main] .SchemaDropperImpl$DelayedDropActionImpl : HHH000477: Starting delayed drop of schema as part of SessionFactory shut-down'
21-Feb-2019 22:12:55 2019-02-21 22:12:55.099  INFO 24380 --- [           main] o.s.j.d.e.EmbeddedDatabaseFactory        : Shutting down embedded database: url='jdbc:h2:mem:testdb;DB_CLOSE_DELAY=-1;DB_CLOSE_ON_EXIT=false'
21-Feb-2019 22:12:55 2019-02-21 22:12:55.099  INFO 24380 --- [           main] junit.logTestName                        : Finished Test testRC
21-Feb-2019 22:12:55 [INFO] Tests run: 1, Failures: 0, Errors: 0, Skipped: 0, Time elapsed: 0.621 s - in org.springframework.cloud.dataflow.server.controller.AboutControllerTests$RCUrlTests
21-Feb-2019 22:12:55 [INFO] Running org.springframework.cloud.dataflow.server.controller.RuntimeAppsControllerTests
21-Feb-2019 22:12:55 2019-02-21 22:12:55.100  INFO 24380 --- [           main] o.s.t.c.support.AbstractContextLoader    : Could not detect default resource locations for test class [org.springframework.cloud.dataflow.server.controller.RuntimeAppsControllerTests]: no resource found for suffixes {-context.xml, Context.groovy}.
21-Feb-2019 22:12:55   ____                              ____ _                __
21-Feb-2019 22:12:55 / ___| _ __  _ __(_)_ __   __ _   / ___| | ___  _   _  __| |
21-Feb-2019 22:12:55 \___ \| '_ \| '__| | '_ \ / _` | | |   | |/ _ \| | | |/ _` |
21-Feb-2019 22:12:55   ___) | |_) | |  | | | | | (_| | | |___| | (_) | |_| | (_| |
21-Feb-2019 22:12:55 |____/| .__/|_|  |_|_| |_|\__, |  \____|_|\___/ \__,_|\__,_|
21-Feb-2019 22:12:55   ____ |_|    _          __|___/                 __________
21-Feb-2019 22:12:55 |  _ \  __ _| |_ __ _  |  ___| | _____      __  \ \ \ \ \ \
21-Feb-2019 22:12:55 | | | |/ _` | __/ _` | | |_  | |/ _ \ \ /\ / /   \ \ \ \ \ \
21-Feb-2019 22:12:55 | |_| | (_| | || (_| | |  _| | | (_) \ V  V /    / / / / / /
21-Feb-2019 22:12:55 |____/ \__,_|\__\__,_| |_|   |_|\___/ \_/\_/    /_/_/_/_/_/
21-Feb-2019 22:12:55
21-Feb-2019 22:12:55
21-Feb-2019 22:12:55
21-Feb-2019 22:12:55 2019-02-21 22:12:55.284  INFO 24380 --- [           main] c.c.c.ConfigServicePropertySourceLocator : Fetching config from server at: http://localhost:8888
21-Feb-2019 22:12:55 2019-02-21 22:12:55.286  WARN 24380 --- [           main] c.c.c.ConfigServicePropertySourceLocator : Could not locate PropertySource: I/O error on GET request for "http://localhost:8888/application/default": Connection refused (Connection refused); nested exception is java.net.ConnectException: Connection refused (Connection refused)
21-Feb-2019 22:12:55 2019-02-21 22:12:55.287  INFO 24380 --- [           main] o.s.c.d.s.c.RuntimeAppsControllerTests   : No active profile set, falling back to default profiles: default
21-Feb-2019 22:12:55 2019-02-21 22:12:55.314  INFO 24380 --- [           main] .s.d.r.c.RepositoryConfigurationDelegate : Multiple Spring Data modules found, entering strict repository configuration mode!
21-Feb-2019 22:12:55 2019-02-21 22:12:55.405  INFO 24380 --- [           main] o.s.j.d.e.EmbeddedDatabaseFactory        : Starting embedded database: url='jdbc:h2:mem:testdb;DB_CLOSE_DELAY=-1;DB_CLOSE_ON_EXIT=false', username='sa'
21-Feb-2019 22:12:55 2019-02-21 22:12:55.431  INFO 24380 --- [           main] j.LocalContainerEntityManagerFactoryBean : Building JPA container EntityManagerFactory for persistence unit 'default'
21-Feb-2019 22:12:55 2019-02-21 22:12:55.431  INFO 24380 --- [           main] o.hibernate.jpa.internal.util.LogHelper  : HHH000204: Processing PersistenceUnitInfo [
21-Feb-2019 22:12:55         name: default
21-Feb-2019 22:12:55         ...]
21-Feb-2019 22:12:55 2019-02-21 22:12:55.435  INFO 24380 --- [           main] org.hibernate.dialect.Dialect            : HHH000400: Using dialect: org.hibernate.dialect.H2Dialect
21-Feb-2019 22:12:55 2019-02-21 22:12:55.450  INFO 24380 --- [           main] o.h.t.schema.internal.SchemaCreatorImpl  : HHH000476: Executing import script 'org.hiber[email protected]6e670b85'
21-Feb-2019 22:12:55 2019-02-21 22:12:55.450  INFO 24380 --- [           main] j.LocalContainerEntityManagerFactoryBean : Initialized JPA EntityManagerFactory for persistence unit 'default'
21-Feb-2019 22:12:55 2019-02-21 22:12:55.617  INFO 24380 --- [           main] o.s.c.d.s.c.support.MetricStore          : Metrics Collector URI = []
21-Feb-2019 22:12:55 2019-02-21 22:12:55.667  INFO 24380 --- [           main] o.s.c.d.s.c.RuntimeAppsControllerTests   : Started RuntimeAppsControllerTests in 0.56 seconds (JVM running for 153.275)
21-Feb-2019 22:12:55 2019-02-21 22:12:55.671  INFO 24380 --- [           main] o.s.t.web.servlet.TestDispatcherServlet  : FrameworkServlet '': initialization started
21-Feb-2019 22:12:55 2019-02-21 22:12:55.674  INFO 24380 --- [           main] o.s.t.web.servlet.TestDispatcherServlet  : FrameworkServlet '': initialization completed in 3 ms
21-Feb-2019 22:12:55
21-Feb-2019 22:12:55 MockHttpServletRequest:
21-Feb-2019 22:12:55       HTTP Method = GET
21-Feb-2019 22:12:55       Request URI = /runtime/apps
21-Feb-2019 22:12:55        Parameters = {}
21-Feb-2019 22:12:55           Headers = {Accept=[application/json]}
21-Feb-2019 22:12:55
21-Feb-2019 22:12:55 Handler:
21-Feb-2019 22:12:55              Type = org.springframework.cloud.dataflow.server.controller.RuntimeAppsController
21-Feb-2019 22:12:55            Method = public org.springframework.hateoas.PagedResources<org.springframework.cloud.dataflow.rest.resource.AppStatusResource> org.springframework.cloud.dataflow.server.controller.RuntimeAppsController.list(org.springframework.data.domain.Pageable,org.springframework.data.web.PagedResourcesAssembler<org.springframework.cloud.deployer.spi.app.AppStatus>) throws java.util.concurrent.ExecutionException,java.lang.InterruptedException
21-Feb-2019 22:12:55
21-Feb-2019 22:12:55 Async:
21-Feb-2019 22:12:55     Async started = false
21-Feb-2019 22:12:55      Async result = null
21-Feb-2019 22:12:55
21-Feb-2019 22:12:55 Resolved Exception:
21-Feb-2019 22:12:55              Type = null
21-Feb-2019 22:12:55
21-Feb-2019 22:12:55 ModelAndView:
21-Feb-2019 22:12:55         View name = null
21-Feb-2019 22:12:55              View = null
21-Feb-2019 22:12:55             Model = null
21-Feb-2019 22:12:55
21-Feb-2019 22:12:55 FlashMap:
21-Feb-2019 22:12:55        Attributes = null
21-Feb-2019 22:12:55
21-Feb-2019 22:12:55 MockHttpServletResponse:
21-Feb-2019 22:12:55            Status = 200
21-Feb-2019 22:12:55     Error message = null
21-Feb-2019 22:12:55           Headers = {Content-Type=[application/json;charset=UTF-8]}
21-Feb-2019 22:12:55      Content type = application/json;charset=UTF-8
21-Feb-2019 22:12:55              Body = {"links":[{"rel":"self","href":"http://localhost/runtime/apps?page=0&size=20"}],"content":[{"deploymentId":"ticktock1.log","state":"deployed","instances":{"links":[],"content":[]},"links":[{"rel":"self","href":"http://localhost/runtime/apps/ticktock1.log"}]},{"deploymentId":"ticktock1.time","state":"deployed","instances":{"links":[],"content":[]},"links":[{"rel":"self","href":"http://localhost/runtime/apps/ticktock1.time"}]},{"deploymentId":"ticktock2.log","state":"deployed","instances":{"links":[],"content":[]},"links":[{"rel":"self","href":"http://localhost/runtime/apps/ticktock2.log"}]},{"deploymentId":"ticktock2.time","state":"deployed","instances":{"links":[],"content":[]},"links":[{"rel":"self","href":"http://localhost/runtime/apps/ticktock2.time"}]}],"page":{"size":20,"totalElements":4,"totalPages":1,"number":0}}
21-Feb-2019 22:12:55     Forwarded URL = null
21-Feb-2019 22:12:55    Redirected URL = null
21-Feb-2019 22:12:55           Cookies = []
21-Feb-2019 22:12:55 2019-02-21 22:12:55.686  INFO 24380 --- [           main] j.LocalContainerEntityManagerFactoryBean : Closing JPA EntityManagerFactory for persistence unit 'default'
21-Feb-2019 22:12:55 2019-02-21 22:12:55.686  INFO 24380 --- [           main] .SchemaDropperImpl$DelayedDropActionImpl : HHH000477: Starting delayed drop of schema as part of SessionFactory shut-down'
21-Feb-2019 22:12:55 2019-02-21 22:12:55.686  INFO 24380 --- [           main] o.s.j.d.e.EmbeddedDatabaseFactory        : Shutting down embedded database: url='jdbc:h2:mem:testdb;DB_CLOSE_DELAY=-1;DB_CLOSE_ON_EXIT=false'
21-Feb-2019 22:12:55   ____                              ____ _                __
21-Feb-2019 22:12:55 / ___| _ __  _ __(_)_ __   __ _   / ___| | ___  _   _  __| |
21-Feb-2019 22:12:55 \___ \| '_ \| '__| | '_ \ / _` | | |   | |/ _ \| | | |/ _` |
21-Feb-2019 22:12:55   ___) | |_) | |  | | | | | (_| | | |___| | (_) | |_| | (_| |
21-Feb-2019 22:12:55 |____/| .__/|_|  |_|_| |_|\__, |  \____|_|\___/ \__,_|\__,_|
21-Feb-2019 22:12:55   ____ |_|    _          __|___/                 __________
21-Feb-2019 22:12:55 |  _ \  __ _| |_ __ _  |  ___| | _____      __  \ \ \ \ \ \
21-Feb-2019 22:12:55 | | | |/ _` | __/ _` | | |_  | |/ _ \ \ /\ / /   \ \ \ \ \ \
21-Feb-2019 22:12:55 | |_| | (_| | || (_| | |  _| | | (_) \ V  V /    / / / / / /
21-Feb-2019 22:12:55 |____/ \__,_|\__\__,_| |_|   |_|\___/ \_/\_/    /_/_/_/_/_/
21-Feb-2019 22:12:55
21-Feb-2019 22:12:55
21-Feb-2019 22:12:55
21-Feb-2019 22:12:55 2019-02-21 22:12:55.869  INFO 24380 --- [           main] c.c.c.ConfigServicePropertySourceLocator : Fetching config from server at: http://localhost:8888
21-Feb-2019 22:12:55 2019-02-21 22:12:55.871  WARN 24380 --- [           main] c.c.c.ConfigServicePropertySourceLocator : Could not locate PropertySource: I/O error on GET request for "http://localhost:8888/application/default": Connection refused (Connection refused); nested exception is java.net.ConnectException: Connection refused (Connection refused)
21-Feb-2019 22:12:55 2019-02-21 22:12:55.872  INFO 24380 --- [           main] o.s.c.d.s.c.RuntimeAppsControllerTests   : No active profile set, falling back to default profiles: default
21-Feb-2019 22:12:55 2019-02-21 22:12:55.899  INFO 24380 --- [           main] .s.d.r.c.RepositoryConfigurationDelegate : Multiple Spring Data modules found, entering strict repository configuration mode!
21-Feb-2019 22:12:55 2019-02-21 22:12:55.988  INFO 24380 --- [           main] o.s.j.d.e.EmbeddedDatabaseFactory        : Starting embedded database: url='jdbc:h2:mem:testdb;DB_CLOSE_DELAY=-1;DB_CLOSE_ON_EXIT=false', username='sa'
21-Feb-2019 22:12:56 2019-02-21 22:12:56.015  INFO 24380 --- [           main] j.LocalContainerEntityManagerFactoryBean : Building JPA container EntityManagerFactory for persistence unit 'default'
21-Feb-2019 22:12:56 2019-02-21 22:12:56.015  INFO 24380 --- [           main] o.hibernate.jpa.internal.util.LogHelper  : HHH000204: Processing PersistenceUnitInfo [
21-Feb-2019 22:12:56         name: default
21-Feb-2019 22:12:56         ...]
21-Feb-2019 22:12:56 2019-02-21 22:12:56.020  INFO 24380 --- [           main] org.hibernate.dialect.Dialect            : HHH000400: Using dialect: org.hibernate.dialect.H2Dialect
21-Feb-2019 22:12:56 2019-02-21 22:12:56.040  INFO 24380 --- [           main] o.h.t.schema.internal.SchemaCreatorImpl  : HHH000476: Executing import script 'org.hiber[email protected]6e670b85'
21-Feb-2019 22:12:56 2019-02-21 22:12:56.040  INFO 24380 --- [           main] j.LocalContainerEntityManagerFactoryBean : Initialized JPA EntityManagerFactory for persistence unit 'default'
21-Feb-2019 22:12:56 2019-02-21 22:12:56.211  INFO 24380 --- [           main] o.s.c.d.s.c.support.MetricStore          : Metrics Collector URI = []
21-Feb-2019 22:12:56 2019-02-21 22:12:56.262  INFO 24380 --- [           main] o.s.c.d.s.c.RuntimeAppsControllerTests   : Started RuntimeAppsControllerTests in 0.572 seconds (JVM running for 153.871)
21-Feb-2019 22:12:56 2019-02-21 22:12:56.266  INFO 24380 --- [           main] o.s.t.web.servlet.TestDispatcherServlet  : FrameworkServlet '': initialization started
21-Feb-2019 22:12:56 2019-02-21 22:12:56.270  INFO 24380 --- [           main] o.s.t.web.servlet.TestDispatcherServlet  : FrameworkServlet '': initialization completed in 4 ms
21-Feb-2019 22:12:56 2019-02-21 22:12:56.272  WARN 24380 --- [           main] o.s.c.d.s.c.RestControllerAdvice         : Caught exception while handling a request: The 'invalid-0' application instance could not be found.
21-Feb-2019 22:12:56 2019-02-21 22:12:56.273  WARN 24380 --- [           main] .m.m.a.ExceptionHandlerExceptionResolver : Resolved [org.springframework.cloud.dataflow.server.controller.NoSuchAppInstanceException: The 'invalid-0' application instance could not be found.]
21-Feb-2019 22:12:56
21-Feb-2019 22:12:56 MockHttpServletRequest:
21-Feb-2019 22:12:56       HTTP Method = GET
21-Feb-2019 22:12:56       Request URI = /runtime/apps/valid/instances/invalid-0
21-Feb-2019 22:12:56        Parameters = {}
21-Feb-2019 22:12:56           Headers = {Accept=[application/json]}
21-Feb-2019 22:12:56
21-Feb-2019 22:12:56 Handler:
21-Feb-2019 22:12:56              Type = org.springframework.cloud.dataflow.server.controller.RuntimeAppInstanceController
21-Feb-2019 22:12:56            Method = public org.springframework.cloud.dataflow.rest.resource.AppInstanceStatusResource org.springframework.cloud.dataflow.server.controller.RuntimeAppInstanceController.display(java.lang.String,java.lang.String)
21-Feb-2019 22:12:56
21-Feb-2019 22:12:56 Async:
21-Feb-2019 22:12:56     Async started = false
21-Feb-2019 22:12:56      Async result = null
21-Feb-2019 22:12:56
21-Feb-2019 22:12:56 Resolved Exception:
21-Feb-2019 22:12:56              Type = org.springframework.cloud.dataflow.server.controller.NoSuchAppInstanceException
21-Feb-2019 22:12:56
21-Feb-2019 22:12:56 ModelAndView:
21-Feb-2019 22:12:56         View name = null
21-Feb-2019 22:12:56              View = null
21-Feb-2019 22:12:56             Model = null
21-Feb-2019 22:12:56
21-Feb-2019 22:12:56 FlashMap:
21-Feb-2019 22:12:56        Attributes = null
21-Feb-2019 22:12:56
21-Feb-2019 22:12:56 MockHttpServletResponse:
21-Feb-2019 22:12:56            Status = 404
21-Feb-2019 22:12:56     Error message = null
21-Feb-2019 22:12:56           Headers = {Content-Type=[application/json;charset=UTF-8]}
21-Feb-2019 22:12:56      Content type = application/json;charset=UTF-8
21-Feb-2019 22:12:56              Body = [{"logref":"NoSuchAppInstanceException","message":"The 'invalid-0' application instance could not be found.","links":[]}]
21-Feb-2019 22:12:56     Forwarded URL = null
21-Feb-2019 22:12:56    Redirected URL = null
21-Feb-2019 22:12:56           Cookies = []
21-Feb-2019 22:12:56 2019-02-21 22:12:56.277  INFO 24380 --- [           main] j.LocalContainerEntityManagerFactoryBean : Closing JPA EntityManagerFactory for persistence unit 'default'
21-Feb-2019 22:12:56 2019-02-21 22:12:56.277  INFO 24380 --- [           main] .SchemaDropperImpl$DelayedDropActionImpl : HHH000477: Starting delayed drop of schema as part of SessionFactory shut-down'
21-Feb-2019 22:12:56 2019-02-21 22:12:56.278  INFO 24380 --- [           main] o.s.j.d.e.EmbeddedDatabaseFactory        : Shutting down embedded database: url='jdbc:h2:mem:testdb;DB_CLOSE_DELAY=-1;DB_CLOSE_ON_EXIT=false'
21-Feb-2019 22:12:56   ____                              ____ _                __
21-Feb-2019 22:12:56 / ___| _ __  _ __(_)_ __   __ _   / ___| | ___  _   _  __| |
21-Feb-2019 22:12:56 \___ \| '_ \| '__| | '_ \ / _` | | |   | |/ _ \| | | |/ _` |
21-Feb-2019 22:12:56   ___) | |_) | |  | | | | | (_| | | |___| | (_) | |_| | (_| |
21-Feb-2019 22:12:56 |____/| .__/|_|  |_|_| |_|\__, |  \____|_|\___/ \__,_|\__,_|
21-Feb-2019 22:12:56   ____ |_|    _          __|___/                 __________
21-Feb-2019 22:12:56 |  _ \  __ _| |_ __ _  |  ___| | _____      __  \ \ \ \ \ \
21-Feb-2019 22:12:56 | | | |/ _` | __/ _` | | |_  | |/ _ \ \ /\ / /   \ \ \ \ \ \
21-Feb-2019 22:12:56 | |_| | (_| | || (_| | |  _| | | (_) \ V  V /    / / / / / /
21-Feb-2019 22:12:56 |____/ \__,_|\__\__,_| |_|   |_|\___/ \_/\_/    /_/_/_/_/_/
21-Feb-2019 22:12:56
21-Feb-2019 22:12:56
21-Feb-2019 22:12:56
21-Feb-2019 22:12:56 2019-02-21 22:12:56.462  INFO 24380 --- [           main] c.c.c.ConfigServicePropertySourceLocator : Fetching config from server at: http://localhost:8888
21-Feb-2019 22:12:56 2019-02-21 22:12:56.464  WARN 24380 --- [           main] c.c.c.ConfigServicePropertySourceLocator : Could not locate PropertySource: I/O error on GET request for "http://localhost:8888/application/default": Connection refused (Connection refused); nested exception is java.net.ConnectException: Connection refused (Connection refused)
21-Feb-2019 22:12:56 2019-02-21 22:12:56.465  INFO 24380 --- [           main] o.s.c.d.s.c.RuntimeAppsControllerTests   : No active profile set, falling back to default profiles: default
21-Feb-2019 22:12:56 2019-02-21 22:12:56.492  INFO 24380 --- [           main] .s.d.r.c.RepositoryConfigurationDelegate : Multiple Spring Data modules found, entering strict repository configuration mode!
21-Feb-2019 22:12:56 2019-02-21 22:12:56.585  INFO 24380 --- [           main] o.s.j.d.e.EmbeddedDatabaseFactory        : Starting embedded database: url='jdbc:h2:mem:testdb;DB_CLOSE_DELAY=-1;DB_CLOSE_ON_EXIT=false', username='sa'
21-Feb-2019 22:12:56 2019-02-21 22:12:56.611  INFO 24380 --- [           main] j.LocalContainerEntityManagerFactoryBean : Building JPA container EntityManagerFactory for persistence unit 'default'
21-Feb-2019 22:12:56 2019-02-21 22:12:56.611  INFO 24380 --- [           main] o.hibernate.jpa.internal.util.LogHelper  : HHH000204: Processing PersistenceUnitInfo [
21-Feb-2019 22:12:56         name: default
21-Feb-2019 22:12:56         ...]
21-Feb-2019 22:12:56 2019-02-21 22:12:56.615  INFO 24380 --- [           main] org.hibernate.dialect.Dialect            : HHH000400: Using dialect: org.hibernate.dialect.H2Dialect
21-Feb-2019 22:12:56 2019-02-21 22:12:56.631  INFO 24380 --- [           main] o.h.t.schema.internal.SchemaCreatorImpl  : HHH000476: Executing import script 'org.hiber[email protected]6e670b85'
21-Feb-2019 22:12:56 2019-02-21 22:12:56.631  INFO 24380 --- [           main] j.LocalContainerEntityManagerFactoryBean : Initialized JPA EntityManagerFactory for persistence unit 'default'
21-Feb-2019 22:12:56 2019-02-21 22:12:56.797  INFO 24380 --- [           main] o.s.c.d.s.c.support.MetricStore          : Metrics Collector URI = []
21-Feb-2019 22:12:56 2019-02-21 22:12:56.848  INFO 24380 --- [           main] o.s.c.d.s.c.RuntimeAppsControllerTests   : Started RuntimeAppsControllerTests in 0.567 seconds (JVM running for 154.457)
21-Feb-2019 22:12:56 2019-02-21 22:12:56.852  INFO 24380 --- [           main] o.s.t.web.servlet.TestDispatcherServlet  : FrameworkServlet '': initialization started
21-Feb-2019 22:12:56 2019-02-21 22:12:56.856  INFO 24380 --- [           main] o.s.t.web.servlet.TestDispatcherServlet  : FrameworkServlet '': initialization completed in 4 ms
21-Feb-2019 22:12:56 2019-02-21 22:12:56.857  WARN 24380 --- [           main] o.s.c.d.s.c.RestControllerAdvice         : Caught exception while handling a request: The 'foo' application could not be found.
21-Feb-2019 22:12:56 2019-02-21 22:12:56.858  WARN 24380 --- [           main] .m.m.a.ExceptionHandlerExceptionResolver : Resolved [org.springframework.cloud.dataflow.server.controller.NoSuchAppException: The 'foo' application could not be found.]
21-Feb-2019 22:12:56
21-Feb-2019 22:12:56 MockHttpServletRequest:
21-Feb-2019 22:12:56       HTTP Method = GET
21-Feb-2019 22:12:56       Request URI = /runtime/apps/foo
21-Feb-2019 22:12:56        Parameters = {}
21-Feb-2019 22:12:56           Headers = {Accept=[application/json]}
21-Feb-2019 22:12:56
21-Feb-2019 22:12:56 Handler:
21-Feb-2019 22:12:56              Type = org.springframework.cloud.dataflow.server.controller.RuntimeAppsController
21-Feb-2019 22:12:56            Method = public org.springframework.cloud.dataflow.rest.resource.AppStatusResource org.springframework.cloud.dataflow.server.controller.RuntimeAppsController.display(java.lang.String)
21-Feb-2019 22:12:56
21-Feb-2019 22:12:56 Async:
21-Feb-2019 22:12:56     Async started = false
21-Feb-2019 22:12:56      Async result = null
21-Feb-2019 22:12:56
21-Feb-2019 22:12:56 Resolved Exception:
21-Feb-2019 22:12:56              Type = org.springframework.cloud.dataflow.server.controller.NoSuchAppException
21-Feb-2019 22:12:56
21-Feb-2019 22:12:56 ModelAndView:
21-Feb-2019 22:12:56         View name = null
21-Feb-2019 22:12:56              View = null
21-Feb-2019 22:12:56             Model = null
21-Feb-2019 22:12:56
21-Feb-2019 22:12:56 FlashMap:
21-Feb-2019 22:12:56        Attributes = null
21-Feb-2019 22:12:56
21-Feb-2019 22:12:56 MockHttpServletResponse:
21-Feb-2019 22:12:56            Status = 404
21-Feb-2019 22:12:56     Error message = null
21-Feb-2019 22:12:56           Headers = {Content-Type=[application/json;charset=UTF-8]}
21-Feb-2019 22:12:56      Content type = application/json;charset=UTF-8
21-Feb-2019 22:12:56              Body = [{"logref":"NoSuchAppException","message":"The 'foo' application could not be found.","links":[]}]
21-Feb-2019 22:12:56     Forwarded URL = null
21-Feb-2019 22:12:56    Redirected URL = null
21-Feb-2019 22:12:56           Cookies = []
21-Feb-2019 22:12:56 2019-02-21 22:12:56.861  INFO 24380 --- [           main] j.LocalContainerEntityManagerFactoryBean : Closing JPA EntityManagerFactory for persistence unit 'default'
21-Feb-2019 22:12:56 2019-02-21 22:12:56.861  INFO 24380 --- [           main] .SchemaDropperImpl$DelayedDropActionImpl : HHH000477: Starting delayed drop of schema as part of SessionFactory shut-down'
21-Feb-2019 22:12:56 2019-02-21 22:12:56.861  INFO 24380 --- [           main] o.s.j.d.e.EmbeddedDatabaseFactory        : Shutting down embedded database: url='jdbc:h2:mem:testdb;DB_CLOSE_DELAY=-1;DB_CLOSE_ON_EXIT=false'
21-Feb-2019 22:12:57   ____                              ____ _                __
21-Feb-2019 22:12:57 / ___| _ __  _ __(_)_ __   __ _   / ___| | ___  _   _  __| |
21-Feb-2019 22:12:57 \___ \| '_ \| '__| | '_ \ / _` | | |   | |/ _ \| | | |/ _` |
21-Feb-2019 22:12:57   ___) | |_) | |  | | | | | (_| | | |___| | (_) | |_| | (_| |
21-Feb-2019 22:12:57 |____/| .__/|_|  |_|_| |_|\__, |  \____|_|\___/ \__,_|\__,_|
21-Feb-2019 22:12:57   ____ |_|    _          __|___/                 __________
21-Feb-2019 22:12:57 |  _ \  __ _| |_ __ _  |  ___| | _____      __  \ \ \ \ \ \
21-Feb-2019 22:12:57 | | | |/ _` | __/ _` | | |_  | |/ _ \ \ /\ / /   \ \ \ \ \ \
21-Feb-2019 22:12:57 | |_| | (_| | || (_| | |  _| | | (_) \ V  V /    / / / / / /
21-Feb-2019 22:12:57 |____/ \__,_|\__\__,_| |_|   |_|\___/ \_/\_/    /_/_/_/_/_/
21-Feb-2019 22:12:57
21-Feb-2019 22:12:57
21-Feb-2019 22:12:57
21-Feb-2019 22:12:57 2019-02-21 22:12:57.043  INFO 24380 --- [           main] c.c.c.ConfigServicePropertySourceLocator : Fetching config from server at: http://localhost:8888
21-Feb-2019 22:12:57 2019-02-21 22:12:57.045  WARN 24380 --- [           main] c.c.c.ConfigServicePropertySourceLocator : Could not locate PropertySource: I/O error on GET request for "http://localhost:8888/application/default": Connection refused (Connection refused); nested exception is java.net.ConnectException: Connection refused (Connection refused)
21-Feb-2019 22:12:57 2019-02-21 22:12:57.046  INFO 24380 --- [           main] o.s.c.d.s.c.RuntimeAppsControllerTests   : No active profile set, falling back to default profiles: default
21-Feb-2019 22:12:57 2019-02-21 22:12:57.073  INFO 24380 --- [           main] .s.d.r.c.RepositoryConfigurationDelegate : Multiple Spring Data modules found, entering strict repository configuration mode!
21-Feb-2019 22:12:57 2019-02-21 22:12:57.165  INFO 24380 --- [           main] o.s.j.d.e.EmbeddedDatabaseFactory        : Starting embedded database: url='jdbc:h2:mem:testdb;DB_CLOSE_DELAY=-1;DB_CLOSE_ON_EXIT=false', username='sa'
21-Feb-2019 22:12:57 2019-02-21 22:12:57.192  INFO 24380 --- [           main] j.LocalContainerEntityManagerFactoryBean : Building JPA container EntityManagerFactory for persistence unit 'default'
21-Feb-2019 22:12:57 2019-02-21 22:12:57.192  INFO 24380 --- [           main] o.hibernate.jpa.internal.util.LogHelper  : HHH000204: Processing PersistenceUnitInfo [
21-Feb-2019 22:12:57         name: default
21-Feb-2019 22:12:57         ...]
21-Feb-2019 22:12:57 2019-02-21 22:12:57.196  INFO 24380 --- [           main] org.hibernate.dialect.Dialect            : HHH000400: Using dialect: org.hibernate.dialect.H2Dialect
21-Feb-2019 22:12:57 2019-02-21 22:12:57.212  INFO 24380 --- [           main] o.h.t.schema.internal.SchemaCreatorImpl  : HHH000476: Executing import script 'org.hiber[email protected]6e670b85'
21-Feb-2019 22:12:57 2019-02-21 22:12:57.212  INFO 24380 --- [           main] j.LocalContainerEntityManagerFactoryBean : Initialized JPA EntityManagerFactory for persistence unit 'default'
21-Feb-2019 22:12:57 2019-02-21 22:12:57.383  INFO 24380 --- [           main] o.s.c.d.s.c.support.MetricStore          : Metrics Collector URI = []
21-Feb-2019 22:12:57 2019-02-21 22:12:57.434  INFO 24380 --- [           main] o.s.c.d.s.c.RuntimeAppsControllerTests   : Started RuntimeAppsControllerTests in 0.569 seconds (JVM running for 155.043)
21-Feb-2019 22:12:57 2019-02-21 22:12:57.438  INFO 24380 --- [           main] o.s.t.web.servlet.TestDispatcherServlet  : FrameworkServlet '': initialization started
21-Feb-2019 22:12:57 2019-02-21 22:12:57.441  INFO 24380 --- [           main] o.s.t.web.servlet.TestDispatcherServlet  : FrameworkServlet '': initialization completed in 3 ms
21-Feb-2019 22:12:57
21-Feb-2019 22:12:57 MockHttpServletRequest:
21-Feb-2019 22:12:57       HTTP Method = GET
21-Feb-2019 22:12:57       Request URI = /runtime/apps
21-Feb-2019 22:12:57        Parameters = {page=[0], size=[1]}
21-Feb-2019 22:12:57           Headers = {Accept=[application/json]}
21-Feb-2019 22:12:57
21-Feb-2019 22:12:57 Handler:
21-Feb-2019 22:12:57              Type = org.springframework.cloud.dataflow.server.controller.RuntimeAppsController
21-Feb-2019 22:12:57            Method = public org.springframework.hateoas.PagedResources<org.springframework.cloud.dataflow.rest.resource.AppStatusResource> org.springframework.cloud.dataflow.server.controller.RuntimeAppsController.list(org.springframework.data.domain.Pageable,org.springframework.data.web.PagedResourcesAssembler<org.springframework.cloud.deployer.spi.app.AppStatus>) throws java.util.concurrent.ExecutionException,java.lang.InterruptedException
21-Feb-2019 22:12:57
21-Feb-2019 22:12:57 Async:
21-Feb-2019 22:12:57     Async started = false
21-Feb-2019 22:12:57      Async result = null
21-Feb-2019 22:12:57
21-Feb-2019 22:12:57 Resolved Exception:
21-Feb-2019 22:12:57              Type = null
21-Feb-2019 22:12:57
21-Feb-2019 22:12:57 ModelAndView:
21-Feb-2019 22:12:57         View name = null
21-Feb-2019 22:12:57              View = null
21-Feb-2019 22:12:57             Model = null
21-Feb-2019 22:12:57
21-Feb-2019 22:12:57 FlashMap:
21-Feb-2019 22:12:57        Attributes = null
21-Feb-2019 22:12:57
21-Feb-2019 22:12:57 MockHttpServletResponse:
21-Feb-2019 22:12:57            Status = 200
21-Feb-2019 22:12:57     Error message = null
21-Feb-2019 22:12:57           Headers = {Content-Type=[application/json;charset=UTF-8]}
21-Feb-2019 22:12:57      Content type = application/json;charset=UTF-8
21-Feb-2019 22:12:57              Body = {"links":[{"rel":"first","href":"http://localhost/runtime/apps?page=0&size=1"},{"rel":"self","href":"http://localhost/runtime/apps?page=0&size=1"},{"rel":"next","href":"http://localhost/runtime/apps?page=1&size=1"},{"rel":"last","href":"http://localhost/runtime/apps?page=3&size=1"}],"content":[{"deploymentId":"ticktock1.log","state":"deployed","instances":{"links":[],"content":[]},"links":[{"rel":"self","href":"http://localhost/runtime/apps/ticktock1.log"}]}],"page":{"size":1,"totalElements":4,"totalPages":4,"number":0}}
21-Feb-2019 22:12:57     Forwarded URL = null
21-Feb-2019 22:12:57    Redirected URL = null
21-Feb-2019 22:12:57           Cookies = []
21-Feb-2019 22:12:57
21-Feb-2019 22:12:57 MockHttpServletRequest:
21-Feb-2019 22:12:57       HTTP Method = GET
21-Feb-2019 22:12:57       Request URI = /runtime/apps
21-Feb-2019 22:12:57        Parameters = {page=[0], size=[2]}
21-Feb-2019 22:12:57           Headers = {Accept=[application/json]}
21-Feb-2019 22:12:57
21-Feb-2019 22:12:57 Handler:
21-Feb-2019 22:12:57              Type = org.springframework.cloud.dataflow.server.controller.RuntimeAppsController
21-Feb-2019 22:12:57            Method = public org.springframework.hateoas.PagedResources<org.springframework.cloud.dataflow.rest.resource.AppStatusResource> org.springframework.cloud.dataflow.server.controller.RuntimeAppsController.list(org.springframework.data.domain.Pageable,org.springframework.data.web.PagedResourcesAssembler<org.springframework.cloud.deployer.spi.app.AppStatus>) throws java.util.concurrent.ExecutionException,java.lang.InterruptedException
21-Feb-2019 22:12:57
21-Feb-2019 22:12:57 Async:
21-Feb-2019 22:12:57     Async started = false
21-Feb-2019 22:12:57      Async result = null
21-Feb-2019 22:12:57
21-Feb-2019 22:12:57 Resolved Exception:
21-Feb-2019 22:12:57              Type = null
21-Feb-2019 22:12:57
21-Feb-2019 22:12:57 ModelAndView:
21-Feb-2019 22:12:57         View name = null
21-Feb-2019 22:12:57              View = null
21-Feb-2019 22:12:57             Model = null
21-Feb-2019 22:12:57
21-Feb-2019 22:12:57 FlashMap:
21-Feb-2019 22:12:57        Attributes = null
21-Feb-2019 22:12:57
21-Feb-2019 22:12:57 MockHttpServletResponse:
21-Feb-2019 22:12:57            Status = 200
21-Feb-2019 22:12:57     Error message = null
21-Feb-2019 22:12:57           Headers = {Content-Type=[application/json;charset=UTF-8]}
21-Feb-2019 22:12:57      Content type = application/json;charset=UTF-8
21-Feb-2019 22:12:57              Body = {"links":[{"rel":"first","href":"http://localhost/runtime/apps?page=0&size=2"},{"rel":"self","href":"http://localhost/runtime/apps?page=0&size=2"},{"rel":"next","href":"http://localhost/runtime/apps?page=1&size=2"},{"rel":"last","href":"http://localhost/runtime/apps?page=1&size=2"}],"content":[{"deploymentId":"ticktock1.log","state":"deployed","instances":{"links":[],"content":[]},"links":[{"rel":"self","href":"http://localhost/runtime/apps/ticktock1.log"}]},{"deploymentId":"ticktock1.time","state":"deployed","instances":{"links":[],"content":[]},"links":[{"rel":"self","href":"http://localhost/runtime/apps/ticktock1.time"}]}],"page":{"size":2,"totalElements":4,"totalPages":2,"number":0}}
21-Feb-2019 22:12:57     Forwarded URL = null
21-Feb-2019 22:12:57    Redirected URL = null
21-Feb-2019 22:12:57           Cookies = []
21-Feb-2019 22:12:57
21-Feb-2019 22:12:57 MockHttpServletRequest:
21-Feb-2019 22:12:57       HTTP Method = GET
21-Feb-2019 22:12:57       Request URI = /runtime/apps
21-Feb-2019 22:12:57        Parameters = {page=[1], size=[2]}
21-Feb-2019 22:12:57           Headers = {Accept=[application/json]}
21-Feb-2019 22:12:57
21-Feb-2019 22:12:57 Handler:
21-Feb-2019 22:12:57              Type = org.springframework.cloud.dataflow.server.controller.RuntimeAppsController
21-Feb-2019 22:12:57            Method = public org.springframework.hateoas.PagedResources<org.springframework.cloud.dataflow.rest.resource.AppStatusResource> org.springframework.cloud.dataflow.server.controller.RuntimeAppsController.list(org.springframework.data.domain.Pageable,org.springframework.data.web.PagedResourcesAssembler<org.springframework.cloud.deployer.spi.app.AppStatus>) throws java.util.concurrent.ExecutionException,java.lang.InterruptedException
21-Feb-2019 22:12:57
21-Feb-2019 22:12:57 Async:
21-Feb-2019 22:12:57     Async started = false
21-Feb-2019 22:12:57      Async result = null
21-Feb-2019 22:12:57
21-Feb-2019 22:12:57 Resolved Exception:
21-Feb-2019 22:12:57              Type = null
21-Feb-2019 22:12:57
21-Feb-2019 22:12:57 ModelAndView:
21-Feb-2019 22:12:57         View name = null
21-Feb-2019 22:12:57              View = null
21-Feb-2019 22:12:57             Model = null
21-Feb-2019 22:12:57
21-Feb-2019 22:12:57 FlashMap:
21-Feb-2019 22:12:57        Attributes = null
21-Feb-2019 22:12:57
21-Feb-2019 22:12:57 MockHttpServletResponse:
21-Feb-2019 22:12:57            Status = 200
21-Feb-2019 22:12:57     Error message = null
21-Feb-2019 22:12:57           Headers = {Content-Type=[application/json;charset=UTF-8]}
21-Feb-2019 22:12:57      Content type = application/json;charset=UTF-8
21-Feb-2019 22:12:57              Body = {"links":[{"rel":"first","href":"http://localhost/runtime/apps?page=0&size=2"},{"rel":"prev","href":"http://localhost/runtime/apps?page=0&size=2"},{"rel":"self","href":"http://localhost/runtime/apps?page=1&size=2"},{"rel":"last","href":"http://localhost/runtime/apps?page=1&size=2"}],"content":[{"deploymentId":"ticktock2.log","state":"deployed","instances":{"links":[],"content":[]},"links":[{"rel":"self","href":"http://localhost/runtime/apps/ticktock2.log"}]},{"deploymentId":"ticktock2.time","state":"deployed","instances":{"links":[],"content":[]},"links":[{"rel":"self","href":"http://localhost/runtime/apps/ticktock2.time"}]}],"page":{"size":2,"totalElements":4,"totalPages":2,"number":1}}
21-Feb-2019 22:12:57     Forwarded URL = null
21-Feb-2019 22:12:57    Redirected URL = null
21-Feb-2019 22:12:57           Cookies = []
21-Feb-2019 22:12:57
21-Feb-2019 22:12:57 MockHttpServletRequest:
21-Feb-2019 22:12:57       HTTP Method = GET
21-Feb-2019 22:12:57       Request URI = /runtime/apps
21-Feb-2019 22:12:57        Parameters = {page=[3], size=[1]}
21-Feb-2019 22:12:57           Headers = {Accept=[application/json]}
21-Feb-2019 22:12:57
21-Feb-2019 22:12:57 Handler:
21-Feb-2019 22:12:57              Type = org.springframework.cloud.dataflow.server.controller.RuntimeAppsController
21-Feb-2019 22:12:57            Method = public org.springframework.hateoas.PagedResources<org.springframework.cloud.dataflow.rest.resource.AppStatusResource> org.springframework.cloud.dataflow.server.controller.RuntimeAppsController.list(org.springframework.data.domain.Pageable,org.springframework.data.web.PagedResourcesAssembler<org.springframework.cloud.deployer.spi.app.AppStatus>) throws java.util.concurrent.ExecutionException,java.lang.InterruptedException
21-Feb-2019 22:12:57
21-Feb-2019 22:12:57 Async:
21-Feb-2019 22:12:57     Async started = false
21-Feb-2019 22:12:57      Async result = null
21-Feb-2019 22:12:57
21-Feb-2019 22:12:57 Resolved Exception:
21-Feb-2019 22:12:57              Type = null
21-Feb-2019 22:12:57
21-Feb-2019 22:12:57 ModelAndView:
21-Feb-2019 22:12:57         View name = null
21-Feb-2019 22:12:57              View = null
21-Feb-2019 22:12:57             Model = null
21-Feb-2019 22:12:57
21-Feb-2019 22:12:57 FlashMap:
21-Feb-2019 22:12:57        Attributes = null
21-Feb-2019 22:12:57
21-Feb-2019 22:12:57 MockHttpServletResponse:
21-Feb-2019 22:12:57            Status = 200
21-Feb-2019 22:12:57     Error message = null
21-Feb-2019 22:12:57           Headers = {Content-Type=[application/json;charset=UTF-8]}
21-Feb-2019 22:12:57      Content type = application/json;charset=UTF-8
21-Feb-2019 22:12:57              Body = {"links":[{"rel":"first","href":"http://localhost/runtime/apps?page=0&size=1"},{"rel":"prev","href":"http://localhost/runtime/apps?page=2&size=1"},{"rel":"self","href":"http://localhost/runtime/apps?page=3&size=1"},{"rel":"last","href":"http://localhost/runtime/apps?page=3&size=1"}],"content":[{"deploymentId":"ticktock2.time","state":"deployed","instances":{"links":[],"content":[]},"links":[{"rel":"self","href":"http://localhost/runtime/apps/ticktock2.time"}]}],"page":{"size":1,"totalElements":4,"totalPages":4,"number":3}}
21-Feb-2019 22:12:57     Forwarded URL = null
21-Feb-2019 22:12:57    Redirected URL = null
21-Feb-2019 22:12:57           Cookies = []
21-Feb-2019 22:12:57 2019-02-21 22:12:57.461  INFO 24380 --- [           main] j.LocalContainerEntityManagerFactoryBean : Closing JPA EntityManagerFactory for persistence unit 'default'
21-Feb-2019 22:12:57 2019-02-21 22:12:57.461  INFO 24380 --- [           main] .SchemaDropperImpl$DelayedDropActionImpl : HHH000477: Starting delayed drop of schema as part of SessionFactory shut-down'
21-Feb-2019 22:12:57 2019-02-21 22:12:57.462  INFO 24380 --- [           main] o.s.j.d.e.EmbeddedDatabaseFactory        : Shutting down embedded database: url='jdbc:h2:mem:testdb;DB_CLOSE_DELAY=-1;DB_CLOSE_ON_EXIT=false'
21-Feb-2019 22:12:57 [INFO] Tests run: 4, Failures: 0, Errors: 0, Skipped: 0, Time elapsed: 2.361 s - in org.springframework.cloud.dataflow.server.controller.RuntimeAppsControllerTests
21-Feb-2019 22:12:57 [INFO] Running org.springframework.cloud.dataflow.server.controller.AboutControllerTests$ChecksumDisabledTests
21-Feb-2019 22:12:57 2019-02-21 22:12:57.463  INFO 24380 --- [           main] o.s.t.c.support.AbstractContextLoader    : Could not detect default resource locations for test class [org.springframework.cloud.dataflow.server.controller.AboutControllerTests$ChecksumDisabledTests]: no resource found for suffixes {-context.xml, Context.groovy}.
21-Feb-2019 22:12:57   ____                              ____ _                __
21-Feb-2019 22:12:57 / ___| _ __  _ __(_)_ __   __ _   / ___| | ___  _   _  __| |
21-Feb-2019 22:12:57 \___ \| '_ \| '__| | '_ \ / _` | | |   | |/ _ \| | | |/ _` |
21-Feb-2019 22:12:57   ___) | |_) | |  | | | | | (_| | | |___| | (_) | |_| | (_| |
21-Feb-2019 22:12:57 |____/| .__/|_|  |_|_| |_|\__, |  \____|_|\___/ \__,_|\__,_|
21-Feb-2019 22:12:57   ____ |_|    _          __|___/                 __________
21-Feb-2019 22:12:57 |  _ \  __ _| |_ __ _  |  ___| | _____      __  \ \ \ \ \ \
21-Feb-2019 22:12:57 | | | |/ _` | __/ _` | | |_  | |/ _ \ \ /\ / /   \ \ \ \ \ \
21-Feb-2019 22:12:57 | |_| | (_| | || (_| | |  _| | | (_) \ V  V /    / / / / / /
21-Feb-2019 22:12:57 |____/ \__,_|\__\__,_| |_|   |_|\___/ \_/\_/    /_/_/_/_/_/
21-Feb-2019 22:12:57
21-Feb-2019 22:12:57
21-Feb-2019 22:12:57
21-Feb-2019 22:12:57 2019-02-21 22:12:57.653  INFO 24380 --- [           main] c.c.c.ConfigServicePropertySourceLocator : Fetching config from server at: http://localhost:8888
21-Feb-2019 22:12:57 2019-02-21 22:12:57.655  WARN 24380 --- [           main] c.c.c.ConfigServicePropertySourceLocator : Could not locate PropertySource: I/O error on GET request for "http://localhost:8888/application/default": Connection refused (Connection refused); nested exception is java.net.ConnectException: Connection refused (Connection refused)
21-Feb-2019 22:12:57 2019-02-21 22:12:57.656  INFO 24380 --- [           main] outControllerTests$ChecksumDisabledTests : No active profile set, falling back to default profiles: default
21-Feb-2019 22:12:57 2019-02-21 22:12:57.683  INFO 24380 --- [           main] .s.d.r.c.RepositoryConfigurationDelegate : Multiple Spring Data modules found, entering strict repository configuration mode!
21-Feb-2019 22:12:57 2019-02-21 22:12:57.775  INFO 24380 --- [           main] o.s.j.d.e.EmbeddedDatabaseFactory        : Starting embedded database: url='jdbc:h2:mem:testdb;DB_CLOSE_DELAY=-1;DB_CLOSE_ON_EXIT=false', username='sa'
21-Feb-2019 22:12:57 2019-02-21 22:12:57.801  INFO 24380 --- [           main] j.LocalContainerEntityManagerFactoryBean : Building JPA container EntityManagerFactory for persistence unit 'default'
21-Feb-2019 22:12:57 2019-02-21 22:12:57.801  INFO 24380 --- [           main] o.hibernate.jpa.internal.util.LogHelper  : HHH000204: Processing PersistenceUnitInfo [
21-Feb-2019 22:12:57         name: default
21-Feb-2019 22:12:57         ...]
21-Feb-2019 22:12:57 2019-02-21 22:12:57.806  INFO 24380 --- [           main] org.hibernate.dialect.Dialect            : HHH000400: Using dialect: org.hibernate.dialect.H2Dialect
21-Feb-2019 22:12:57 2019-02-21 22:12:57.821  INFO 24380 --- [           main] o.h.t.schema.internal.SchemaCreatorImpl  : HHH000476: Executing import script 'org.hiber[email protected]6e670b85'
21-Feb-2019 22:12:57 2019-02-21 22:12:57.821  INFO 24380 --- [           main] j.LocalContainerEntityManagerFactoryBean : Initialized JPA EntityManagerFactory for persistence unit 'default'
21-Feb-2019 22:12:57 2019-02-21 22:12:57.993  INFO 24380 --- [           main] o.s.c.d.s.c.support.MetricStore          : Metrics Collector URI = []
21-Feb-2019 22:12:58 2019-02-21 22:12:58.045  INFO 24380 --- [           main] outControllerTests$ChecksumDisabledTests : Started AboutControllerTests.ChecksumDisabledTests in 0.574 seconds (JVM running for 155.653)
21-Feb-2019 22:12:58 2019-02-21 22:12:58.047  INFO 24380 --- [           main] junit.logTestName                        : Starting Test testChecksumDisabled
21-Feb-2019 22:12:58 2019-02-21 22:12:58.048  INFO 24380 --- [           main] o.s.t.web.servlet.TestDispatcherServlet  : FrameworkServlet '': initialization started
21-Feb-2019 22:12:58 2019-02-21 22:12:58.052  INFO 24380 --- [           main] o.s.t.web.servlet.TestDispatcherServlet  : FrameworkServlet '': initialization completed in 3 ms
21-Feb-2019 22:12:58
21-Feb-2019 22:12:58 MockHttpServletRequest:
21-Feb-2019 22:12:58       HTTP Method = GET
21-Feb-2019 22:12:58       Request URI = /about
21-Feb-2019 22:12:58        Parameters = {}
21-Feb-2019 22:12:58           Headers = {Accept=[application/json]}
21-Feb-2019 22:12:58
21-Feb-2019 22:12:58 Handler:
21-Feb-2019 22:12:58              Type = org.springframework.cloud.dataflow.server.controller.AboutController
21-Feb-2019 22:12:58            Method = public org.springframework.cloud.dataflow.rest.resource.about.AboutResource org.springframework.cloud.dataflow.server.controller.AboutController.getAboutResource()
21-Feb-2019 22:12:58
21-Feb-2019 22:12:58 Async:
21-Feb-2019 22:12:58     Async started = false
21-Feb-2019 22:12:58      Async result = null
21-Feb-2019 22:12:58
21-Feb-2019 22:12:58 Resolved Exception:
21-Feb-2019 22:12:58              Type = null
21-Feb-2019 22:12:58
21-Feb-2019 22:12:58 ModelAndView:
21-Feb-2019 22:12:58         View name = null
21-Feb-2019 22:12:58              View = null
21-Feb-2019 22:12:58             Model = null
21-Feb-2019 22:12:58
21-Feb-2019 22:12:58 FlashMap:
21-Feb-2019 22:12:58        Attributes = null
21-Feb-2019 22:12:58
21-Feb-2019 22:12:58 MockHttpServletResponse:
21-Feb-2019 22:12:58            Status = 200
21-Feb-2019 22:12:58     Error message = null
21-Feb-2019 22:12:58           Headers = {Content-Type=[application/json;charset=UTF-8]}
21-Feb-2019 22:12:58      Content type = application/json;charset=UTF-8
21-Feb-2019 22:12:58              Body = {"featureInfo":{"analyticsEnabled":true,"streamsEnabled":true,"tasksEnabled":true,"skipperEnabled":false,"schedulerEnabled":false},"versionInfo":{"implementation":{"name":"${info.app.name}","version":"${info.app.version}"},"core":{"name":"Spring Cloud Data Flow Core","version":"1.7.5.BUILD-SNAPSHOT"},"dashboard":{"name":"Spring Cloud Dataflow UI","version":"1.7.3.RELEASE"},"shell":{"name":"Spring Cloud Data Flow Shell","version":"1.2.3.SHELL.TEST","url":"https://repo.spring.io/libs-milestone/org/springframework/cloud/spring-cloud-dataflow-shell/1.3.0.BUILD-SNAPSHOT/spring-cloud-dataflow-shell-1.3.0.BUILD-SNAPSHOT.jsdfasdf"}},"securityInfo":{"authenticationEnabled":false,"authorizationEnabled":false,"formLogin":false,"authenticated":false,"username":null,"roles":[]},"runtimeEnvironment":{"appDeployer":{"deployerImplementationVersion":"testAppDepImplementationVersion","deployerName":"testAppDepImplementationName","deployerSpiVersion":"1.8.0_144","javaVersion":"1.8.0_144","platformApiVersion":"testAppDepPlatformApiVersion","platformClientVersion":"testAppDepPlatformClientVersion","platformHostVersion":"testAppDepPlatformHostVersion","platformSpecificInfo":{},"platformType":"testAppDepPlatformType","springBootVersion":"1.5.16.RELEASE","springVersion":"4.3.19.RELEASE"},"taskLauncher":{"deployerImplementationVersion":"testTaskDepImplementationVersion","deployerName":"testTaskDepImplementationName","deployerSpiVersion":"1.8.0_144","javaVersion":"1.8.0_144","platformApiVersion":"testTaskDepPlatformApiVersion","platformClientVersion":"testTaskDepPlatformClientVersion","platformHostVersion":"testTaskDepPlatformHostVersion","platformSpecificInfo":{},"platformType":"testTaskDepPlatformType","springBootVersion":"1.5.16.RELEASE","springVersion":"4.3.19.RELEASE"}},"links":[{"rel":"self","href":"http://localhost/about"}]}
21-Feb-2019 22:12:58     Forwarded URL = null
21-Feb-2019 22:12:58    Redirected URL = null
21-Feb-2019 22:12:58           Cookies = []
21-Feb-2019 22:12:58 2019-02-21 22:12:58.061  INFO 24380 --- [           main] j.LocalContainerEntityManagerFactoryBean : Closing JPA EntityManagerFactory for persistence unit 'default'
21-Feb-2019 22:12:58 2019-02-21 22:12:58.061  INFO 24380 --- [           main] .SchemaDropperImpl$DelayedDropActionImpl : HHH000477: Starting delayed drop of schema as part of SessionFactory shut-down'
21-Feb-2019 22:12:58 2019-02-21 22:12:58.061  INFO 24380 --- [           main] o.s.j.d.e.EmbeddedDatabaseFactory        : Shutting down embedded database: url='jdbc:h2:mem:testdb;DB_CLOSE_DELAY=-1;DB_CLOSE_ON_EXIT=false'
21-Feb-2019 22:12:58 2019-02-21 22:12:58.061  INFO 24380 --- [           main] junit.logTestName                        : Finished Test testChecksumDisabled
21-Feb-2019 22:12:58 [INFO] Tests run: 1, Failures: 0, Errors: 0, Skipped: 0, Time elapsed: 0.598 s - in org.springframework.cloud.dataflow.server.controller.AboutControllerTests$ChecksumDisabledTests
21-Feb-2019 22:12:58 [INFO] Running org.springframework.cloud.dataflow.server.controller.TaskExecutionControllerTests
21-Feb-2019 22:12:58 2019-02-21 22:12:58.063  INFO 24380 --- [           main] o.s.t.c.support.AbstractContextLoader    : Could not detect default resource locations for test class [org.springframework.cloud.dataflow.server.controller.TaskExecutionControllerTests]: no resource found for suffixes {-context.xml, Context.groovy}.
21-Feb-2019 22:12:58   ____                              ____ _                __
21-Feb-2019 22:12:58 / ___| _ __  _ __(_)_ __   __ _   / ___| | ___  _   _  __| |
21-Feb-2019 22:12:58 \___ \| '_ \| '__| | '_ \ / _` | | |   | |/ _ \| | | |/ _` |
21-Feb-2019 22:12:58   ___) | |_) | |  | | | | | (_| | | |___| | (_) | |_| | (_| |
21-Feb-2019 22:12:58 |____/| .__/|_|  |_|_| |_|\__, |  \____|_|\___/ \__,_|\__,_|
21-Feb-2019 22:12:58   ____ |_|    _          __|___/                 __________
21-Feb-2019 22:12:58 |  _ \  __ _| |_ __ _  |  ___| | _____      __  \ \ \ \ \ \
21-Feb-2019 22:12:58 | | | |/ _` | __/ _` | | |_  | |/ _ \ \ /\ / /   \ \ \ \ \ \
21-Feb-2019 22:12:58 | |_| | (_| | || (_| | |  _| | | (_) \ V  V /    / / / / / /
21-Feb-2019 22:12:58 |____/ \__,_|\__\__,_| |_|   |_|\___/ \_/\_/    /_/_/_/_/_/
21-Feb-2019 22:12:58
21-Feb-2019 22:12:58
21-Feb-2019 22:12:58
21-Feb-2019 22:12:58 2019-02-21 22:12:58.249  INFO 24380 --- [           main] c.c.c.ConfigServicePropertySourceLocator : Fetching config from server at: http://localhost:8888
21-Feb-2019 22:12:58 2019-02-21 22:12:58.251  WARN 24380 --- [           main] c.c.c.ConfigServicePropertySourceLocator : Could not locate PropertySource: I/O error on GET request for "http://localhost:8888/application/default": Connection refused (Connection refused); nested exception is java.net.ConnectException: Connection refused (Connection refused)
21-Feb-2019 22:12:58 2019-02-21 22:12:58.252  INFO 24380 --- [           main] o.s.c.d.s.c.TaskExecutionControllerTests : No active profile set, falling back to default profiles: default
21-Feb-2019 22:12:58 2019-02-21 22:12:58.274  INFO 24380 --- [           main] .s.d.r.c.RepositoryConfigurationDelegate : Multiple Spring Data modules found, entering strict repository configuration mode!
21-Feb-2019 22:12:58 2019-02-21 22:12:58.360  INFO 24380 --- [           main] o.s.j.d.e.EmbeddedDatabaseFactory        : Starting embedded database: url='jdbc:h2:mem:testdb;DB_CLOSE_DELAY=-1;DB_CLOSE_ON_EXIT=false', username='sa'
21-Feb-2019 22:12:58 2019-02-21 22:12:58.386  INFO 24380 --- [           main] j.LocalContainerEntityManagerFactoryBean : Building JPA container EntityManagerFactory for persistence unit 'default'
21-Feb-2019 22:12:58 2019-02-21 22:12:58.386  INFO 24380 --- [           main] o.hibernate.jpa.internal.util.LogHelper  : HHH000204: Processing PersistenceUnitInfo [
21-Feb-2019 22:12:58         name: default
21-Feb-2019 22:12:58         ...]
21-Feb-2019 22:12:58 2019-02-21 22:12:58.390  INFO 24380 --- [           main] org.hibernate.dialect.Dialect            : HHH000400: Using dialect: org.hibernate.dialect.H2Dialect
21-Feb-2019 22:12:58 2019-02-21 22:12:58.425  INFO 24380 --- [           main] o.h.t.schema.internal.SchemaCreatorImpl  : HHH000476: Executing import script 'org.hiber[email protected]6e670b85'
21-Feb-2019 22:12:58 2019-02-21 22:12:58.426  INFO 24380 --- [           main] j.LocalContainerEntityManagerFactoryBean : Initialized JPA EntityManagerFactory for persistence unit 'default'
21-Feb-2019 22:12:58 2019-02-21 22:12:58.544  INFO 24380 --- [           main] o.s.b.c.r.s.JobRepositoryFactoryBean     : No database type set, using meta data indicating: H2
21-Feb-2019 22:12:58 2019-02-21 22:12:58.547  INFO 24380 --- [           main] o.s.b.a.s.SimpleJobServiceFactoryBean    : No database type set, using meta data indicating: H2
21-Feb-2019 22:12:58 2019-02-21 22:12:58.561  INFO 24380 --- [           main] o.s.jdbc.datasource.init.ScriptUtils     : Executing SQL script from class path resource [org/springframework/cloud/task/schema-h2.sql]
21-Feb-2019 22:12:58 2019-02-21 22:12:58.563  INFO 24380 --- [           main] o.s.jdbc.datasource.init.ScriptUtils     : Executed SQL script from class path resource [org/springframework/cloud/task/schema-h2.sql] in 2 ms.
21-Feb-2019 22:12:58 2019-02-21 22:12:58.566  INFO 24380 --- [           main] o.s.jdbc.datasource.init.ScriptUtils     : Executing SQL script from class path resource [org/springframework/batch/core/schema-h2.sql]
21-Feb-2019 22:12:58 2019-02-21 22:12:58.569  INFO 24380 --- [           main] o.s.jdbc.datasource.init.ScriptUtils     : Executed SQL script from class path resource [org/springframework/batch/core/schema-h2.sql] in 3 ms.
21-Feb-2019 22:12:58 2019-02-21 22:12:58.599  INFO 24380 --- [           main] o.s.c.d.s.c.TaskExecutionControllerTests : Started TaskExecutionControllerTests in 0.529 seconds (JVM running for 156.207)
21-Feb-2019 22:12:58 2019-02-21 22:12:58.604  INFO 24380 --- [           main] o.s.t.web.servlet.TestDispatcherServlet  : FrameworkServlet '': initialization started
21-Feb-2019 22:12:58 2019-02-21 22:12:58.608  INFO 24380 --- [           main] o.s.t.web.servlet.TestDispatcherServlet  : FrameworkServlet '': initialization completed in 2 ms
21-Feb-2019 22:12:58 2019-02-21 22:12:58.631  INFO 24380 --- [           main] o.s.t.web.servlet.TestDispatcherServlet  : FrameworkServlet '': initialization started
21-Feb-2019 22:12:58 2019-02-21 22:12:58.633  INFO 24380 --- [           main] o.s.t.web.servlet.TestDispatcherServlet  : FrameworkServlet '': initialization completed in 2 ms
21-Feb-2019 22:12:58 2019-02-21 22:12:58.638  INFO 24380 --- [           main] o.s.t.web.servlet.TestDispatcherServlet  : FrameworkServlet '': initialization started
21-Feb-2019 22:12:58 2019-02-21 22:12:58.639  INFO 24380 --- [           main] o.s.t.web.servlet.TestDispatcherServlet  : FrameworkServlet '': initialization completed in 1 ms
21-Feb-2019 22:12:58 2019-02-21 22:12:58.642  INFO 24380 --- [           main] o.s.t.web.servlet.TestDispatcherServlet  : FrameworkServlet '': initialization started
21-Feb-2019 22:12:58 2019-02-21 22:12:58.643  INFO 24380 --- [           main] o.s.t.web.servlet.TestDispatcherServlet  : FrameworkServlet '': initialization completed in 1 ms
21-Feb-2019 22:12:58 2019-02-21 22:12:58.645  INFO 24380 --- [           main] o.s.t.web.servlet.TestDispatcherServlet  : FrameworkServlet '': initialization started
21-Feb-2019 22:12:58 2019-02-21 22:12:58.646  INFO 24380 --- [           main] o.s.t.web.servlet.TestDispatcherServlet  : FrameworkServlet '': initialization completed in 1 ms
21-Feb-2019 22:12:58 2019-02-21 22:12:58.647  WARN 24380 --- [           main] o.s.c.d.s.c.RestControllerAdvice         : Caught exception while handling a request: Could not find TaskExecution with id 10
21-Feb-2019 22:12:58 2019-02-21 22:12:58.648  WARN 24380 --- [           main] .m.m.a.ExceptionHandlerExceptionResolver : Resolved [org.springframework.cloud.dataflow.server.repository.NoSuchTaskExecutionException: Could not find TaskExecution with id 10]
21-Feb-2019 22:12:58 2019-02-21 22:12:58.651  INFO 24380 --- [           main] o.s.t.web.servlet.TestDispatcherServlet  : FrameworkServlet '': initialization started
21-Feb-2019 22:12:58 2019-02-21 22:12:58.652  INFO 24380 --- [           main] o.s.t.web.servlet.TestDispatcherServlet  : FrameworkServlet '': initialization completed in 1 ms
21-Feb-2019 22:12:58 2019-02-21 22:12:58.653  WARN 24380 --- [           main] o.s.c.d.s.c.RestControllerAdvice         : Caught exception while handling a request: Could not find TaskExecution with id 1345345345345
21-Feb-2019 22:12:58 2019-02-21 22:12:58.654  WARN 24380 --- [           main] .m.m.a.ExceptionHandlerExceptionResolver : Resolved [org.springframework.cloud.dataflow.server.repository.NoSuchTaskExecutionException: Could not find TaskExecution with id 1345345345345]
21-Feb-2019 22:12:58 2019-02-21 22:12:58.656  INFO 24380 --- [           main] o.s.t.web.servlet.TestDispatcherServlet  : FrameworkServlet '': initialization started
21-Feb-2019 22:12:58 2019-02-21 22:12:58.657  INFO 24380 --- [           main] o.s.t.web.servlet.TestDispatcherServlet  : FrameworkServlet '': initialization completed in 1 ms
21-Feb-2019 22:12:58 2019-02-21 22:12:58.661  INFO 24380 --- [           main] o.s.t.web.servlet.TestDispatcherServlet  : FrameworkServlet '': initialization started
21-Feb-2019 22:12:58 2019-02-21 22:12:58.663  INFO 24380 --- [           main] o.s.t.web.servlet.TestDispatcherServlet  : FrameworkServlet '': initialization completed in 1 ms
21-Feb-2019 22:12:58 2019-02-21 22:12:58.669  INFO 24380 --- [           main] o.s.t.web.servlet.TestDispatcherServlet  : FrameworkServlet '': initialization started
21-Feb-2019 22:12:58 2019-02-21 22:12:58.670  INFO 24380 --- [           main] o.s.t.web.servlet.TestDispatcherServlet  : FrameworkServlet '': initialization completed in 1 ms
21-Feb-2019 22:12:58 2019-02-21 22:12:58.674  INFO 24380 --- [           main] o.s.t.web.servlet.TestDispatcherServlet  : FrameworkServlet '': initialization started
21-Feb-2019 22:12:58 2019-02-21 22:12:58.676  INFO 24380 --- [           main] o.s.t.web.servlet.TestDispatcherServlet  : FrameworkServlet '': initialization completed in 2 ms
21-Feb-2019 22:12:58 2019-02-21 22:12:58.676  WARN 24380 --- [           main] o.s.c.d.s.c.RestControllerAdvice         : Caught exception while handling a request: Could not find task definition named BAZ
21-Feb-2019 22:12:58 2019-02-21 22:12:58.677  WARN 24380 --- [           main] .m.m.a.ExceptionHandlerExceptionResolver : Resolved [org.springframework.cloud.dataflow.server.repository.NoSuchTaskDefinitionException: Could not find task definition named BAZ]
21-Feb-2019 22:12:58 2019-02-21 22:12:58.679  INFO 24380 --- [           main] o.s.t.web.servlet.TestDispatcherServlet  : FrameworkServlet '': initialization started
21-Feb-2019 22:12:58 2019-02-21 22:12:58.680  INFO 24380 --- [           main] o.s.t.web.servlet.TestDispatcherServlet  : FrameworkServlet '': initialization completed in 1 ms
21-Feb-2019 22:12:58 2019-02-21 22:12:58.684  INFO 24380 --- [           main] o.s.t.web.servlet.TestDispatcherServlet  : FrameworkServlet '': initialization started
21-Feb-2019 22:12:58 2019-02-21 22:12:58.686  INFO 24380 --- [           main] o.s.t.web.servlet.TestDispatcherServlet  : FrameworkServlet '': initialization completed in 2 ms
21-Feb-2019 22:12:58 2019-02-21 22:12:58.687  INFO 24380 --- [           main] j.LocalContainerEntityManagerFactoryBean : Closing JPA EntityManagerFactory for persistence unit 'default'
21-Feb-2019 22:12:58 2019-02-21 22:12:58.687  INFO 24380 --- [           main] .SchemaDropperImpl$DelayedDropActionImpl : HHH000477: Starting delayed drop of schema as part of SessionFactory shut-down'
21-Feb-2019 22:12:58 2019-02-21 22:12:58.688  INFO 24380 --- [           main] o.s.j.d.e.EmbeddedDatabaseFactory        : Shutting down embedded database: url='jdbc:h2:mem:testdb;DB_CLOSE_DELAY=-1;DB_CLOSE_ON_EXIT=false'
21-Feb-2019 22:12:58 [INFO] Tests run: 12, Failures: 0, Errors: 0, Skipped: 0, Time elapsed: 0.624 s - in org.springframework.cloud.dataflow.server.controller.TaskExecutionControllerTests
21-Feb-2019 22:12:58 [INFO] Running org.springframework.cloud.dataflow.server.completion.TabOnTapCompletionProviderTests
21-Feb-2019 22:12:58 2019-02-21 22:12:58.689  INFO 24380 --- [           main] o.s.t.c.support.AbstractContextLoader    : Could not detect default resource locations for test class [org.springframework.cloud.dataflow.server.completion.TabOnTapCompletionProviderTests]: no resource found for suffixes {-context.xml, Context.groovy}.
21-Feb-2019 22:12:58   ____                              ____ _                __
21-Feb-2019 22:12:58 / ___| _ __  _ __(_)_ __   __ _   / ___| | ___  _   _  __| |
21-Feb-2019 22:12:58 \___ \| '_ \| '__| | '_ \ / _` | | |   | |/ _ \| | | |/ _` |
21-Feb-2019 22:12:58   ___) | |_) | |  | | | | | (_| | | |___| | (_) | |_| | (_| |
21-Feb-2019 22:12:58 |____/| .__/|_|  |_|_| |_|\__, |  \____|_|\___/ \__,_|\__,_|
21-Feb-2019 22:12:58   ____ |_|    _          __|___/                 __________
21-Feb-2019 22:12:58 |  _ \  __ _| |_ __ _  |  ___| | _____      __  \ \ \ \ \ \
21-Feb-2019 22:12:58 | | | |/ _` | __/ _` | | |_  | |/ _ \ \ /\ / /   \ \ \ \ \ \
21-Feb-2019 22:12:58 | |_| | (_| | || (_| | |  _| | | (_) \ V  V /    / / / / / /
21-Feb-2019 22:12:58 |____/ \__,_|\__\__,_| |_|   |_|\___/ \_/\_/    /_/_/_/_/_/
21-Feb-2019 22:12:58
21-Feb-2019 22:12:58
21-Feb-2019 22:12:58
21-Feb-2019 22:12:58 2019-02-21 22:12:58.878  INFO 24380 --- [           main] c.c.c.ConfigServicePropertySourceLocator : Fetching config from server at: http://localhost:8888
21-Feb-2019 22:12:58 2019-02-21 22:12:58.880  WARN 24380 --- [           main] c.c.c.ConfigServicePropertySourceLocator : Could not locate PropertySource: I/O error on GET request for "http://localhost:8888/application/default": Connection refused (Connection refused); nested exception is java.net.ConnectException: Connection refused (Connection refused)
21-Feb-2019 22:12:58 2019-02-21 22:12:58.881  INFO 24380 --- [           main] .c.d.s.c.TabOnTapCompletionProviderTests : No active profile set, falling back to default profiles: default
21-Feb-2019 22:12:58 2019-02-21 22:12:58.930  INFO 24380 --- [           main] .c.d.s.c.TabOnTapCompletionProviderTests : Started TabOnTapCompletionProviderTests in 0.233 seconds (JVM running for 156.538)
21-Feb-2019 22:12:58 [INFO] Tests run: 3, Failures: 0, Errors: 0, Skipped: 0, Time elapsed: 0.247 s - in org.springframework.cloud.dataflow.server.completion.TabOnTapCompletionProviderTests
21-Feb-2019 22:12:58 [INFO] Running org.springframework.cloud.dataflow.server.stream.AppDeployerStreamDeployerTests
21-Feb-2019 22:12:58 [INFO] Tests run: 3, Failures: 0, Errors: 0, Skipped: 0, Time elapsed: 0.011 s - in org.springframework.cloud.dataflow.server.stream.AppDeployerStreamDeployerTests
21-Feb-2019 22:12:58 [INFO] Running org.springframework.cloud.dataflow.server.stream.SkipperStreamDeployerTests
21-Feb-2019 22:12:58 2019-02-21 22:12:58.960 ERROR 24380 --- [           main] o.s.c.d.s.stream.SkipperStreamDeployer   : Could not parse Skipper Platform Status JSON [blah]. Exception message = Unrecognized token 'blah': was expecting ('true', 'false' or 'null')
21-Feb-2019 22:12:58 at [Source: blah; line: 1, column: 9]
21-Feb-2019 22:12:58 2019-02-21 22:12:58.971  INFO 24380 --- [           main] o.s.c.d.s.stream.SkipperStreamDeployer   : Deploying Stream test1 using skipper.
21-Feb-2019 22:12:58 2019-02-21 22:12:58.974  INFO 24380 --- [           main] o.s.c.d.s.stream.SkipperStreamDeployer   : Deploying Stream test1 using skipper.
21-Feb-2019 22:12:58 2019-02-21 22:12:58.980  INFO 24380 --- [           main] o.s.c.d.s.stream.SkipperStreamDeployer   : Deploying Stream test1 using skipper.
21-Feb-2019 22:12:58 2019-02-21 22:12:58.981  INFO 24380 --- [           main] o.s.c.d.s.stream.SkipperStreamDeployer   : Deploying Stream test1 using skipper.
21-Feb-2019 22:12:58 2019-02-21 22:12:58.981  INFO 24380 --- [           main] o.s.c.d.s.stream.SkipperStreamDeployer   : Using platform 'testPlatform'
21-Feb-2019 22:12:58 2019-02-21 22:12:58.988  INFO 24380 --- [           main] o.s.c.d.s.stream.SkipperStreamDeployer   : Deploying Stream test1 using skipper.
21-Feb-2019 22:12:59 [INFO] Tests run: 18, Failures: 0, Errors: 0, Skipped: 0, Time elapsed: 0.042 s - in org.springframework.cloud.dataflow.server.stream.SkipperStreamDeployerTests
21-Feb-2019 22:12:59 [INFO] Running org.springframework.cloud.dataflow.server.stream.ResourceUtilsTests
21-Feb-2019 22:12:59 [INFO] Tests run: 6, Failures: 0, Errors: 0, Skipped: 0, Time elapsed: 0.001 s - in org.springframework.cloud.dataflow.server.stream.ResourceUtilsTests
21-Feb-2019 22:12:59 [INFO] Running org.springframework.cloud.dataflow.server.repository.support.SearchPageableTests
21-Feb-2019 22:12:59 [INFO] Tests run: 7, Failures: 0, Errors: 0, Skipped: 0, Time elapsed: 0.002 s - in org.springframework.cloud.dataflow.server.repository.support.SearchPageableTests
21-Feb-2019 22:12:59 [INFO] Running org.springframework.cloud.dataflow.server.repository.DeploymentKeyTests
21-Feb-2019 22:12:59 [INFO] Tests run: 2, Failures: 0, Errors: 0, Skipped: 0, Time elapsed: 0 s - in org.springframework.cloud.dataflow.server.repository.DeploymentKeyTests
21-Feb-2019 22:12:59 [INFO] Running org.springframework.cloud.dataflow.server.repository.TaskExecutionExplorerTests
21-Feb-2019 22:12:59 2019-02-21 22:12:59.003  INFO 24380 --- [           main] o.s.t.c.support.AbstractContextLoader    : Could not detect default resource locations for test class [org.springframework.cloud.dataflow.server.repository.TaskExecutionExplorerTests]: no resource found for suffixes {-context.xml, Context.groovy}.
21-Feb-2019 22:12:59   ____                              ____ _                __
21-Feb-2019 22:12:59 / ___| _ __  _ __(_)_ __   __ _   / ___| | ___  _   _  __| |
21-Feb-2019 22:12:59 \___ \| '_ \| '__| | '_ \ / _` | | |   | |/ _ \| | | |/ _` |
21-Feb-2019 22:12:59   ___) | |_) | |  | | | | | (_| | | |___| | (_) | |_| | (_| |
21-Feb-2019 22:12:59 |____/| .__/|_|  |_|_| |_|\__, |  \____|_|\___/ \__,_|\__,_|
21-Feb-2019 22:12:59   ____ |_|    _          __|___/                 __________
21-Feb-2019 22:12:59 |  _ \  __ _| |_ __ _  |  ___| | _____      __  \ \ \ \ \ \
21-Feb-2019 22:12:59 | | | |/ _` | __/ _` | | |_  | |/ _ \ \ /\ / /   \ \ \ \ \ \
21-Feb-2019 22:12:59 | |_| | (_| | || (_| | |  _| | | (_) \ V  V /    / / / / / /
21-Feb-2019 22:12:59 |____/ \__,_|\__\__,_| |_|   |_|\___/ \_/\_/    /_/_/_/_/_/
21-Feb-2019 22:12:59
21-Feb-2019 22:12:59
21-Feb-2019 22:12:59
21-Feb-2019 22:12:59 2019-02-21 22:12:59.192  INFO 24380 --- [           main] c.c.c.ConfigServicePropertySourceLocator : Fetching config from server at: http://localhost:8888
21-Feb-2019 22:12:59 2019-02-21 22:12:59.194  WARN 24380 --- [           main] c.c.c.ConfigServicePropertySourceLocator : Could not locate PropertySource: I/O error on GET request for "http://localhost:8888/application/default": Connection refused (Connection refused); nested exception is java.net.ConnectException: Connection refused (Connection refused)
21-Feb-2019 22:12:59 2019-02-21 22:12:59.195  INFO 24380 --- [           main] o.s.c.d.s.r.TaskExecutionExplorerTests   : No active profile set, falling back to default profiles: default
21-Feb-2019 22:12:59 2019-02-21 22:12:59.281  INFO 24380 --- [           main] o.s.j.d.e.EmbeddedDatabaseFactory        : Starting embedded database: url='jdbc:h2:mem:testdb;DB_CLOSE_DELAY=-1;DB_CLOSE_ON_EXIT=false', username='sa'
21-Feb-2019 22:12:59 2019-02-21 22:12:59.286  INFO 24380 --- [           main] o.s.jdbc.datasource.init.ScriptUtils     : Executing SQL script from class path resource [org/springframework/cloud/task/schema-h2.sql]
21-Feb-2019 22:12:59 2019-02-21 22:12:59.288  INFO 24380 --- [           main] o.s.jdbc.datasource.init.ScriptUtils     : Executed SQL script from class path resource [org/springframework/cloud/task/schema-h2.sql] in 1 ms.
21-Feb-2019 22:12:59 2019-02-21 22:12:59.304  INFO 24380 --- [           main] o.s.c.d.s.r.s.DataflowRdbmsInitializer   : Adding dataflow schema classpath:schemas/h2/common.sql for h2 database
21-Feb-2019 22:12:59 2019-02-21 22:12:59.304  INFO 24380 --- [           main] o.s.c.d.s.r.s.DataflowRdbmsInitializer   : Adding dataflow schema classpath:schemas/h2/streams.sql for h2 database
21-Feb-2019 22:12:59 2019-02-21 22:12:59.304  INFO 24380 --- [           main] o.s.c.d.s.r.s.DataflowRdbmsInitializer   : Adding dataflow schema classpath:schemas/h2/tasks.sql for h2 database
21-Feb-2019 22:12:59 2019-02-21 22:12:59.304  INFO 24380 --- [           main] o.s.c.d.s.r.s.DataflowRdbmsInitializer   : Adding dataflow schema classpath:schemas/h2/deployment.sql for h2 database
21-Feb-2019 22:12:59 2019-02-21 22:12:59.304  INFO 24380 --- [           main] o.s.c.d.s.r.s.DataflowRdbmsInitializer   : Adding dataflow schema classpath:schemas/h2/jpa.sql for h2 database
21-Feb-2019 22:12:59 2019-02-21 22:12:59.305  INFO 24380 --- [           main] o.s.jdbc.datasource.init.ScriptUtils     : Executing SQL script from class path resource [schemas/h2/common.sql]
21-Feb-2019 22:12:59 2019-02-21 22:12:59.305  INFO 24380 --- [           main] o.s.jdbc.datasource.init.ScriptUtils     : Executed SQL script from class path resource [schemas/h2/common.sql] in 0 ms.
21-Feb-2019 22:12:59 2019-02-21 22:12:59.305  INFO 24380 --- [           main] o.s.jdbc.datasource.init.ScriptUtils     : Executing SQL script from class path resource [schemas/h2/streams.sql]
21-Feb-2019 22:12:59 2019-02-21 22:12:59.305  INFO 24380 --- [           main] o.s.jdbc.datasource.init.ScriptUtils     : Executed SQL script from class path resource [schemas/h2/streams.sql] in 0 ms.
21-Feb-2019 22:12:59 2019-02-21 22:12:59.305  INFO 24380 --- [           main] o.s.jdbc.datasource.init.ScriptUtils     : Executing SQL script from class path resource [schemas/h2/tasks.sql]
21-Feb-2019 22:12:59 2019-02-21 22:12:59.306  INFO 24380 --- [           main] o.s.jdbc.datasource.init.ScriptUtils     : Executed SQL script from class path resource [schemas/h2/tasks.sql] in 1 ms.
21-Feb-2019 22:12:59 2019-02-21 22:12:59.306  INFO 24380 --- [           main] o.s.jdbc.datasource.init.ScriptUtils     : Executing SQL script from class path resource [schemas/h2/deployment.sql]
21-Feb-2019 22:12:59 2019-02-21 22:12:59.306  INFO 24380 --- [           main] o.s.jdbc.datasource.init.ScriptUtils     : Executed SQL script from class path resource [schemas/h2/deployment.sql] in 0 ms.
21-Feb-2019 22:12:59 2019-02-21 22:12:59.306  INFO 24380 --- [           main] o.s.jdbc.datasource.init.ScriptUtils     : Executing SQL script from class path resource [schemas/h2/jpa.sql]
21-Feb-2019 22:12:59 2019-02-21 22:12:59.306  INFO 24380 --- [           main] o.s.jdbc.datasource.init.ScriptUtils     : Executed SQL script from class path resource [schemas/h2/jpa.sql] in 0 ms.
21-Feb-2019 22:12:59 2019-02-21 22:12:59.312  INFO 24380 --- [           main] o.s.c.d.s.r.TaskExecutionExplorerTests   : Started TaskExecutionExplorerTests in 0.301 seconds (JVM running for 156.92)
21-Feb-2019 22:12:59 2019-02-21 22:12:59.323  INFO 24380 --- [           main] o.s.j.d.e.EmbeddedDatabaseFactory        : Shutting down embedded database: url='jdbc:h2:mem:testdb;DB_CLOSE_DELAY=-1;DB_CLOSE_ON_EXIT=false'
21-Feb-2019 22:12:59 [INFO] Tests run: 3, Failures: 0, Errors: 0, Skipped: 0, Time elapsed: 0.313 s - in org.springframework.cloud.dataflow.server.repository.TaskExecutionExplorerTests
21-Feb-2019 22:12:59 [INFO] Running org.springframework.cloud.dataflow.server.repository.RdbmsDeploymentIdRepositoryTests
21-Feb-2019 22:12:59 2019-02-21 22:12:59.324  INFO 24380 --- [           main] o.s.t.c.support.AbstractContextLoader    : Could not detect default resource locations for test class [org.springframework.cloud.dataflow.server.repository.RdbmsDeploymentIdRepositoryTests]: no resource found for suffixes {-context.xml, Context.groovy}.
21-Feb-2019 22:12:59   ____                              ____ _                __
21-Feb-2019 22:12:59 / ___| _ __  _ __(_)_ __   __ _   / ___| | ___  _   _  __| |
21-Feb-2019 22:12:59 \___ \| '_ \| '__| | '_ \ / _` | | |   | |/ _ \| | | |/ _` |
21-Feb-2019 22:12:59   ___) | |_) | |  | | | | | (_| | | |___| | (_) | |_| | (_| |
21-Feb-2019 22:12:59 |____/| .__/|_|  |_|_| |_|\__, |  \____|_|\___/ \__,_|\__,_|
21-Feb-2019 22:12:59   ____ |_|    _          __|___/                 __________
21-Feb-2019 22:12:59 |  _ \  __ _| |_ __ _  |  ___| | _____      __  \ \ \ \ \ \
21-Feb-2019 22:12:59 | | | |/ _` | __/ _` | | |_  | |/ _ \ \ /\ / /   \ \ \ \ \ \
21-Feb-2019 22:12:59 | |_| | (_| | || (_| | |  _| | | (_) \ V  V /    / / / / / /
21-Feb-2019 22:12:59 |____/ \__,_|\__\__,_| |_|   |_|\___/ \_/\_/    /_/_/_/_/_/
21-Feb-2019 22:12:59
21-Feb-2019 22:12:59
21-Feb-2019 22:12:59
21-Feb-2019 22:12:59 2019-02-21 22:12:59.509  INFO 24380 --- [           main] c.c.c.ConfigServicePropertySourceLocator : Fetching config from server at: http://localhost:8888
21-Feb-2019 22:12:59 2019-02-21 22:12:59.511  WARN 24380 --- [           main] c.c.c.ConfigServicePropertySourceLocator : Could not locate PropertySource: I/O error on GET request for "http://localhost:8888/application/default": Connection refused (Connection refused); nested exception is java.net.ConnectException: Connection refused (Connection refused)
21-Feb-2019 22:12:59 2019-02-21 22:12:59.512  INFO 24380 --- [           main] c.d.s.r.RdbmsDeploymentIdRepositoryTests : No active profile set, falling back to default profiles: default
21-Feb-2019 22:12:59 2019-02-21 22:12:59.585  INFO 24380 --- [           main] o.s.j.d.e.EmbeddedDatabaseFactory        : Starting embedded database: url='jdbc:h2:mem:testdb;DB_CLOSE_DELAY=-1;DB_CLOSE_ON_EXIT=false', username='sa'
21-Feb-2019 22:12:59 2019-02-21 22:12:59.603  INFO 24380 --- [           main] o.s.c.d.s.r.s.DataflowRdbmsInitializer   : Adding dataflow schema classpath:schemas/h2/common.sql for h2 database
21-Feb-2019 22:12:59 2019-02-21 22:12:59.603  INFO 24380 --- [           main] o.s.c.d.s.r.s.DataflowRdbmsInitializer   : Adding dataflow schema classpath:schemas/h2/streams.sql for h2 database
21-Feb-2019 22:12:59 2019-02-21 22:12:59.603  INFO 24380 --- [           main] o.s.c.d.s.r.s.DataflowRdbmsInitializer   : Adding dataflow schema classpath:schemas/h2/tasks.sql for h2 database
21-Feb-2019 22:12:59 2019-02-21 22:12:59.604  INFO 24380 --- [           main] o.s.c.d.s.r.s.DataflowRdbmsInitializer   : Adding dataflow schema classpath:schemas/h2/deployment.sql for h2 database
21-Feb-2019 22:12:59 2019-02-21 22:12:59.604  INFO 24380 --- [           main] o.s.c.d.s.r.s.DataflowRdbmsInitializer   : Adding dataflow schema classpath:schemas/h2/jpa.sql for h2 database
21-Feb-2019 22:12:59 2019-02-21 22:12:59.604  INFO 24380 --- [           main] o.s.jdbc.datasource.init.ScriptUtils     : Executing SQL script from class path resource [schemas/h2/common.sql]
21-Feb-2019 22:12:59 2019-02-21 22:12:59.604  INFO 24380 --- [           main] o.s.jdbc.datasource.init.ScriptUtils     : Executed SQL script from class path resource [schemas/h2/common.sql] in 0 ms.
21-Feb-2019 22:12:59 2019-02-21 22:12:59.604  INFO 24380 --- [           main] o.s.jdbc.datasource.init.ScriptUtils     : Executing SQL script from class path resource [schemas/h2/streams.sql]
21-Feb-2019 22:12:59 2019-02-21 22:12:59.605  INFO 24380 --- [           main] o.s.jdbc.datasource.init.ScriptUtils     : Executed SQL script from class path resource [schemas/h2/streams.sql] in 1 ms.
21-Feb-2019 22:12:59 2019-02-21 22:12:59.605  INFO 24380 --- [           main] o.s.jdbc.datasource.init.ScriptUtils     : Executing SQL script from class path resource [schemas/h2/tasks.sql]
21-Feb-2019 22:12:59 2019-02-21 22:12:59.606  INFO 24380 --- [           main] o.s.jdbc.datasource.init.ScriptUtils     : Executed SQL script from class path resource [schemas/h2/tasks.sql] in 1 ms.
21-Feb-2019 22:12:59 2019-02-21 22:12:59.606  INFO 24380 --- [           main] o.s.jdbc.datasource.init.ScriptUtils     : Executing SQL script from class path resource [schemas/h2/deployment.sql]
21-Feb-2019 22:12:59 2019-02-21 22:12:59.606  INFO 24380 --- [           main] o.s.jdbc.datasource.init.ScriptUtils     : Executed SQL script from class path resource [schemas/h2/deployment.sql] in 0 ms.
21-Feb-2019 22:12:59 2019-02-21 22:12:59.606  INFO 24380 --- [           main] o.s.jdbc.datasource.init.ScriptUtils     : Executing SQL script from class path resource [schemas/h2/jpa.sql]
21-Feb-2019 22:12:59 2019-02-21 22:12:59.606  INFO 24380 --- [           main] o.s.jdbc.datasource.init.ScriptUtils     : Executed SQL script from class path resource [schemas/h2/jpa.sql] in 0 ms.
21-Feb-2019 22:12:59 2019-02-21 22:12:59.610  INFO 24380 --- [           main] c.d.s.r.RdbmsDeploymentIdRepositoryTests : Started RdbmsDeploymentIdRepositoryTests in 0.279 seconds (JVM running for 157.219)
21-Feb-2019 22:12:59 [INFO] Tests run: 2, Failures: 0, Errors: 0, Skipped: 0, Time elapsed: 0.29 s - in org.springframework.cloud.dataflow.server.repository.RdbmsDeploymentIdRepositoryTests
21-Feb-2019 22:12:59 [INFO] Running org.springframework.cloud.dataflow.server.repository.RdbmsTaskDefinitionRepositoryTests
21-Feb-2019 22:12:59 2019-02-21 22:12:59.617  INFO 24380 --- [           main] o.s.t.c.support.AbstractContextLoader    : Could not detect default resource locations for test class [org.springframework.cloud.dataflow.server.repository.RdbmsTaskDefinitionRepositoryTests]: no resource found for suffixes {-context.xml, Context.groovy}.
21-Feb-2019 22:12:59   ____                              ____ _                __
21-Feb-2019 22:12:59 / ___| _ __  _ __(_)_ __   __ _   / ___| | ___  _   _  __| |
21-Feb-2019 22:12:59 \___ \| '_ \| '__| | '_ \ / _` | | |   | |/ _ \| | | |/ _` |
21-Feb-2019 22:12:59   ___) | |_) | |  | | | | | (_| | | |___| | (_) | |_| | (_| |
21-Feb-2019 22:12:59 |____/| .__/|_|  |_|_| |_|\__, |  \____|_|\___/ \__,_|\__,_|
21-Feb-2019 22:12:59   ____ |_|    _          __|___/                 __________
21-Feb-2019 22:12:59 |  _ \  __ _| |_ __ _  |  ___| | _____      __  \ \ \ \ \ \
21-Feb-2019 22:12:59 | | | |/ _` | __/ _` | | |_  | |/ _ \ \ /\ / /   \ \ \ \ \ \
21-Feb-2019 22:12:59 | |_| | (_| | || (_| | |  _| | | (_) \ V  V /    / / / / / /
21-Feb-2019 22:12:59 |____/ \__,_|\__\__,_| |_|   |_|\___/ \_/\_/    /_/_/_/_/_/
21-Feb-2019 22:12:59
21-Feb-2019 22:12:59
21-Feb-2019 22:12:59
21-Feb-2019 22:12:59 2019-02-21 22:12:59.803  INFO 24380 --- [           main] c.c.c.ConfigServicePropertySourceLocator : Fetching config from server at: http://localhost:8888
21-Feb-2019 22:12:59 2019-02-21 22:12:59.804  WARN 24380 --- [           main] c.c.c.ConfigServicePropertySourceLocator : Could not locate PropertySource: I/O error on GET request for "http://localhost:8888/application/default": Connection refused (Connection refused); nested exception is java.net.ConnectException: Connection refused (Connection refused)
21-Feb-2019 22:12:59 2019-02-21 22:12:59.805  INFO 24380 --- [           main] d.s.r.RdbmsTaskDefinitionRepositoryTests : No active profile set, falling back to default profiles: default
21-Feb-2019 22:12:59 2019-02-21 22:12:59.887  INFO 24380 --- [           main] o.s.j.d.e.EmbeddedDatabaseFactory        : Starting embedded database: url='jdbc:h2:mem:testdb;DB_CLOSE_DELAY=-1;DB_CLOSE_ON_EXIT=false', username='sa'
21-Feb-2019 22:12:59 2019-02-21 22:12:59.889  INFO 24380 --- [           main] o.s.jdbc.datasource.init.ScriptUtils     : Executing SQL script from class path resource [org/springframework/cloud/task/schema-h2.sql]
21-Feb-2019 22:12:59 2019-02-21 22:12:59.890  INFO 24380 --- [           main] o.s.jdbc.datasource.init.ScriptUtils     : Executed SQL script from class path resource [org/springframework/cloud/task/schema-h2.sql] in 1 ms.
21-Feb-2019 22:12:59 2019-02-21 22:12:59.906  INFO 24380 --- [           main] o.s.c.d.s.r.s.DataflowRdbmsInitializer   : Adding dataflow schema classpath:schemas/h2/common.sql for h2 database
21-Feb-2019 22:12:59 2019-02-21 22:12:59.906  INFO 24380 --- [           main] o.s.c.d.s.r.s.DataflowRdbmsInitializer   : Adding dataflow schema classpath:schemas/h2/streams.sql for h2 database
21-Feb-2019 22:12:59 2019-02-21 22:12:59.906  INFO 24380 --- [           main] o.s.c.d.s.r.s.DataflowRdbmsInitializer   : Adding dataflow schema classpath:schemas/h2/tasks.sql for h2 database
21-Feb-2019 22:12:59 2019-02-21 22:12:59.906  INFO 24380 --- [           main] o.s.c.d.s.r.s.DataflowRdbmsInitializer   : Adding dataflow schema classpath:schemas/h2/deployment.sql for h2 database
21-Feb-2019 22:12:59 2019-02-21 22:12:59.906  INFO 24380 --- [           main] o.s.c.d.s.r.s.DataflowRdbmsInitializer   : Adding dataflow schema classpath:schemas/h2/jpa.sql for h2 database
21-Feb-2019 22:12:59 2019-02-21 22:12:59.906  INFO 24380 --- [           main] o.s.jdbc.datasource.init.ScriptUtils     : Executing SQL script from class path resource [schemas/h2/common.sql]
21-Feb-2019 22:12:59 2019-02-21 22:12:59.907  INFO 24380 --- [           main] o.s.jdbc.datasource.init.ScriptUtils     : Executed SQL script from class path resource [schemas/h2/common.sql] in 0 ms.
21-Feb-2019 22:12:59 2019-02-21 22:12:59.907  INFO 24380 --- [           main] o.s.jdbc.datasource.init.ScriptUtils     : Executing SQL script from class path resource [schemas/h2/streams.sql]
21-Feb-2019 22:12:59 2019-02-21 22:12:59.907  INFO 24380 --- [           main] o.s.jdbc.datasource.init.ScriptUtils     : Executed SQL script from class path resource [schemas/h2/streams.sql] in 0 ms.
21-Feb-2019 22:12:59 2019-02-21 22:12:59.907  INFO 24380 --- [           main] o.s.jdbc.datasource.init.ScriptUtils     : Executing SQL script from class path resource [schemas/h2/tasks.sql]
21-Feb-2019 22:12:59 2019-02-21 22:12:59.908  INFO 24380 --- [           main] o.s.jdbc.datasource.init.ScriptUtils     : Executed SQL script from class path resource [schemas/h2/tasks.sql] in 1 ms.
21-Feb-2019 22:12:59 2019-02-21 22:12:59.908  INFO 24380 --- [           main] o.s.jdbc.datasource.init.ScriptUtils     : Executing SQL script from class path resource [schemas/h2/deployment.sql]
21-Feb-2019 22:12:59 2019-02-21 22:12:59.908  INFO 24380 --- [           main] o.s.jdbc.datasource.init.ScriptUtils     : Executed SQL script from class path resource [schemas/h2/deployment.sql] in 0 ms.
21-Feb-2019 22:12:59 2019-02-21 22:12:59.908  INFO 24380 --- [           main] o.s.jdbc.datasource.init.ScriptUtils     : Executing SQL script from class path resource [schemas/h2/jpa.sql]
21-Feb-2019 22:12:59 2019-02-21 22:12:59.908  INFO 24380 --- [           main] o.s.jdbc.datasource.init.ScriptUtils     : Executed SQL script from class path resource [schemas/h2/jpa.sql] in 0 ms.
21-Feb-2019 22:12:59 2019-02-21 22:12:59.914  INFO 24380 --- [           main] d.s.r.RdbmsTaskDefinitionRepositoryTests : Started RdbmsTaskDefinitionRepositoryTests in 0.289 seconds (JVM running for 157.522)
21-Feb-2019 22:12:59 [INFO] Tests run: 28, Failures: 0, Errors: 0, Skipped: 0, Time elapsed: 0.374 s - in org.springframework.cloud.dataflow.server.repository.RdbmsTaskDefinitionRepositoryTests
21-Feb-2019 22:12:59 [INFO] Running org.springframework.cloud.dataflow.server.repository.RdbmsStreamDefinitionRepositoryTests
21-Feb-2019 22:12:59 2019-02-21 22:12:59.994  INFO 24380 --- [           main] o.s.t.c.support.AbstractContextLoader    : Could not detect default resource locations for test class [org.springframework.cloud.dataflow.server.repository.RdbmsStreamDefinitionRepositoryTests]: no resource found for suffixes {-context.xml, Context.groovy}.
21-Feb-2019 22:13:00   ____                              ____ _                __
21-Feb-2019 22:13:00 / ___| _ __  _ __(_)_ __   __ _   / ___| | ___  _   _  __| |
21-Feb-2019 22:13:00 \___ \| '_ \| '__| | '_ \ / _` | | |   | |/ _ \| | | |/ _` |
21-Feb-2019 22:13:00   ___) | |_) | |  | | | | | (_| | | |___| | (_) | |_| | (_| |
21-Feb-2019 22:13:00 |____/| .__/|_|  |_|_| |_|\__, |  \____|_|\___/ \__,_|\__,_|
21-Feb-2019 22:13:00   ____ |_|    _          __|___/                 __________
21-Feb-2019 22:13:00 |  _ \  __ _| |_ __ _  |  ___| | _____      __  \ \ \ \ \ \
21-Feb-2019 22:13:00 | | | |/ _` | __/ _` | | |_  | |/ _ \ \ /\ / /   \ \ \ \ \ \
21-Feb-2019 22:13:00 | |_| | (_| | || (_| | |  _| | | (_) \ V  V /    / / / / / /
21-Feb-2019 22:13:00 |____/ \__,_|\__\__,_| |_|   |_|\___/ \_/\_/    /_/_/_/_/_/
21-Feb-2019 22:13:00
21-Feb-2019 22:13:00
21-Feb-2019 22:13:00
21-Feb-2019 22:13:00 2019-02-21 22:13:00.184  INFO 24380 --- [           main] c.c.c.ConfigServicePropertySourceLocator : Fetching config from server at: http://localhost:8888
21-Feb-2019 22:13:00 2019-02-21 22:13:00.186  WARN 24380 --- [           main] c.c.c.ConfigServicePropertySourceLocator : Could not locate PropertySource: I/O error on GET request for "http://localhost:8888/application/default": Connection refused (Connection refused); nested exception is java.net.ConnectException: Connection refused (Connection refused)
21-Feb-2019 22:13:00 2019-02-21 22:13:00.187  INFO 24380 --- [           main] s.r.RdbmsStreamDefinitionRepositoryTests : No active profile set, falling back to default profiles: default
21-Feb-2019 22:13:00 2019-02-21 22:13:00.260  INFO 24380 --- [           main] o.s.j.d.e.EmbeddedDatabaseFactory        : Starting embedded database: url='jdbc:h2:mem:testdb;DB_CLOSE_DELAY=-1;DB_CLOSE_ON_EXIT=false', username='sa'
21-Feb-2019 22:13:00 2019-02-21 22:13:00.279  INFO 24380 --- [           main] o.s.c.d.s.r.s.DataflowRdbmsInitializer   : Adding dataflow schema classpath:schemas/h2/common.sql for h2 database
21-Feb-2019 22:13:00 2019-02-21 22:13:00.279  INFO 24380 --- [           main] o.s.c.d.s.r.s.DataflowRdbmsInitializer   : Adding dataflow schema classpath:schemas/h2/streams.sql for h2 database
21-Feb-2019 22:13:00 2019-02-21 22:13:00.279  INFO 24380 --- [           main] o.s.c.d.s.r.s.DataflowRdbmsInitializer   : Adding dataflow schema classpath:schemas/h2/tasks.sql for h2 database
21-Feb-2019 22:13:00 2019-02-21 22:13:00.279  INFO 24380 --- [           main] o.s.c.d.s.r.s.DataflowRdbmsInitializer   : Adding dataflow schema classpath:schemas/h2/deployment.sql for h2 database
21-Feb-2019 22:13:00 2019-02-21 22:13:00.279  INFO 24380 --- [           main] o.s.c.d.s.r.s.DataflowRdbmsInitializer   : Adding dataflow schema classpath:schemas/h2/jpa.sql for h2 database
21-Feb-2019 22:13:00 2019-02-21 22:13:00.279  INFO 24380 --- [           main] o.s.jdbc.datasource.init.ScriptUtils     : Executing SQL script from class path resource [schemas/h2/common.sql]
21-Feb-2019 22:13:00 2019-02-21 22:13:00.279  INFO 24380 --- [           main] o.s.jdbc.datasource.init.ScriptUtils     : Executed SQL script from class path resource [schemas/h2/common.sql] in 0 ms.
21-Feb-2019 22:13:00 2019-02-21 22:13:00.279  INFO 24380 --- [           main] o.s.jdbc.datasource.init.ScriptUtils     : Executing SQL script from class path resource [schemas/h2/streams.sql]
21-Feb-2019 22:13:00 2019-02-21 22:13:00.280  INFO 24380 --- [           main] o.s.jdbc.datasource.init.ScriptUtils     : Executed SQL script from class path resource [schemas/h2/streams.sql] in 1 ms.
21-Feb-2019 22:13:00 2019-02-21 22:13:00.280  INFO 24380 --- [           main] o.s.jdbc.datasource.init.ScriptUtils     : Executing SQL script from class path resource [schemas/h2/tasks.sql]
21-Feb-2019 22:13:00 2019-02-21 22:13:00.280  INFO 24380 --- [           main] o.s.jdbc.datasource.init.ScriptUtils     : Executed SQL script from class path resource [schemas/h2/tasks.sql] in 0 ms.
21-Feb-2019 22:13:00 2019-02-21 22:13:00.280  INFO 24380 --- [           main] o.s.jdbc.datasource.init.ScriptUtils     : Executing SQL script from class path resource [schemas/h2/deployment.sql]
21-Feb-2019 22:13:00 2019-02-21 22:13:00.280  INFO 24380 --- [           main] o.s.jdbc.datasource.init.ScriptUtils     : Executed SQL script from class path resource [schemas/h2/deployment.sql] in 0 ms.
21-Feb-2019 22:13:00 2019-02-21 22:13:00.280  INFO 24380 --- [           main] o.s.jdbc.datasource.init.ScriptUtils     : Executing SQL script from class path resource [schemas/h2/jpa.sql]
21-Feb-2019 22:13:00 2019-02-21 22:13:00.280  INFO 24380 --- [           main] o.s.jdbc.datasource.init.ScriptUtils     : Executed SQL script from class path resource [schemas/h2/jpa.sql] in 0 ms.
21-Feb-2019 22:13:00 2019-02-21 22:13:00.287  INFO 24380 --- [           main] s.r.RdbmsStreamDefinitionRepositoryTests : Started RdbmsStreamDefinitionRepositoryTests in 0.285 seconds (JVM running for 157.895)
21-Feb-2019 22:13:00 [INFO] Tests run: 40, Failures: 0, Errors: 0, Skipped: 0, Time elapsed: 0.395 s - in org.springframework.cloud.dataflow.server.repository.RdbmsStreamDefinitionRepositoryTests
21-Feb-2019 22:13:00 [INFO] Running org.springframework.cloud.dataflow.server.repository.SchemaGenerationTests
21-Feb-2019 22:13:00 2019-02-21 22:13:00.392  INFO 24380 --- [           main] o.s.t.c.support.AbstractContextLoader    : Could not detect default resource locations for test class [org.springframework.cloud.dataflow.server.repository.SchemaGenerationTests]: no resource found for suffixes {-context.xml, Context.groovy}.
21-Feb-2019 22:13:00   ____                              ____ _                __
21-Feb-2019 22:13:00 / ___| _ __  _ __(_)_ __   __ _   / ___| | ___  _   _  __| |
21-Feb-2019 22:13:00 \___ \| '_ \| '__| | '_ \ / _` | | |   | |/ _ \| | | |/ _` |
21-Feb-2019 22:13:00   ___) | |_) | |  | | | | | (_| | | |___| | (_) | |_| | (_| |
21-Feb-2019 22:13:00 |____/| .__/|_|  |_|_| |_|\__, |  \____|_|\___/ \__,_|\__,_|
21-Feb-2019 22:13:00   ____ |_|    _          __|___/                 __________
21-Feb-2019 22:13:00 |  _ \  __ _| |_ __ _  |  ___| | _____      __  \ \ \ \ \ \
21-Feb-2019 22:13:00 | | | |/ _` | __/ _` | | |_  | |/ _ \ \ /\ / /   \ \ \ \ \ \
21-Feb-2019 22:13:00 | |_| | (_| | || (_| | |  _| | | (_) \ V  V /    / / / / / /
21-Feb-2019 22:13:00 |____/ \__,_|\__\__,_| |_|   |_|\___/ \_/\_/    /_/_/_/_/_/
21-Feb-2019 22:13:00
21-Feb-2019 22:13:00
21-Feb-2019 22:13:00
21-Feb-2019 22:13:00 2019-02-21 22:13:00.579  INFO 24380 --- [           main] c.c.c.ConfigServicePropertySourceLocator : Fetching config from server at: http://localhost:8888
21-Feb-2019 22:13:00 2019-02-21 22:13:00.581  WARN 24380 --- [           main] c.c.c.ConfigServicePropertySourceLocator : Could not locate PropertySource: I/O error on GET request for "http://localhost:8888/application/default": Connection refused (Connection refused); nested exception is java.net.ConnectException: Connection refused (Connection refused)
21-Feb-2019 22:13:00 2019-02-21 22:13:00.583  INFO 24380 --- [           main] o.s.c.d.s.r.SchemaGenerationTests        : No active profile set, falling back to default profiles: default
21-Feb-2019 22:13:00 2019-02-21 22:13:00.591  INFO 24380 --- [           main] .s.d.r.c.RepositoryConfigurationDelegate : Multiple Spring Data modules found, entering strict repository configuration mode!
21-Feb-2019 22:13:00 2019-02-21 22:13:00.658  INFO 24380 --- [           main] o.s.j.d.e.EmbeddedDatabaseFactory        : Starting embedded database: url='jdbc:h2:mem:testdb;DB_CLOSE_DELAY=-1;DB_CLOSE_ON_EXIT=false', username='sa'
21-Feb-2019 22:13:00 2019-02-21 22:13:00.681  INFO 24380 --- [           main] j.LocalContainerEntityManagerFactoryBean : Building JPA container EntityManagerFactory for persistence unit 'default'
21-Feb-2019 22:13:00 2019-02-21 22:13:00.681  INFO 24380 --- [           main] o.hibernate.jpa.internal.util.LogHelper  : HHH000204: Processing PersistenceUnitInfo [
21-Feb-2019 22:13:00         name: default
21-Feb-2019 22:13:00         ...]
21-Feb-2019 22:13:00 2019-02-21 22:13:00.685  INFO 24380 --- [           main] org.hibernate.dialect.Dialect            : HHH000400: Using dialect: org.hibernate.dialect.H2Dialect
21-Feb-2019 22:13:00 2019-02-21 22:13:00.699  INFO 24380 --- [           main] o.h.t.schema.internal.SchemaCreatorImpl  : HHH000476: Executing import script 'org.hiber[email protected]6e670b85'
21-Feb-2019 22:13:00 2019-02-21 22:13:00.699  INFO 24380 --- [           main] j.LocalContainerEntityManagerFactoryBean : Initialized JPA EntityManagerFactory for persistence unit 'default'
21-Feb-2019 22:13:00 2019-02-21 22:13:00.729  INFO 24380 --- [           main] o.s.c.d.s.r.SchemaGenerationTests        : Started SchemaGenerationTests in 0.33 seconds (JVM running for 158.337)
21-Feb-2019 22:13:00 2019-02-21 22:13:00.733  INFO 24380 --- [           main] o.s.c.d.s.r.SchemaGenerationTests        :
21-Feb-2019 22:13:00
21-Feb-2019 22:13:00 Generating DDL scripts for the following dialects:
21-Feb-2019 22:13:00
21-Feb-2019 22:13:00 H2Dialect
21-Feb-2019 22:13:00 HSQLDialect
21-Feb-2019 22:13:00 MySQL5Dialect
21-Feb-2019 22:13:00 Oracle10gDialect
21-Feb-2019 22:13:00 PostgreSQL94Dialect
21-Feb-2019 22:13:00 DB2Dialect
21-Feb-2019 22:13:00 SQLServer2012Dialect
21-Feb-2019 22:13:00
21-Feb-2019 22:13:00 2019-02-21 22:13:00.733  INFO 24380 --- [           main] o.s.c.d.s.r.SchemaGenerationTests        : Generating DDL script for H2
21-Feb-2019 22:13:00 2019-02-21 22:13:00.735  INFO 24380 --- [           main] o.s.c.d.s.r.SchemaGenerationTests        : org.springframework.cloud.dataflow.registry.domain.AppRegistration
21-Feb-2019 22:13:00 2019-02-21 22:13:00.735  INFO 24380 --- [           main] o.s.c.d.s.r.SchemaGenerationTests        : org.springframework.cloud.dataflow.registry.domain.AbstractEntity
21-Feb-2019 22:13:00 2019-02-21 22:13:00.735  INFO 24380 --- [           main] o.s.c.d.s.r.SchemaGenerationTests        : org.springframework.cloud.dataflow.registry.domain.UriPersistenceConverter
21-Feb-2019 22:13:00 2019-02-21 22:13:00.735  INFO 24380 --- [           main] o.s.c.d.s.r.SchemaGenerationTests        : org.springframework.cloud.dataflow.server.audit.domain.AuditActionTypeConverter
21-Feb-2019 22:13:00 2019-02-21 22:13:00.735  INFO 24380 --- [           main] o.s.c.d.s.r.SchemaGenerationTests        : org.springframework.cloud.dataflow.server.audit.domain.AuditOperationTypeConverter
21-Feb-2019 22:13:00 2019-02-21 22:13:00.735  INFO 24380 --- [           main] o.s.c.d.s.r.SchemaGenerationTests        : org.springframework.cloud.dataflow.server.audit.domain.AuditRecord
21-Feb-2019 22:13:00 2019-02-21 22:13:00.740  WARN 24380 --- [           main] o.h.e.j.c.i.ConnectionProviderInitiator  : HHH000181: No appropriate connection provider encountered, assuming application will be supplying connections
21-Feb-2019 22:13:00 2019-02-21 22:13:00.740  WARN 24380 --- [           main] o.h.e.j.e.i.JdbcEnvironmentInitiator     : HHH000342: Could not obtain connection to query metadata : The application must supply JDBC connections
21-Feb-2019 22:13:00 2019-02-21 22:13:00.740  INFO 24380 --- [           main] org.hibernate.dialect.Dialect            : HHH000400: Using dialect: org.hibernate.dialect.H2Dialect
21-Feb-2019 22:13:00 2019-02-21 22:13:00.740  INFO 24380 --- [           main] o.h.e.j.e.i.LobCreatorBuilderImpl        : HHH000422: Disabling contextual LOB creation as connection was null
21-Feb-2019 22:13:00 2019-02-21 22:13:00.744  INFO 24380 --- [           main] org.hibernate.tool.hbm2ddl.SchemaExport  : HHH000227: Running hbm2ddl schema export
21-Feb-2019 22:13:00 2019-02-21 22:13:00.751  INFO 24380 --- [           main] o.h.t.schema.internal.SchemaCreatorImpl  : HHH000476: Executing import script 'org.hiber[email protected]6e670b85'
21-Feb-2019 22:13:00 2019-02-21 22:13:00.752  INFO 24380 --- [           main] o.s.c.d.s.r.SchemaGenerationTests        : Generating DDL script for HSQL
21-Feb-2019 22:13:00 2019-02-21 22:13:00.753  INFO 24380 --- [           main] o.s.c.d.s.r.SchemaGenerationTests        : org.springframework.cloud.dataflow.registry.domain.AppRegistration
21-Feb-2019 22:13:00 2019-02-21 22:13:00.753  INFO 24380 --- [           main] o.s.c.d.s.r.SchemaGenerationTests        : org.springframework.cloud.dataflow.registry.domain.AbstractEntity
21-Feb-2019 22:13:00 2019-02-21 22:13:00.753  INFO 24380 --- [           main] o.s.c.d.s.r.SchemaGenerationTests        : org.springframework.cloud.dataflow.registry.domain.UriPersistenceConverter
21-Feb-2019 22:13:00 2019-02-21 22:13:00.753  INFO 24380 --- [           main] o.s.c.d.s.r.SchemaGenerationTests        : org.springframework.cloud.dataflow.server.audit.domain.AuditActionTypeConverter
21-Feb-2019 22:13:00 2019-02-21 22:13:00.753  INFO 24380 --- [           main] o.s.c.d.s.r.SchemaGenerationTests        : org.springframework.cloud.dataflow.server.audit.domain.AuditOperationTypeConverter
21-Feb-2019 22:13:00 2019-02-21 22:13:00.753  INFO 24380 --- [           main] o.s.c.d.s.r.SchemaGenerationTests        : org.springframework.cloud.dataflow.server.audit.domain.AuditRecord
21-Feb-2019 22:13:00 2019-02-21 22:13:00.755  WARN 24380 --- [           main] o.h.e.j.c.i.ConnectionProviderInitiator  : HHH000181: No appropriate connection provider encountered, assuming application will be supplying connections
21-Feb-2019 22:13:00 2019-02-21 22:13:00.755  WARN 24380 --- [           main] o.h.e.j.e.i.JdbcEnvironmentInitiator     : HHH000342: Could not obtain connection to query metadata : The application must supply JDBC connections
21-Feb-2019 22:13:00 2019-02-21 22:13:00.757  INFO 24380 --- [           main] org.hibernate.dialect.Dialect            : HHH000400: Using dialect: org.hibernate.dialect.HSQLDialect
21-Feb-2019 22:13:00 2019-02-21 22:13:00.776  INFO 24380 --- [           main] o.h.e.j.e.i.LobCreatorBuilderImpl        : HHH000422: Disabling contextual LOB creation as connection was null
21-Feb-2019 22:13:00 2019-02-21 22:13:00.780  INFO 24380 --- [           main] org.hibernate.tool.hbm2ddl.SchemaExport  : HHH000227: Running hbm2ddl schema export
21-Feb-2019 22:13:00 2019-02-21 22:13:00.782  INFO 24380 --- [           main] o.h.t.schema.internal.SchemaCreatorImpl  : HHH000476: Executing import script 'org.hiber[email protected]6e670b85'
21-Feb-2019 22:13:00 2019-02-21 22:13:00.782  INFO 24380 --- [           main] o.s.c.d.s.r.SchemaGenerationTests        : Generating DDL script for MySQL5
21-Feb-2019 22:13:00 2019-02-21 22:13:00.783  INFO 24380 --- [           main] o.s.c.d.s.r.SchemaGenerationTests        : org.springframework.cloud.dataflow.registry.domain.AppRegistration
21-Feb-2019 22:13:00 2019-02-21 22:13:00.783  INFO 24380 --- [           main] o.s.c.d.s.r.SchemaGenerationTests        : org.springframework.cloud.dataflow.registry.domain.AbstractEntity
21-Feb-2019 22:13:00 2019-02-21 22:13:00.783  INFO 24380 --- [           main] o.s.c.d.s.r.SchemaGenerationTests        : org.springframework.cloud.dataflow.registry.domain.UriPersistenceConverter
21-Feb-2019 22:13:00 2019-02-21 22:13:00.783  INFO 24380 --- [           main] o.s.c.d.s.r.SchemaGenerationTests        : org.springframework.cloud.dataflow.server.audit.domain.AuditActionTypeConverter
21-Feb-2019 22:13:00 2019-02-21 22:13:00.783  INFO 24380 --- [           main] o.s.c.d.s.r.SchemaGenerationTests        : org.springframework.cloud.dataflow.server.audit.domain.AuditOperationTypeConverter
21-Feb-2019 22:13:00 2019-02-21 22:13:00.783  INFO 24380 --- [           main] o.s.c.d.s.r.SchemaGenerationTests        : org.springframework.cloud.dataflow.server.audit.domain.AuditRecord
21-Feb-2019 22:13:00 2019-02-21 22:13:00.785  WARN 24380 --- [           main] o.h.e.j.c.i.ConnectionProviderInitiator  : HHH000181: No appropriate connection provider encountered, assuming application will be supplying connections
21-Feb-2019 22:13:00 2019-02-21 22:13:00.785  WARN 24380 --- [           main] o.h.e.j.e.i.JdbcEnvironmentInitiator     : HHH000342: Could not obtain connection to query metadata : The application must supply JDBC connections
21-Feb-2019 22:13:00 2019-02-21 22:13:00.787  INFO 24380 --- [           main] org.hibernate.dialect.Dialect            : HHH000400: Using dialect: org.hibernate.dialect.MySQL5Dialect
21-Feb-2019 22:13:00 2019-02-21 22:13:00.788  INFO 24380 --- [           main] o.h.e.j.e.i.LobCreatorBuilderImpl        : HHH000422: Disabling contextual LOB creation as connection was null
21-Feb-2019 22:13:00 2019-02-21 22:13:00.801  INFO 24380 --- [           main] org.hibernate.tool.hbm2ddl.SchemaExport  : HHH000227: Running hbm2ddl schema export
21-Feb-2019 22:13:00 2019-02-21 22:13:00.803  INFO 24380 --- [           main] o.h.t.schema.internal.SchemaCreatorImpl  : HHH000476: Executing import script 'org.hiber[email protected]6e670b85'
21-Feb-2019 22:13:00 2019-02-21 22:13:00.803  INFO 24380 --- [           main] o.s.c.d.s.r.SchemaGenerationTests        : Generating DDL script for Oracle10g
21-Feb-2019 22:13:00 2019-02-21 22:13:00.805  INFO 24380 --- [           main] o.s.c.d.s.r.SchemaGenerationTests        : org.springframework.cloud.dataflow.registry.domain.AppRegistration
21-Feb-2019 22:13:00 2019-02-21 22:13:00.805  INFO 24380 --- [           main] o.s.c.d.s.r.SchemaGenerationTests        : org.springframework.cloud.dataflow.registry.domain.AbstractEntity
21-Feb-2019 22:13:00 2019-02-21 22:13:00.805  INFO 24380 --- [           main] o.s.c.d.s.r.SchemaGenerationTests        : org.springframework.cloud.dataflow.registry.domain.UriPersistenceConverter
21-Feb-2019 22:13:00 2019-02-21 22:13:00.805  INFO 24380 --- [           main] o.s.c.d.s.r.SchemaGenerationTests        : org.springframework.cloud.dataflow.server.audit.domain.AuditActionTypeConverter
21-Feb-2019 22:13:00 2019-02-21 22:13:00.805  INFO 24380 --- [           main] o.s.c.d.s.r.SchemaGenerationTests        : org.springframework.cloud.dataflow.server.audit.domain.AuditOperationTypeConverter
21-Feb-2019 22:13:00 2019-02-21 22:13:00.805  INFO 24380 --- [           main] o.s.c.d.s.r.SchemaGenerationTests        : org.springframework.cloud.dataflow.server.audit.domain.AuditRecord
21-Feb-2019 22:13:00 2019-02-21 22:13:00.806  WARN 24380 --- [           main] o.h.e.j.c.i.ConnectionProviderInitiator  : HHH000181: No appropriate connection provider encountered, assuming application will be supplying connections
21-Feb-2019 22:13:00 2019-02-21 22:13:00.806  WARN 24380 --- [           main] o.h.e.j.e.i.JdbcEnvironmentInitiator     : HHH000342: Could not obtain connection to query metadata : The application must supply JDBC connections
21-Feb-2019 22:13:00 2019-02-21 22:13:00.810  INFO 24380 --- [           main] org.hibernate.dialect.Dialect            : HHH000400: Using dialect: org.hibernate.dialect.Oracle10gDialect
21-Feb-2019 22:13:00 2019-02-21 22:13:00.811  INFO 24380 --- [           main] o.h.e.j.e.i.LobCreatorBuilderImpl        : HHH000422: Disabling contextual LOB creation as connection was null
21-Feb-2019 22:13:00 2019-02-21 22:13:00.815  INFO 24380 --- [           main] org.hibernate.tool.hbm2ddl.SchemaExport  : HHH000227: Running hbm2ddl schema export
21-Feb-2019 22:13:00 2019-02-21 22:13:00.823  INFO 24380 --- [           main] o.h.t.schema.internal.SchemaCreatorImpl  : HHH000476: Executing import script 'org.hiber[email protected]6e670b85'
21-Feb-2019 22:13:00 2019-02-21 22:13:00.823  INFO 24380 --- [           main] o.s.c.d.s.r.SchemaGenerationTests        : Generating DDL script for PostgreSQL94
21-Feb-2019 22:13:00 2019-02-21 22:13:00.824  INFO 24380 --- [           main] o.s.c.d.s.r.SchemaGenerationTests        : org.springframework.cloud.dataflow.registry.domain.AppRegistration
21-Feb-2019 22:13:00 2019-02-21 22:13:00.824  INFO 24380 --- [           main] o.s.c.d.s.r.SchemaGenerationTests        : org.springframework.cloud.dataflow.registry.domain.AbstractEntity
21-Feb-2019 22:13:00 2019-02-21 22:13:00.824  INFO 24380 --- [           main] o.s.c.d.s.r.SchemaGenerationTests        : org.springframework.cloud.dataflow.registry.domain.UriPersistenceConverter
21-Feb-2019 22:13:00 2019-02-21 22:13:00.824  INFO 24380 --- [           main] o.s.c.d.s.r.SchemaGenerationTests        : org.springframework.cloud.dataflow.server.audit.domain.AuditActionTypeConverter
21-Feb-2019 22:13:00 2019-02-21 22:13:00.824  INFO 24380 --- [           main] o.s.c.d.s.r.SchemaGenerationTests        : org.springframework.cloud.dataflow.server.audit.domain.AuditOperationTypeConverter
21-Feb-2019 22:13:00 2019-02-21 22:13:00.824  INFO 24380 --- [           main] o.s.c.d.s.r.SchemaGenerationTests        : org.springframework.cloud.dataflow.server.audit.domain.AuditRecord
21-Feb-2019 22:13:00 2019-02-21 22:13:00.826  WARN 24380 --- [           main] o.h.e.j.c.i.ConnectionProviderInitiator  : HHH000181: No appropriate connection provider encountered, assuming application will be supplying connections
21-Feb-2019 22:13:00 2019-02-21 22:13:00.834  WARN 24380 --- [           main] o.h.e.j.e.i.JdbcEnvironmentInitiator     : HHH000342: Could not obtain connection to query metadata : The application must supply JDBC connections
21-Feb-2019 22:13:00 2019-02-21 22:13:00.836  INFO 24380 --- [           main] org.hibernate.dialect.Dialect            : HHH000400: Using dialect: org.hibernate.dialect.PostgreSQL94Dialect
21-Feb-2019 22:13:00 2019-02-21 22:13:00.842  INFO 24380 --- [           main] o.h.e.j.e.i.LobCreatorBuilderImpl        : HHH000422: Disabling contextual LOB creation as connection was null
21-Feb-2019 22:13:00 2019-02-21 22:13:00.847  INFO 24380 --- [           main] org.hibernate.type.BasicTypeRegistry     : HHH000270: Type registration [java.util.UUID] overrides previous : [email protected]
21-Feb-2019 22:13:00 2019-02-21 22:13:00.855  INFO 24380 --- [           main] org.hibernate.tool.hbm2ddl.SchemaExport  : HHH000227: Running hbm2ddl schema export
21-Feb-2019 22:13:00 2019-02-21 22:13:00.859  INFO 24380 --- [           main] o.h.t.schema.internal.SchemaCreatorImpl  : HHH000476: Executing import script 'org.hiber[email protected]6e670b85'
21-Feb-2019 22:13:00 2019-02-21 22:13:00.859  INFO 24380 --- [           main] o.s.c.d.s.r.SchemaGenerationTests        : Generating DDL script for DB2
21-Feb-2019 22:13:00 2019-02-21 22:13:00.860  INFO 24380 --- [           main] o.s.c.d.s.r.SchemaGenerationTests        : org.springframework.cloud.dataflow.registry.domain.AppRegistration
21-Feb-2019 22:13:00 2019-02-21 22:13:00.860  INFO 24380 --- [           main] o.s.c.d.s.r.SchemaGenerationTests        : org.springframework.cloud.dataflow.registry.domain.AbstractEntity
21-Feb-2019 22:13:00 2019-02-21 22:13:00.860  INFO 24380 --- [           main] o.s.c.d.s.r.SchemaGenerationTests        : org.springframework.cloud.dataflow.registry.domain.UriPersistenceConverter
21-Feb-2019 22:13:00 2019-02-21 22:13:00.860  INFO 24380 --- [           main] o.s.c.d.s.r.SchemaGenerationTests        : org.springframework.cloud.dataflow.server.audit.domain.AuditActionTypeConverter
21-Feb-2019 22:13:00 2019-02-21 22:13:00.860  INFO 24380 --- [           main] o.s.c.d.s.r.SchemaGenerationTests        : org.springframework.cloud.dataflow.server.audit.domain.AuditOperationTypeConverter
21-Feb-2019 22:13:00 2019-02-21 22:13:00.860  INFO 24380 --- [           main] o.s.c.d.s.r.SchemaGenerationTests        : org.springframework.cloud.dataflow.server.audit.domain.AuditRecord
21-Feb-2019 22:13:00 2019-02-21 22:13:00.862  WARN 24380 --- [           main] o.h.e.j.c.i.ConnectionProviderInitiator  : HHH000181: No appropriate connection provider encountered, assuming application will be supplying connections
21-Feb-2019 22:13:00 2019-02-21 22:13:00.862  WARN 24380 --- [           main] o.h.e.j.e.i.JdbcEnvironmentInitiator     : HHH000342: Could not obtain connection to query metadata : The application must supply JDBC connections
21-Feb-2019 22:13:00 2019-02-21 22:13:00.863  INFO 24380 --- [           main] org.hibernate.dialect.Dialect            : HHH000400: Using dialect: org.hibernate.dialect.DB2Dialect
21-Feb-2019 22:13:00 2019-02-21 22:13:00.865  INFO 24380 --- [           main] o.h.e.j.e.i.LobCreatorBuilderImpl        : HHH000422: Disabling contextual LOB creation as connection was null
21-Feb-2019 22:13:00 2019-02-21 22:13:00.870  INFO 24380 --- [           main] org.hibernate.tool.hbm2ddl.SchemaExport  : HHH000227: Running hbm2ddl schema export
21-Feb-2019 22:13:00 2019-02-21 22:13:00.871  INFO 24380 --- [           main] o.h.t.schema.internal.SchemaCreatorImpl  : HHH000476: Executing import script 'org.hiber[email protected]6e670b85'
21-Feb-2019 22:13:00 2019-02-21 22:13:00.871  INFO 24380 --- [           main] o.s.c.d.s.r.SchemaGenerationTests        : Generating DDL script for SQLServer2012
21-Feb-2019 22:13:00 2019-02-21 22:13:00.873  INFO 24380 --- [           main] o.s.c.d.s.r.SchemaGenerationTests        : org.springframework.cloud.dataflow.registry.domain.AppRegistration
21-Feb-2019 22:13:00 2019-02-21 22:13:00.873  INFO 24380 --- [           main] o.s.c.d.s.r.SchemaGenerationTests        : org.springframework.cloud.dataflow.registry.domain.AbstractEntity
21-Feb-2019 22:13:00 2019-02-21 22:13:00.873  INFO 24380 --- [           main] o.s.c.d.s.r.SchemaGenerationTests        : org.springframework.cloud.dataflow.registry.domain.UriPersistenceConverter
21-Feb-2019 22:13:00 2019-02-21 22:13:00.873  INFO 24380 --- [           main] o.s.c.d.s.r.SchemaGenerationTests        : org.springframework.cloud.dataflow.server.audit.domain.AuditActionTypeConverter
21-Feb-2019 22:13:00 2019-02-21 22:13:00.873  INFO 24380 --- [           main] o.s.c.d.s.r.SchemaGenerationTests        : org.springframework.cloud.dataflow.server.audit.domain.AuditOperationTypeConverter
21-Feb-2019 22:13:00 2019-02-21 22:13:00.873  INFO 24380 --- [           main] o.s.c.d.s.r.SchemaGenerationTests        : org.springframework.cloud.dataflow.server.audit.domain.AuditRecord
21-Feb-2019 22:13:00 2019-02-21 22:13:00.874  WARN 24380 --- [           main] o.h.e.j.c.i.ConnectionProviderInitiator  : HHH000181: No appropriate connection provider encountered, assuming application will be supplying connections
21-Feb-2019 22:13:00 2019-02-21 22:13:00.875  WARN 24380 --- [           main] o.h.e.j.e.i.JdbcEnvironmentInitiator     : HHH000342: Could not obtain connection to query metadata : The application must supply JDBC connections
21-Feb-2019 22:13:00 2019-02-21 22:13:00.876  INFO 24380 --- [           main] org.hibernate.dialect.Dialect            : HHH000400: Using dialect: org.hibernate.dialect.SQLServer2012Dialect
21-Feb-2019 22:13:00 2019-02-21 22:13:00.879  INFO 24380 --- [           main] o.h.e.j.e.i.LobCreatorBuilderImpl        : HHH000422: Disabling contextual LOB creation as connection was null
21-Feb-2019 22:13:00 2019-02-21 22:13:00.883  INFO 24380 --- [           main] org.hibernate.tool.hbm2ddl.SchemaExport  : HHH000227: Running hbm2ddl schema export
21-Feb-2019 22:13:00 2019-02-21 22:13:00.885  INFO 24380 --- [           main] o.h.t.schema.internal.SchemaCreatorImpl  : HHH000476: Executing import script 'org.hiber[email protected]6e670b85'
21-Feb-2019 22:13:00 2019-02-21 22:13:00.885  INFO 24380 --- [           main] o.s.c.d.s.r.SchemaGenerationTests        :
21-Feb-2019 22:13:00
21-Feb-2019 22:13:00 You can find the DDL scripts in directory: /tmp/scdf-sql-3181744073779799661
21-Feb-2019 22:13:00
21-Feb-2019 22:13:00 [INFO] Tests run: 1, Failures: 0, Errors: 0, Skipped: 0, Time elapsed: 0.492 s - in org.springframework.cloud.dataflow.server.repository.SchemaGenerationTests
21-Feb-2019 22:13:00 [INFO] Running org.springframework.cloud.dataflow.server.repository.InMemoryDeploymentIdRepositoryTests
21-Feb-2019 22:13:00 [INFO] Tests run: 2, Failures: 0, Errors: 0, Skipped: 0, Time elapsed: 0 s - in org.springframework.cloud.dataflow.server.repository.InMemoryDeploymentIdRepositoryTests
21-Feb-2019 22:13:00 [INFO] Running org.springframework.cloud.dataflow.server.repository.InMemoryTaskDefinitionRepositoryTests
21-Feb-2019 22:13:00 [INFO] Tests run: 16, Failures: 0, Errors: 0, Skipped: 0, Time elapsed: 0 s - in org.springframework.cloud.dataflow.server.repository.InMemoryTaskDefinitionRepositoryTests
21-Feb-2019 22:13:00 [INFO] Running org.springframework.cloud.dataflow.server.audit.service.DefaultAuditRecordServiceTests
21-Feb-2019 22:13:00 2019-02-21 22:13:00.929 ERROR 24380 --- [           main] o.s.c.d.s.a.s.DefaultAuditRecordService  : Error serializing audit record data.  Data = {foo=bar}
21-Feb-2019 22:13:00 [INFO] Tests run: 8, Failures: 0, Errors: 0, Skipped: 0, Time elapsed: 0.037 s - in org.springframework.cloud.dataflow.server.audit.service.DefaultAuditRecordServiceTests
21-Feb-2019 22:13:00 [INFO] Running org.springframework.cloud.dataflow.server.registry.RdbmsUriRegistryTests
21-Feb-2019 22:13:00 2019-02-21 22:13:00.942  INFO 24380 --- [           main] o.s.t.c.support.AbstractContextLoader    : Could not detect default resource locations for test class [org.springframework.cloud.dataflow.server.registry.RdbmsUriRegistryTests]: no resource found for suffixes {-context.xml, Context.groovy}.
21-Feb-2019 22:13:01   ____                              ____ _                __
21-Feb-2019 22:13:01 / ___| _ __  _ __(_)_ __   __ _   / ___| | ___  _   _  __| |
21-Feb-2019 22:13:01 \___ \| '_ \| '__| | '_ \ / _` | | |   | |/ _ \| | | |/ _` |
21-Feb-2019 22:13:01   ___) | |_) | |  | | | | | (_| | | |___| | (_) | |_| | (_| |
21-Feb-2019 22:13:01 |____/| .__/|_|  |_|_| |_|\__, |  \____|_|\___/ \__,_|\__,_|
21-Feb-2019 22:13:01   ____ |_|    _          __|___/                 __________
21-Feb-2019 22:13:01 |  _ \  __ _| |_ __ _  |  ___| | _____      __  \ \ \ \ \ \
21-Feb-2019 22:13:01 | | | |/ _` | __/ _` | | |_  | |/ _ \ \ /\ / /   \ \ \ \ \ \
21-Feb-2019 22:13:01 | |_| | (_| | || (_| | |  _| | | (_) \ V  V /    / / / / / /
21-Feb-2019 22:13:01 |____/ \__,_|\__\__,_| |_|   |_|\___/ \_/\_/    /_/_/_/_/_/
21-Feb-2019 22:13:01
21-Feb-2019 22:13:01
21-Feb-2019 22:13:01
21-Feb-2019 22:13:01 2019-02-21 22:13:01.145  INFO 24380 --- [           main] c.c.c.ConfigServicePropertySourceLocator : Fetching config from server at: http://localhost:8888
21-Feb-2019 22:13:01 2019-02-21 22:13:01.146  WARN 24380 --- [           main] c.c.c.ConfigServicePropertySourceLocator : Could not locate PropertySource: I/O error on GET request for "http://localhost:8888/application/default": Connection refused (Connection refused); nested exception is java.net.ConnectException: Connection refused (Connection refused)
21-Feb-2019 22:13:01 2019-02-21 22:13:01.147  INFO 24380 --- [           main] o.s.c.d.s.r.RdbmsUriRegistryTests        : No active profile set, falling back to default profiles: default
21-Feb-2019 22:13:01 2019-02-21 22:13:01.219  INFO 24380 --- [           main] o.s.j.d.e.EmbeddedDatabaseFactory        : Starting embedded database: url='jdbc:h2:mem:testdb;DB_CLOSE_DELAY=-1;DB_CLOSE_ON_EXIT=false', username='sa'
21-Feb-2019 22:13:01 2019-02-21 22:13:01.241  INFO 24380 --- [           main] o.s.c.d.s.r.s.DataflowRdbmsInitializer   : Adding dataflow schema classpath:schemas/h2/common.sql for h2 database
21-Feb-2019 22:13:01 2019-02-21 22:13:01.241  INFO 24380 --- [           main] o.s.c.d.s.r.s.DataflowRdbmsInitializer   : Adding dataflow schema classpath:schemas/h2/streams.sql for h2 database
21-Feb-2019 22:13:01 2019-02-21 22:13:01.241  INFO 24380 --- [           main] o.s.c.d.s.r.s.DataflowRdbmsInitializer   : Adding dataflow schema classpath:schemas/h2/tasks.sql for h2 database
21-Feb-2019 22:13:01 2019-02-21 22:13:01.241  INFO 24380 --- [           main] o.s.c.d.s.r.s.DataflowRdbmsInitializer   : Adding dataflow schema classpath:schemas/h2/deployment.sql for h2 database
21-Feb-2019 22:13:01 2019-02-21 22:13:01.241  INFO 24380 --- [           main] o.s.c.d.s.r.s.DataflowRdbmsInitializer   : Adding dataflow schema classpath:schemas/h2/jpa.sql for h2 database
21-Feb-2019 22:13:01 2019-02-21 22:13:01.252  INFO 24380 --- [           main] o.s.jdbc.datasource.init.ScriptUtils     : Executing SQL script from class path resource [schemas/h2/common.sql]
21-Feb-2019 22:13:01 2019-02-21 22:13:01.252  INFO 24380 --- [           main] o.s.jdbc.datasource.init.ScriptUtils     : Executed SQL script from class path resource [schemas/h2/common.sql] in 0 ms.
21-Feb-2019 22:13:01 2019-02-21 22:13:01.252  INFO 24380 --- [           main] o.s.jdbc.datasource.init.ScriptUtils     : Executing SQL script from class path resource [schemas/h2/streams.sql]
21-Feb-2019 22:13:01 2019-02-21 22:13:01.253  INFO 24380 --- [           main] o.s.jdbc.datasource.init.ScriptUtils     : Executed SQL script from class path resource [schemas/h2/streams.sql] in 1 ms.
21-Feb-2019 22:13:01 2019-02-21 22:13:01.253  INFO 24380 --- [           main] o.s.jdbc.datasource.init.ScriptUtils     : Executing SQL script from class path resource [schemas/h2/tasks.sql]
21-Feb-2019 22:13:01 2019-02-21 22:13:01.253  INFO 24380 --- [           main] o.s.jdbc.datasource.init.ScriptUtils     : Executed SQL script from class path resource [schemas/h2/tasks.sql] in 0 ms.
21-Feb-2019 22:13:01 2019-02-21 22:13:01.253  INFO 24380 --- [           main] o.s.jdbc.datasource.init.ScriptUtils     : Executing SQL script from class path resource [schemas/h2/deployment.sql]
21-Feb-2019 22:13:01 2019-02-21 22:13:01.253  INFO 24380 --- [           main] o.s.jdbc.datasource.init.ScriptUtils     : Executed SQL script from class path resource [schemas/h2/deployment.sql] in 0 ms.
21-Feb-2019 22:13:01 2019-02-21 22:13:01.253  INFO 24380 --- [           main] o.s.jdbc.datasource.init.ScriptUtils     : Executing SQL script from class path resource [schemas/h2/jpa.sql]
21-Feb-2019 22:13:01 2019-02-21 22:13:01.254  INFO 24380 --- [           main] o.s.jdbc.datasource.init.ScriptUtils     : Executed SQL script from class path resource [schemas/h2/jpa.sql] in 1 ms.
21-Feb-2019 22:13:01 2019-02-21 22:13:01.258  INFO 24380 --- [           main] o.s.c.d.s.r.RdbmsUriRegistryTests        : Started RdbmsUriRegistryTests in 0.308 seconds (JVM running for 158.866)
21-Feb-2019 22:13:01 [INFO] Tests run: 5, Failures: 0, Errors: 0, Skipped: 0, Time elapsed: 0.296 s - in org.springframework.cloud.dataflow.server.registry.RdbmsUriRegistryTests
21-Feb-2019 22:13:01 2019-02-21 22:13:01.340  INFO 24380 --- [     Thread-826] o.s.j.d.e.EmbeddedDatabaseFactory        : Shutting down embedded database: url='jdbc:h2:mem:testdb;DB_CLOSE_DELAY=-1;DB_CLOSE_ON_EXIT=false'
21-Feb-2019 22:13:01 2019-02-21 22:13:01.340  INFO 24380 --- [     Thread-829] o.s.j.d.e.EmbeddedDatabaseFactory        : Shutting down embedded database: url='jdbc:h2:mem:testdb;DB_CLOSE_DELAY=-1;DB_CLOSE_ON_EXIT=false'
21-Feb-2019 22:13:01 2019-02-21 22:13:01.340  INFO 24380 --- [     Thread-832] o.s.j.d.e.EmbeddedDatabaseFactory        : Shutting down embedded database: url='jdbc:h2:mem:testdb;DB_CLOSE_DELAY=-1;DB_CLOSE_ON_EXIT=false'
21-Feb-2019 22:13:01 2019-02-21 22:13:01.340  INFO 24380 --- [     Thread-838] o.s.j.d.e.EmbeddedDatabaseFactory        : Shutting down embedded database: url='jdbc:h2:mem:testdb;DB_CLOSE_DELAY=-1;DB_CLOSE_ON_EXIT=false'
21-Feb-2019 22:13:01 2019-02-21 22:13:01.340  INFO 24380 --- [     Thread-835] j.LocalContainerEntityManagerFactoryBean : Closing JPA EntityManagerFactory for persistence unit 'default'
21-Feb-2019 22:13:01 2019-02-21 22:13:01.341  INFO 24380 --- [     Thread-835] .SchemaDropperImpl$DelayedDropActionImpl : HHH000477: Starting delayed drop of schema as part of SessionFactory shut-down'
21-Feb-2019 22:13:01 2019-02-21 22:13:01.342  WARN 24380 --- [     Thread-835] o.h.engine.jdbc.spi.SqlExceptionHelper   : SQL Error: 90098, SQLState: 90098
21-Feb-2019 22:13:01 2019-02-21 22:13:01.342 ERROR 24380 --- [     Thread-835] o.h.engine.jdbc.spi.SqlExceptionHelper   : The database has been closed [90098-197]
21-Feb-2019 22:13:01 2019-02-21 22:13:01.478  WARN 24380 --- [     Thread-835] o.s.b.f.support.DisposableBeanAdapter    : Invocation of destroy method failed on bean with name 'entityManagerFactory': org.hibernate.exception.GenericJDBCException: Unable to open JDBC Connection for DDL execution
21-Feb-2019 22:13:01 2019-02-21 22:13:01.478  INFO 24380 --- [     Thread-835] o.s.j.d.e.EmbeddedDatabaseFactory        : Shutting down embedded database: url='jdbc:h2:mem:testdb;DB_CLOSE_DELAY=-1;DB_CLOSE_ON_EXIT=false'
21-Feb-2019 22:13:01 [INFO]
21-Feb-2019 22:13:01 [INFO] Results:
21-Feb-2019 22:13:01 [INFO]
21-Feb-2019 22:13:01 [ERROR] Failures:
21-Feb-2019 22:13:01 [ERROR]   DefaultAppValidationServiceTests.validateDockerTest:97
21-Feb-2019 22:13:01 [INFO]
21-Feb-2019 22:13:01 [ERROR] Tests run: 426, Failures: 1, Errors: 0, Skipped: 3
21-Feb-2019 22:13:01 [INFO]
21-Feb-2019 22:13:01 [INFO] ------------------------------------------------------------------------
21-Feb-2019 22:13:01 [INFO] Reactor Summary:
21-Feb-2019 22:13:01 [INFO]
21-Feb-2019 22:13:01 [INFO] spring-cloud-dataflow-parent ....................... SUCCESS [  2.554 s]
21-Feb-2019 22:13:01 [INFO] spring-cloud-dataflow-configuration-metadata ....... SUCCESS [  4.952 s]
21-Feb-2019 22:13:01 [INFO] spring-cloud-dataflow-core ......................... SUCCESS [  5.996 s]
21-Feb-2019 22:13:01 [INFO] spring-cloud-dataflow-registry ..................... SUCCESS [  4.426 s]
21-Feb-2019 22:13:01 [INFO] spring-cloud-dataflow-rest-resource ................ SUCCESS [  5.796 s]
21-Feb-2019 22:13:01 [INFO] spring-cloud-dataflow-completion ................... SUCCESS [  7.257 s]
21-Feb-2019 22:13:01 [INFO] spring-cloud-dataflow-server-core .................. FAILURE [02:44 min]
21-Feb-2019 22:13:01 [INFO] spring-cloud-dataflow-server-local-autoconfig ...... SKIPPED
21-Feb-2019 22:13:01 [INFO] spring-cloud-starter-dataflow-server-local ......... SKIPPED
21-Feb-2019 22:13:01 [INFO] Spring Cloud Data Flow Local Server ................ SKIPPED
21-Feb-2019 22:13:01 [INFO] spring-cloud-dataflow-rest-client .................. SKIPPED
21-Feb-2019 22:13:01 [INFO] spring-cloud-dataflow-shell-core ................... SKIPPED
21-Feb-2019 22:13:01 [INFO] spring-cloud-dataflow-shell ........................ SKIPPED
21-Feb-2019 22:13:01 [INFO] Spring Cloud Data Flow Docs for Classic mode ....... SKIPPED
21-Feb-2019 22:13:01 [INFO] Spring Cloud Data Flow Skipper Docs ................ SKIPPED
21-Feb-2019 22:13:01 [INFO] Spring Cloud Data Flow Docs ........................ SKIPPED
21-Feb-2019 22:13:01 [INFO] spring-cloud-dataflow-dependencies ................. SKIPPED
21-Feb-2019 22:13:01 [INFO] ------------------------------------------------------------------------
21-Feb-2019 22:13:01 [INFO] BUILD FAILURE
21-Feb-2019 22:13:01 [INFO] ------------------------------------------------------------------------
21-Feb-2019 22:13:01 [INFO] Total time: 03:16 min
21-Feb-2019 22:13:01 [INFO] Finished at: 2019-02-21T22:13:01Z
21-Feb-2019 22:13:02 [INFO] Final Memory: 102M/826M
21-Feb-2019 22:13:02 [INFO] ------------------------------------------------------------------------
21-Feb-2019 22:13:02 [ERROR] Failed to execute goal org.apache.maven.plugins:maven-surefire-plugin:2.22.0:test (default-test) on project spring-cloud-dataflow-server-core: There are test failures.
21-Feb-2019 22:13:02 [ERROR]
21-Feb-2019 22:13:02 [ERROR] Please refer to /opt/bamboo-home/xml-data/build-dir/SCD-SCDF17X-JOB1/spring-cloud-dataflow-server-core/target/surefire-reports for the individual test results.
21-Feb-2019 22:13:02 [ERROR] Please refer to dump files (if any exist) [date]-jvmRun[N].dump, [date].dumpstream and [date]-jvmRun[N].dumpstream.
21-Feb-2019 22:13:02 [ERROR] -> [Help 1]
21-Feb-2019 22:13:02 [ERROR]
21-Feb-2019 22:13:02 [ERROR] To see the full stack trace of the errors, re-run Maven with the -e switch.
21-Feb-2019 22:13:02 [ERROR] Re-run Maven using the -X switch to enable full debug logging.
21-Feb-2019 22:13:02 [ERROR]
21-Feb-2019 22:13:02 [ERROR] For more information about the errors and possible solutions, please read the following articles:
21-Feb-2019 22:13:02 [ERROR] [Help 1] http://cwiki.apache.org/confluence/display/MAVEN/MojoFailureException
21-Feb-2019 22:13:02 [ERROR]
21-Feb-2019 22:13:02 [ERROR] After correcting the problems, you can resume the build with the command
21-Feb-2019 22:13:02 [ERROR]   mvn <goals> -rf :spring-cloud-dataflow-server-core
21-Feb-2019 22:13:02
21-Feb-2019 22:13:02 Failing task since return code of [/opt/jdk-8/bin/java -cp /opt/maven-3.5/boot/plexus-classworlds-2.5.2.jar -Dclassworlds.conf=/tmp/artifactoryM24532472299391308870conf -DbuildInfoConfig.propertiesFile=/tmp/buildInfo7095769136985751059.properties -Xmx2048m -XX:MaxPermSize=1024m -Dmaven.home=/opt/maven-3.5 -Dmaven.multiModuleProjectDirectory=/opt/bamboo-home/xml-data/build-dir/SCD-SCDF17X-JOB1 org.codehaus.plexus.classworlds.launcher.Launcher -s .settings.xml clean install -Pfull --batch-mode -U -Dartifactory.publish.password=********] was 1 while expected 0
21-Feb-2019 22:13:02 Parsing test results under /opt/bamboo-home/xml-data/build-dir/SCD-SCDF17X-JOB1...
21-Feb-2019 22:13:02 Finished task 'Build and publish Spring Cloud Data' with result: Failed
21-Feb-2019 22:13:02 Running post build plugin 'Docker Container Cleanup'
21-Feb-2019 22:13:02 Running post build plugin 'NCover Results Collector'
21-Feb-2019 22:13:02 Running post build plugin 'Artifactory Release Management Staging'
21-Feb-2019 22:13:02 Running post build plugin 'Artifactory Build Info Copier'
21-Feb-2019 22:13:02 Running post build plugin 'Artifactory Gradle Properties Info Copier'
21-Feb-2019 22:13:02 Running post build plugin 'Clover Results Collector'
21-Feb-2019 22:13:02 Running post build plugin 'npm Cache Cleanup'
21-Feb-2019 22:13:02 Running post build plugin 'Artifact Copier'
21-Feb-2019 22:13:02 Publishing an artifact: Test Results
21-Feb-2019 22:13:02 Finished publishing of artifact Shared artifact: [Test Results], pattern: [**/target/surefire-reports/**/*.*] in 182.8 ms
21-Feb-2019 22:13:02 Successfully removed working directory at '/opt/bamboo-home/xml-data/build-dir/SCD-SCDF17X-JOB1'
21-Feb-2019 22:13:02 Finalising the build...
21-Feb-2019 22:13:02 Stopping timer.
21-Feb-2019 22:13:02 Build SCD-SCDF17X-JOB1-62 completed.
21-Feb-2019 22:13:02 Running on server: post build plugin 'NCover Results Collector'
21-Feb-2019 22:13:02 Running on server: post build plugin 'Build Hanging Detection Configuration'
21-Feb-2019 22:13:02 Running on server: post build plugin 'Clover Delta Calculator'
21-Feb-2019 22:13:02 Running on server: post build plugin 'Maven Dependencies Postprocessor'
21-Feb-2019 22:13:02 All post build plugins have finished
21-Feb-2019 22:13:02 Generating build results summary...
21-Feb-2019 22:13:03 Saving build results to disk...
21-Feb-2019 22:13:03 Logging substituted variables...
21-Feb-2019 22:13:03 Indexing build results...
21-Feb-2019 22:13:03 Finished building SCD-SCDF17X-JOB1-62.