Build: #70 failed

Job: Build and install SCDF failed

Stages & jobs

  1. Default Stage

  2. Build Docker Images and upload

Build log

The build generated 15,320 lines of output.The output is too long and has been truncated to the last 1,000 lines. Download or view full build log

02-Jul-2019 06:01:40
02-Jul-2019 06:01:40 Resolved Exception:
02-Jul-2019 06:01:40              Type = null
02-Jul-2019 06:01:40
02-Jul-2019 06:01:40 ModelAndView:
02-Jul-2019 06:01:40         View name = null
02-Jul-2019 06:01:40              View = null
02-Jul-2019 06:01:40             Model = null
02-Jul-2019 06:01:40
02-Jul-2019 06:01:40 FlashMap:
02-Jul-2019 06:01:40        Attributes = null
02-Jul-2019 06:01:40
02-Jul-2019 06:01:40 MockHttpServletResponse:
02-Jul-2019 06:01:40            Status = 200
02-Jul-2019 06:01:40     Error message = null
02-Jul-2019 06:01:40           Headers = {Content-Type=[application/json;charset=UTF-8]}
02-Jul-2019 06:01:40      Content type = application/json;charset=UTF-8
02-Jul-2019 06:01:40              Body = {"featureInfo":{"analyticsEnabled":true,"streamsEnabled":true,"tasksEnabled":true,"skipperEnabled":false,"schedulerEnabled":false},"versionInfo":{"implementation":{"name":"${info.app.name}","version":"${info.app.version}"},"core":{"name":"Spring Cloud Data Flow Core","version":"1.7.5.BUILD-SNAPSHOT"},"dashboard":{"name":"Spring Cloud Dataflow UI","version":"1.7.3.RELEASE"},"shell":{"name":"Spring Cloud Data Flow Shell","version":"1.2.3.RC1","url":"https://repo.spring.io/libs-milestone/org/springframework/cloud/spring-cloud-dataflow-shell/1.2.3.RC1/spring-cloud-dataflow-shell-1.2.3.RC1.jar"}},"securityInfo":{"authenticationEnabled":false,"authorizationEnabled":false,"formLogin":false,"authenticated":false,"username":null,"roles":[]},"runtimeEnvironment":{"appDeployer":{"deployerImplementationVersion":"testAppDepImplementationVersion","deployerName":"testAppDepImplementationName","deployerSpiVersion":"1.8.0_212","javaVersion":"1.8.0_212","platformApiVersion":"testAppDepPlatformApiVersion","platformClientVersion":"testAppDepPlatformClientVersion","platformHostVersion":"testAppDepPlatformHostVersion","platformSpecificInfo":{},"platformType":"testAppDepPlatformType","springBootVersion":"1.5.16.RELEASE","springVersion":"4.3.19.RELEASE"},"taskLauncher":{"deployerImplementationVersion":"testTaskDepImplementationVersion","deployerName":"testTaskDepImplementationName","deployerSpiVersion":"1.8.0_212","javaVersion":"1.8.0_212","platformApiVersion":"testTaskDepPlatformApiVersion","platformClientVersion":"testTaskDepPlatformClientVersion","platformHostVersion":"testTaskDepPlatformHostVersion","platformSpecificInfo":{},"platformType":"testTaskDepPlatformType","springBootVersion":"1.5.16.RELEASE","springVersion":"4.3.19.RELEASE"}},"links":[{"rel":"self","href":"http://localhost/about"}]}
02-Jul-2019 06:01:40     Forwarded URL = null
02-Jul-2019 06:01:40    Redirected URL = null
02-Jul-2019 06:01:40           Cookies = []
02-Jul-2019 06:01:40 2019-07-02 06:01:40.713  INFO 10721 --- [           main] j.LocalContainerEntityManagerFactoryBean : Closing JPA EntityManagerFactory for persistence unit 'default'
02-Jul-2019 06:01:40 2019-07-02 06:01:40.713  INFO 10721 --- [           main] .SchemaDropperImpl$DelayedDropActionImpl : HHH000477: Starting delayed drop of schema as part of SessionFactory shut-down'
02-Jul-2019 06:01:40 2019-07-02 06:01:40.715  INFO 10721 --- [           main] o.s.j.d.e.EmbeddedDatabaseFactory        : Shutting down embedded database: url='jdbc:h2:mem:testdb;DB_CLOSE_DELAY=-1;DB_CLOSE_ON_EXIT=false'
02-Jul-2019 06:01:40 2019-07-02 06:01:40.716  INFO 10721 --- [           main] junit.logTestName                        : Finished Test testRC
02-Jul-2019 06:01:40 [INFO] Tests run: 1, Failures: 0, Errors: 0, Skipped: 0, Time elapsed: 0.62 s - in org.springframework.cloud.dataflow.server.controller.AboutControllerTests$RCUrlTests
02-Jul-2019 06:01:40 [INFO] Running org.springframework.cloud.dataflow.server.controller.RuntimeAppsControllerTests
02-Jul-2019 06:01:40 2019-07-02 06:01:40.717  INFO 10721 --- [           main] o.s.t.c.support.AbstractContextLoader    : Could not detect default resource locations for test class [org.springframework.cloud.dataflow.server.controller.RuntimeAppsControllerTests]: no resource found for suffixes {-context.xml, Context.groovy}.
02-Jul-2019 06:01:40   ____                              ____ _                __
02-Jul-2019 06:01:40 / ___| _ __  _ __(_)_ __   __ _   / ___| | ___  _   _  __| |
02-Jul-2019 06:01:40 \___ \| '_ \| '__| | '_ \ / _` | | |   | |/ _ \| | | |/ _` |
02-Jul-2019 06:01:40   ___) | |_) | |  | | | | | (_| | | |___| | (_) | |_| | (_| |
02-Jul-2019 06:01:40 |____/| .__/|_|  |_|_| |_|\__, |  \____|_|\___/ \__,_|\__,_|
02-Jul-2019 06:01:40   ____ |_|    _          __|___/                 __________
02-Jul-2019 06:01:40 |  _ \  __ _| |_ __ _  |  ___| | _____      __  \ \ \ \ \ \
02-Jul-2019 06:01:40 | | | |/ _` | __/ _` | | |_  | |/ _ \ \ /\ / /   \ \ \ \ \ \
02-Jul-2019 06:01:40 | |_| | (_| | || (_| | |  _| | | (_) \ V  V /    / / / / / /
02-Jul-2019 06:01:40 |____/ \__,_|\__\__,_| |_|   |_|\___/ \_/\_/    /_/_/_/_/_/
02-Jul-2019 06:01:40
02-Jul-2019 06:01:40
02-Jul-2019 06:01:40
02-Jul-2019 06:01:40 2019-07-02 06:01:40.913  INFO 10721 --- [           main] c.c.c.ConfigServicePropertySourceLocator : Fetching config from server at: http://localhost:8888
02-Jul-2019 06:01:40 2019-07-02 06:01:40.915  WARN 10721 --- [           main] c.c.c.ConfigServicePropertySourceLocator : Could not locate PropertySource: I/O error on GET request for "http://localhost:8888/application/default": Connection refused (Connection refused); nested exception is java.net.ConnectException: Connection refused (Connection refused)
02-Jul-2019 06:01:40 2019-07-02 06:01:40.916  INFO 10721 --- [           main] o.s.c.d.s.c.RuntimeAppsControllerTests   : No active profile set, falling back to default profiles: default
02-Jul-2019 06:01:40 2019-07-02 06:01:40.943  INFO 10721 --- [           main] .s.d.r.c.RepositoryConfigurationDelegate : Multiple Spring Data modules found, entering strict repository configuration mode!
02-Jul-2019 06:01:41 2019-07-02 06:01:41.038  INFO 10721 --- [           main] o.s.j.d.e.EmbeddedDatabaseFactory        : Starting embedded database: url='jdbc:h2:mem:testdb;DB_CLOSE_DELAY=-1;DB_CLOSE_ON_EXIT=false', username='sa'
02-Jul-2019 06:01:41 2019-07-02 06:01:41.065  INFO 10721 --- [           main] j.LocalContainerEntityManagerFactoryBean : Building JPA container EntityManagerFactory for persistence unit 'default'
02-Jul-2019 06:01:41 2019-07-02 06:01:41.065  INFO 10721 --- [           main] o.hibernate.jpa.internal.util.LogHelper  : HHH000204: Processing PersistenceUnitInfo [
02-Jul-2019 06:01:41         name: default
02-Jul-2019 06:01:41         ...]
02-Jul-2019 06:01:41 2019-07-02 06:01:41.070  INFO 10721 --- [           main] org.hibernate.dialect.Dialect            : HHH000400: Using dialect: org.hibernate.dialect.H2Dialect
02-Jul-2019 06:01:41 2019-07-02 06:01:41.086  INFO 10721 --- [           main] o.h.t.schema.internal.SchemaCreatorImpl  : HHH000476: Executing import script 'org.hibernate.tool.schema.internal.exec.ScriptSourceInputNonExistentImpl@2c6799fe'
02-Jul-2019 06:01:41 2019-07-02 06:01:41.087  INFO 10721 --- [           main] j.LocalContainerEntityManagerFactoryBean : Initialized JPA EntityManagerFactory for persistence unit 'default'
02-Jul-2019 06:01:41 2019-07-02 06:01:41.248  INFO 10721 --- [           main] o.s.c.d.s.c.support.MetricStore          : Metrics Collector URI = []
02-Jul-2019 06:01:41 2019-07-02 06:01:41.311  INFO 10721 --- [           main] o.s.c.d.s.c.RuntimeAppsControllerTests   : Started RuntimeAppsControllerTests in 0.586 seconds (JVM running for 156.531)
02-Jul-2019 06:01:41 2019-07-02 06:01:41.316  INFO 10721 --- [           main] o.s.t.web.servlet.TestDispatcherServlet  : FrameworkServlet '': initialization started
02-Jul-2019 06:01:41 2019-07-02 06:01:41.320  INFO 10721 --- [           main] o.s.t.web.servlet.TestDispatcherServlet  : FrameworkServlet '': initialization completed in 4 ms
02-Jul-2019 06:01:41
02-Jul-2019 06:01:41 MockHttpServletRequest:
02-Jul-2019 06:01:41       HTTP Method = GET
02-Jul-2019 06:01:41       Request URI = /runtime/apps
02-Jul-2019 06:01:41        Parameters = {}
02-Jul-2019 06:01:41           Headers = {Accept=[application/json]}
02-Jul-2019 06:01:41
02-Jul-2019 06:01:41 Handler:
02-Jul-2019 06:01:41              Type = org.springframework.cloud.dataflow.server.controller.RuntimeAppsController
02-Jul-2019 06:01:41            Method = public org.springframework.hateoas.PagedResources<org.springframework.cloud.dataflow.rest.resource.AppStatusResource> org.springframework.cloud.dataflow.server.controller.RuntimeAppsController.list(org.springframework.data.domain.Pageable,org.springframework.data.web.PagedResourcesAssembler<org.springframework.cloud.deployer.spi.app.AppStatus>) throws java.util.concurrent.ExecutionException,java.lang.InterruptedException
02-Jul-2019 06:01:41
02-Jul-2019 06:01:41 Async:
02-Jul-2019 06:01:41     Async started = false
02-Jul-2019 06:01:41      Async result = null
02-Jul-2019 06:01:41
02-Jul-2019 06:01:41 Resolved Exception:
02-Jul-2019 06:01:41              Type = null
02-Jul-2019 06:01:41
02-Jul-2019 06:01:41 ModelAndView:
02-Jul-2019 06:01:41         View name = null
02-Jul-2019 06:01:41              View = null
02-Jul-2019 06:01:41             Model = null
02-Jul-2019 06:01:41
02-Jul-2019 06:01:41 FlashMap:
02-Jul-2019 06:01:41        Attributes = null
02-Jul-2019 06:01:41
02-Jul-2019 06:01:41 MockHttpServletResponse:
02-Jul-2019 06:01:41            Status = 200
02-Jul-2019 06:01:41     Error message = null
02-Jul-2019 06:01:41           Headers = {Content-Type=[application/json;charset=UTF-8]}
02-Jul-2019 06:01:41      Content type = application/json;charset=UTF-8
02-Jul-2019 06:01:41              Body = {"links":[{"rel":"self","href":"http://localhost/runtime/apps?page=0&size=20"}],"content":[{"deploymentId":"ticktock1.log","state":"deployed","instances":{"links":[],"content":[]},"links":[{"rel":"self","href":"http://localhost/runtime/apps/ticktock1.log"}]},{"deploymentId":"ticktock1.time","state":"deployed","instances":{"links":[],"content":[]},"links":[{"rel":"self","href":"http://localhost/runtime/apps/ticktock1.time"}]},{"deploymentId":"ticktock2.log","state":"deployed","instances":{"links":[],"content":[]},"links":[{"rel":"self","href":"http://localhost/runtime/apps/ticktock2.log"}]},{"deploymentId":"ticktock2.time","state":"deployed","instances":{"links":[],"content":[]},"links":[{"rel":"self","href":"http://localhost/runtime/apps/ticktock2.time"}]}],"page":{"size":20,"totalElements":4,"totalPages":1,"number":0}}
02-Jul-2019 06:01:41     Forwarded URL = null
02-Jul-2019 06:01:41    Redirected URL = null
02-Jul-2019 06:01:41           Cookies = []
02-Jul-2019 06:01:41 2019-07-02 06:01:41.350  INFO 10721 --- [           main] j.LocalContainerEntityManagerFactoryBean : Closing JPA EntityManagerFactory for persistence unit 'default'
02-Jul-2019 06:01:41 2019-07-02 06:01:41.350  INFO 10721 --- [           main] .SchemaDropperImpl$DelayedDropActionImpl : HHH000477: Starting delayed drop of schema as part of SessionFactory shut-down'
02-Jul-2019 06:01:41 2019-07-02 06:01:41.351  INFO 10721 --- [           main] o.s.j.d.e.EmbeddedDatabaseFactory        : Shutting down embedded database: url='jdbc:h2:mem:testdb;DB_CLOSE_DELAY=-1;DB_CLOSE_ON_EXIT=false'
02-Jul-2019 06:01:41   ____                              ____ _                __
02-Jul-2019 06:01:41 / ___| _ __  _ __(_)_ __   __ _   / ___| | ___  _   _  __| |
02-Jul-2019 06:01:41 \___ \| '_ \| '__| | '_ \ / _` | | |   | |/ _ \| | | |/ _` |
02-Jul-2019 06:01:41   ___) | |_) | |  | | | | | (_| | | |___| | (_) | |_| | (_| |
02-Jul-2019 06:01:41 |____/| .__/|_|  |_|_| |_|\__, |  \____|_|\___/ \__,_|\__,_|
02-Jul-2019 06:01:41   ____ |_|    _          __|___/                 __________
02-Jul-2019 06:01:41 |  _ \  __ _| |_ __ _  |  ___| | _____      __  \ \ \ \ \ \
02-Jul-2019 06:01:41 | | | |/ _` | __/ _` | | |_  | |/ _ \ \ /\ / /   \ \ \ \ \ \
02-Jul-2019 06:01:41 | |_| | (_| | || (_| | |  _| | | (_) \ V  V /    / / / / / /
02-Jul-2019 06:01:41 |____/ \__,_|\__\__,_| |_|   |_|\___/ \_/\_/    /_/_/_/_/_/
02-Jul-2019 06:01:41
02-Jul-2019 06:01:41
02-Jul-2019 06:01:41
02-Jul-2019 06:01:41 2019-07-02 06:01:41.539  INFO 10721 --- [           main] c.c.c.ConfigServicePropertySourceLocator : Fetching config from server at: http://localhost:8888
02-Jul-2019 06:01:41 2019-07-02 06:01:41.541  WARN 10721 --- [           main] c.c.c.ConfigServicePropertySourceLocator : Could not locate PropertySource: I/O error on GET request for "http://localhost:8888/application/default": Connection refused (Connection refused); nested exception is java.net.ConnectException: Connection refused (Connection refused)
02-Jul-2019 06:01:41 2019-07-02 06:01:41.542  INFO 10721 --- [           main] o.s.c.d.s.c.RuntimeAppsControllerTests   : No active profile set, falling back to default profiles: default
02-Jul-2019 06:01:41 2019-07-02 06:01:41.569  INFO 10721 --- [           main] .s.d.r.c.RepositoryConfigurationDelegate : Multiple Spring Data modules found, entering strict repository configuration mode!
02-Jul-2019 06:01:41 2019-07-02 06:01:41.663  INFO 10721 --- [           main] o.s.j.d.e.EmbeddedDatabaseFactory        : Starting embedded database: url='jdbc:h2:mem:testdb;DB_CLOSE_DELAY=-1;DB_CLOSE_ON_EXIT=false', username='sa'
02-Jul-2019 06:01:41 2019-07-02 06:01:41.690  INFO 10721 --- [           main] j.LocalContainerEntityManagerFactoryBean : Building JPA container EntityManagerFactory for persistence unit 'default'
02-Jul-2019 06:01:41 2019-07-02 06:01:41.690  INFO 10721 --- [           main] o.hibernate.jpa.internal.util.LogHelper  : HHH000204: Processing PersistenceUnitInfo [
02-Jul-2019 06:01:41         name: default
02-Jul-2019 06:01:41         ...]
02-Jul-2019 06:01:41 2019-07-02 06:01:41.694  INFO 10721 --- [           main] org.hibernate.dialect.Dialect            : HHH000400: Using dialect: org.hibernate.dialect.H2Dialect
02-Jul-2019 06:01:41 2019-07-02 06:01:41.710  INFO 10721 --- [           main] o.h.t.schema.internal.SchemaCreatorImpl  : HHH000476: Executing import script 'org.hibernate.tool.schema.internal.exec.ScriptSourceInputNonExistentImpl@2c6799fe'
02-Jul-2019 06:01:41 2019-07-02 06:01:41.711  INFO 10721 --- [           main] j.LocalContainerEntityManagerFactoryBean : Initialized JPA EntityManagerFactory for persistence unit 'default'
02-Jul-2019 06:01:41 2019-07-02 06:01:41.874  INFO 10721 --- [           main] o.s.c.d.s.c.support.MetricStore          : Metrics Collector URI = []
02-Jul-2019 06:01:41 2019-07-02 06:01:41.940  INFO 10721 --- [           main] o.s.c.d.s.c.RuntimeAppsControllerTests   : Started RuntimeAppsControllerTests in 0.585 seconds (JVM running for 157.16)
02-Jul-2019 06:01:41 2019-07-02 06:01:41.944  INFO 10721 --- [           main] o.s.t.web.servlet.TestDispatcherServlet  : FrameworkServlet '': initialization started
02-Jul-2019 06:01:41 2019-07-02 06:01:41.948  INFO 10721 --- [           main] o.s.t.web.servlet.TestDispatcherServlet  : FrameworkServlet '': initialization completed in 4 ms
02-Jul-2019 06:01:41 2019-07-02 06:01:41.950  WARN 10721 --- [           main] o.s.c.d.s.c.RestControllerAdvice         : Caught exception while handling a request: The 'invalid-0' application instance could not be found.
02-Jul-2019 06:01:41 2019-07-02 06:01:41.952  WARN 10721 --- [           main] .m.m.a.ExceptionHandlerExceptionResolver : Resolved [org.springframework.cloud.dataflow.server.controller.NoSuchAppInstanceException: The 'invalid-0' application instance could not be found.]
02-Jul-2019 06:01:41
02-Jul-2019 06:01:41 MockHttpServletRequest:
02-Jul-2019 06:01:41       HTTP Method = GET
02-Jul-2019 06:01:41       Request URI = /runtime/apps/valid/instances/invalid-0
02-Jul-2019 06:01:41        Parameters = {}
02-Jul-2019 06:01:41           Headers = {Accept=[application/json]}
02-Jul-2019 06:01:41
02-Jul-2019 06:01:41 Handler:
02-Jul-2019 06:01:41              Type = org.springframework.cloud.dataflow.server.controller.RuntimeAppInstanceController
02-Jul-2019 06:01:41            Method = public org.springframework.cloud.dataflow.rest.resource.AppInstanceStatusResource org.springframework.cloud.dataflow.server.controller.RuntimeAppInstanceController.display(java.lang.String,java.lang.String)
02-Jul-2019 06:01:41
02-Jul-2019 06:01:41 Async:
02-Jul-2019 06:01:41     Async started = false
02-Jul-2019 06:01:41      Async result = null
02-Jul-2019 06:01:41
02-Jul-2019 06:01:41 Resolved Exception:
02-Jul-2019 06:01:41              Type = org.springframework.cloud.dataflow.server.controller.NoSuchAppInstanceException
02-Jul-2019 06:01:41
02-Jul-2019 06:01:41 ModelAndView:
02-Jul-2019 06:01:41         View name = null
02-Jul-2019 06:01:41              View = null
02-Jul-2019 06:01:41             Model = null
02-Jul-2019 06:01:41
02-Jul-2019 06:01:41 FlashMap:
02-Jul-2019 06:01:41        Attributes = null
02-Jul-2019 06:01:41
02-Jul-2019 06:01:41 MockHttpServletResponse:
02-Jul-2019 06:01:41            Status = 404
02-Jul-2019 06:01:41     Error message = null
02-Jul-2019 06:01:41           Headers = {Content-Type=[application/json;charset=UTF-8]}
02-Jul-2019 06:01:41      Content type = application/json;charset=UTF-8
02-Jul-2019 06:01:41              Body = [{"logref":"NoSuchAppInstanceException","message":"The 'invalid-0' application instance could not be found.","links":[]}]
02-Jul-2019 06:01:41     Forwarded URL = null
02-Jul-2019 06:01:41    Redirected URL = null
02-Jul-2019 06:01:41           Cookies = []
02-Jul-2019 06:01:41 2019-07-02 06:01:41.955  INFO 10721 --- [           main] j.LocalContainerEntityManagerFactoryBean : Closing JPA EntityManagerFactory for persistence unit 'default'
02-Jul-2019 06:01:41 2019-07-02 06:01:41.955  INFO 10721 --- [           main] .SchemaDropperImpl$DelayedDropActionImpl : HHH000477: Starting delayed drop of schema as part of SessionFactory shut-down'
02-Jul-2019 06:01:41 2019-07-02 06:01:41.955  INFO 10721 --- [           main] o.s.j.d.e.EmbeddedDatabaseFactory        : Shutting down embedded database: url='jdbc:h2:mem:testdb;DB_CLOSE_DELAY=-1;DB_CLOSE_ON_EXIT=false'
02-Jul-2019 06:01:42   ____                              ____ _                __
02-Jul-2019 06:01:42 / ___| _ __  _ __(_)_ __   __ _   / ___| | ___  _   _  __| |
02-Jul-2019 06:01:42 \___ \| '_ \| '__| | '_ \ / _` | | |   | |/ _ \| | | |/ _` |
02-Jul-2019 06:01:42   ___) | |_) | |  | | | | | (_| | | |___| | (_) | |_| | (_| |
02-Jul-2019 06:01:42 |____/| .__/|_|  |_|_| |_|\__, |  \____|_|\___/ \__,_|\__,_|
02-Jul-2019 06:01:42   ____ |_|    _          __|___/                 __________
02-Jul-2019 06:01:42 |  _ \  __ _| |_ __ _  |  ___| | _____      __  \ \ \ \ \ \
02-Jul-2019 06:01:42 | | | |/ _` | __/ _` | | |_  | |/ _ \ \ /\ / /   \ \ \ \ \ \
02-Jul-2019 06:01:42 | |_| | (_| | || (_| | |  _| | | (_) \ V  V /    / / / / / /
02-Jul-2019 06:01:42 |____/ \__,_|\__\__,_| |_|   |_|\___/ \_/\_/    /_/_/_/_/_/
02-Jul-2019 06:01:42
02-Jul-2019 06:01:42
02-Jul-2019 06:01:42
02-Jul-2019 06:01:42 2019-07-02 06:01:42.200  INFO 10721 --- [           main] c.c.c.ConfigServicePropertySourceLocator : Fetching config from server at: http://localhost:8888
02-Jul-2019 06:01:42 2019-07-02 06:01:42.201  WARN 10721 --- [           main] c.c.c.ConfigServicePropertySourceLocator : Could not locate PropertySource: I/O error on GET request for "http://localhost:8888/application/default": Connection refused (Connection refused); nested exception is java.net.ConnectException: Connection refused (Connection refused)
02-Jul-2019 06:01:42 2019-07-02 06:01:42.203  INFO 10721 --- [           main] o.s.c.d.s.c.RuntimeAppsControllerTests   : No active profile set, falling back to default profiles: default
02-Jul-2019 06:01:42 2019-07-02 06:01:42.230  INFO 10721 --- [           main] .s.d.r.c.RepositoryConfigurationDelegate : Multiple Spring Data modules found, entering strict repository configuration mode!
02-Jul-2019 06:01:42 2019-07-02 06:01:42.324  INFO 10721 --- [           main] o.s.j.d.e.EmbeddedDatabaseFactory        : Starting embedded database: url='jdbc:h2:mem:testdb;DB_CLOSE_DELAY=-1;DB_CLOSE_ON_EXIT=false', username='sa'
02-Jul-2019 06:01:42 2019-07-02 06:01:42.351  INFO 10721 --- [           main] j.LocalContainerEntityManagerFactoryBean : Building JPA container EntityManagerFactory for persistence unit 'default'
02-Jul-2019 06:01:42 2019-07-02 06:01:42.351  INFO 10721 --- [           main] o.hibernate.jpa.internal.util.LogHelper  : HHH000204: Processing PersistenceUnitInfo [
02-Jul-2019 06:01:42         name: default
02-Jul-2019 06:01:42         ...]
02-Jul-2019 06:01:42 2019-07-02 06:01:42.355  INFO 10721 --- [           main] org.hibernate.dialect.Dialect            : HHH000400: Using dialect: org.hibernate.dialect.H2Dialect
02-Jul-2019 06:01:42 2019-07-02 06:01:42.371  INFO 10721 --- [           main] o.h.t.schema.internal.SchemaCreatorImpl  : HHH000476: Executing import script 'org.hibernate.tool.schema.internal.exec.ScriptSourceInputNonExistentImpl@2c6799fe'
02-Jul-2019 06:01:42 2019-07-02 06:01:42.371  INFO 10721 --- [           main] j.LocalContainerEntityManagerFactoryBean : Initialized JPA EntityManagerFactory for persistence unit 'default'
02-Jul-2019 06:01:42 2019-07-02 06:01:42.530  INFO 10721 --- [           main] o.s.c.d.s.c.support.MetricStore          : Metrics Collector URI = []
02-Jul-2019 06:01:42 2019-07-02 06:01:42.594  INFO 10721 --- [           main] o.s.c.d.s.c.RuntimeAppsControllerTests   : Started RuntimeAppsControllerTests in 0.635 seconds (JVM running for 157.814)
02-Jul-2019 06:01:42 2019-07-02 06:01:42.598  INFO 10721 --- [           main] o.s.t.web.servlet.TestDispatcherServlet  : FrameworkServlet '': initialization started
02-Jul-2019 06:01:42 2019-07-02 06:01:42.601  INFO 10721 --- [           main] o.s.t.web.servlet.TestDispatcherServlet  : FrameworkServlet '': initialization completed in 3 ms
02-Jul-2019 06:01:42 2019-07-02 06:01:42.604  WARN 10721 --- [           main] o.s.c.d.s.c.RestControllerAdvice         : Caught exception while handling a request: The 'foo' application could not be found.
02-Jul-2019 06:01:42 2019-07-02 06:01:42.605  WARN 10721 --- [           main] .m.m.a.ExceptionHandlerExceptionResolver : Resolved [org.springframework.cloud.dataflow.server.controller.NoSuchAppException: The 'foo' application could not be found.]
02-Jul-2019 06:01:42
02-Jul-2019 06:01:42 MockHttpServletRequest:
02-Jul-2019 06:01:42       HTTP Method = GET
02-Jul-2019 06:01:42       Request URI = /runtime/apps/foo
02-Jul-2019 06:01:42        Parameters = {}
02-Jul-2019 06:01:42           Headers = {Accept=[application/json]}
02-Jul-2019 06:01:42
02-Jul-2019 06:01:42 Handler:
02-Jul-2019 06:01:42              Type = org.springframework.cloud.dataflow.server.controller.RuntimeAppsController
02-Jul-2019 06:01:42            Method = public org.springframework.cloud.dataflow.rest.resource.AppStatusResource org.springframework.cloud.dataflow.server.controller.RuntimeAppsController.display(java.lang.String)
02-Jul-2019 06:01:42
02-Jul-2019 06:01:42 Async:
02-Jul-2019 06:01:42     Async started = false
02-Jul-2019 06:01:42      Async result = null
02-Jul-2019 06:01:42
02-Jul-2019 06:01:42 Resolved Exception:
02-Jul-2019 06:01:42              Type = org.springframework.cloud.dataflow.server.controller.NoSuchAppException
02-Jul-2019 06:01:42
02-Jul-2019 06:01:42 ModelAndView:
02-Jul-2019 06:01:42         View name = null
02-Jul-2019 06:01:42              View = null
02-Jul-2019 06:01:42             Model = null
02-Jul-2019 06:01:42
02-Jul-2019 06:01:42 FlashMap:
02-Jul-2019 06:01:42        Attributes = null
02-Jul-2019 06:01:42
02-Jul-2019 06:01:42 MockHttpServletResponse:
02-Jul-2019 06:01:42            Status = 404
02-Jul-2019 06:01:42     Error message = null
02-Jul-2019 06:01:42           Headers = {Content-Type=[application/json;charset=UTF-8]}
02-Jul-2019 06:01:42      Content type = application/json;charset=UTF-8
02-Jul-2019 06:01:42              Body = [{"logref":"NoSuchAppException","message":"The 'foo' application could not be found.","links":[]}]
02-Jul-2019 06:01:42     Forwarded URL = null
02-Jul-2019 06:01:42    Redirected URL = null
02-Jul-2019 06:01:42           Cookies = []
02-Jul-2019 06:01:42 2019-07-02 06:01:42.608  INFO 10721 --- [           main] j.LocalContainerEntityManagerFactoryBean : Closing JPA EntityManagerFactory for persistence unit 'default'
02-Jul-2019 06:01:42 2019-07-02 06:01:42.608  INFO 10721 --- [           main] .SchemaDropperImpl$DelayedDropActionImpl : HHH000477: Starting delayed drop of schema as part of SessionFactory shut-down'
02-Jul-2019 06:01:42 2019-07-02 06:01:42.609  INFO 10721 --- [           main] o.s.j.d.e.EmbeddedDatabaseFactory        : Shutting down embedded database: url='jdbc:h2:mem:testdb;DB_CLOSE_DELAY=-1;DB_CLOSE_ON_EXIT=false'
02-Jul-2019 06:01:42   ____                              ____ _                __
02-Jul-2019 06:01:42 / ___| _ __  _ __(_)_ __   __ _   / ___| | ___  _   _  __| |
02-Jul-2019 06:01:42 \___ \| '_ \| '__| | '_ \ / _` | | |   | |/ _ \| | | |/ _` |
02-Jul-2019 06:01:42   ___) | |_) | |  | | | | | (_| | | |___| | (_) | |_| | (_| |
02-Jul-2019 06:01:42 |____/| .__/|_|  |_|_| |_|\__, |  \____|_|\___/ \__,_|\__,_|
02-Jul-2019 06:01:42   ____ |_|    _          __|___/                 __________
02-Jul-2019 06:01:42 |  _ \  __ _| |_ __ _  |  ___| | _____      __  \ \ \ \ \ \
02-Jul-2019 06:01:42 | | | |/ _` | __/ _` | | |_  | |/ _ \ \ /\ / /   \ \ \ \ \ \
02-Jul-2019 06:01:42 | |_| | (_| | || (_| | |  _| | | (_) \ V  V /    / / / / / /
02-Jul-2019 06:01:42 |____/ \__,_|\__\__,_| |_|   |_|\___/ \_/\_/    /_/_/_/_/_/
02-Jul-2019 06:01:42
02-Jul-2019 06:01:42
02-Jul-2019 06:01:42
02-Jul-2019 06:01:42 2019-07-02 06:01:42.795  INFO 10721 --- [           main] c.c.c.ConfigServicePropertySourceLocator : Fetching config from server at: http://localhost:8888
02-Jul-2019 06:01:42 2019-07-02 06:01:42.796  WARN 10721 --- [           main] c.c.c.ConfigServicePropertySourceLocator : Could not locate PropertySource: I/O error on GET request for "http://localhost:8888/application/default": Connection refused (Connection refused); nested exception is java.net.ConnectException: Connection refused (Connection refused)
02-Jul-2019 06:01:42 2019-07-02 06:01:42.797  INFO 10721 --- [           main] o.s.c.d.s.c.RuntimeAppsControllerTests   : No active profile set, falling back to default profiles: default
02-Jul-2019 06:01:42 2019-07-02 06:01:42.824  INFO 10721 --- [           main] .s.d.r.c.RepositoryConfigurationDelegate : Multiple Spring Data modules found, entering strict repository configuration mode!
02-Jul-2019 06:01:42 2019-07-02 06:01:42.916  INFO 10721 --- [           main] o.s.j.d.e.EmbeddedDatabaseFactory        : Starting embedded database: url='jdbc:h2:mem:testdb;DB_CLOSE_DELAY=-1;DB_CLOSE_ON_EXIT=false', username='sa'
02-Jul-2019 06:01:42 2019-07-02 06:01:42.943  INFO 10721 --- [           main] j.LocalContainerEntityManagerFactoryBean : Building JPA container EntityManagerFactory for persistence unit 'default'
02-Jul-2019 06:01:42 2019-07-02 06:01:42.943  INFO 10721 --- [           main] o.hibernate.jpa.internal.util.LogHelper  : HHH000204: Processing PersistenceUnitInfo [
02-Jul-2019 06:01:42         name: default
02-Jul-2019 06:01:42         ...]
02-Jul-2019 06:01:42 2019-07-02 06:01:42.947  INFO 10721 --- [           main] org.hibernate.dialect.Dialect            : HHH000400: Using dialect: org.hibernate.dialect.H2Dialect
02-Jul-2019 06:01:42 2019-07-02 06:01:42.963  INFO 10721 --- [           main] o.h.t.schema.internal.SchemaCreatorImpl  : HHH000476: Executing import script 'org.hibernate.tool.schema.internal.exec.ScriptSourceInputNonExistentImpl@2c6799fe'
02-Jul-2019 06:01:42 2019-07-02 06:01:42.963  INFO 10721 --- [           main] j.LocalContainerEntityManagerFactoryBean : Initialized JPA EntityManagerFactory for persistence unit 'default'
02-Jul-2019 06:01:43 2019-07-02 06:01:43.130  INFO 10721 --- [           main] o.s.c.d.s.c.support.MetricStore          : Metrics Collector URI = []
02-Jul-2019 06:01:43 2019-07-02 06:01:43.192  INFO 10721 --- [           main] o.s.c.d.s.c.RuntimeAppsControllerTests   : Started RuntimeAppsControllerTests in 0.58 seconds (JVM running for 158.412)
02-Jul-2019 06:01:43 2019-07-02 06:01:43.196  INFO 10721 --- [           main] o.s.t.web.servlet.TestDispatcherServlet  : FrameworkServlet '': initialization started
02-Jul-2019 06:01:43 2019-07-02 06:01:43.200  INFO 10721 --- [           main] o.s.t.web.servlet.TestDispatcherServlet  : FrameworkServlet '': initialization completed in 4 ms
02-Jul-2019 06:01:43
02-Jul-2019 06:01:43 MockHttpServletRequest:
02-Jul-2019 06:01:43       HTTP Method = GET
02-Jul-2019 06:01:43       Request URI = /runtime/apps
02-Jul-2019 06:01:43        Parameters = {page=[0], size=[1]}
02-Jul-2019 06:01:43           Headers = {Accept=[application/json]}
02-Jul-2019 06:01:43
02-Jul-2019 06:01:43 Handler:
02-Jul-2019 06:01:43              Type = org.springframework.cloud.dataflow.server.controller.RuntimeAppsController
02-Jul-2019 06:01:43            Method = public org.springframework.hateoas.PagedResources<org.springframework.cloud.dataflow.rest.resource.AppStatusResource> org.springframework.cloud.dataflow.server.controller.RuntimeAppsController.list(org.springframework.data.domain.Pageable,org.springframework.data.web.PagedResourcesAssembler<org.springframework.cloud.deployer.spi.app.AppStatus>) throws java.util.concurrent.ExecutionException,java.lang.InterruptedException
02-Jul-2019 06:01:43
02-Jul-2019 06:01:43 Async:
02-Jul-2019 06:01:43     Async started = false
02-Jul-2019 06:01:43      Async result = null
02-Jul-2019 06:01:43
02-Jul-2019 06:01:43 Resolved Exception:
02-Jul-2019 06:01:43              Type = null
02-Jul-2019 06:01:43
02-Jul-2019 06:01:43 ModelAndView:
02-Jul-2019 06:01:43         View name = null
02-Jul-2019 06:01:43              View = null
02-Jul-2019 06:01:43             Model = null
02-Jul-2019 06:01:43
02-Jul-2019 06:01:43 FlashMap:
02-Jul-2019 06:01:43        Attributes = null
02-Jul-2019 06:01:43
02-Jul-2019 06:01:43 MockHttpServletResponse:
02-Jul-2019 06:01:43            Status = 200
02-Jul-2019 06:01:43     Error message = null
02-Jul-2019 06:01:43           Headers = {Content-Type=[application/json;charset=UTF-8]}
02-Jul-2019 06:01:43      Content type = application/json;charset=UTF-8
02-Jul-2019 06:01:43              Body = {"links":[{"rel":"first","href":"http://localhost/runtime/apps?page=0&size=1"},{"rel":"self","href":"http://localhost/runtime/apps?page=0&size=1"},{"rel":"next","href":"http://localhost/runtime/apps?page=1&size=1"},{"rel":"last","href":"http://localhost/runtime/apps?page=3&size=1"}],"content":[{"deploymentId":"ticktock1.log","state":"deployed","instances":{"links":[],"content":[]},"links":[{"rel":"self","href":"http://localhost/runtime/apps/ticktock1.log"}]}],"page":{"size":1,"totalElements":4,"totalPages":4,"number":0}}
02-Jul-2019 06:01:43     Forwarded URL = null
02-Jul-2019 06:01:43    Redirected URL = null
02-Jul-2019 06:01:43           Cookies = []
02-Jul-2019 06:01:43
02-Jul-2019 06:01:43 MockHttpServletRequest:
02-Jul-2019 06:01:43       HTTP Method = GET
02-Jul-2019 06:01:43       Request URI = /runtime/apps
02-Jul-2019 06:01:43        Parameters = {page=[0], size=[2]}
02-Jul-2019 06:01:43           Headers = {Accept=[application/json]}
02-Jul-2019 06:01:43
02-Jul-2019 06:01:43 Handler:
02-Jul-2019 06:01:43              Type = org.springframework.cloud.dataflow.server.controller.RuntimeAppsController
02-Jul-2019 06:01:43            Method = public org.springframework.hateoas.PagedResources<org.springframework.cloud.dataflow.rest.resource.AppStatusResource> org.springframework.cloud.dataflow.server.controller.RuntimeAppsController.list(org.springframework.data.domain.Pageable,org.springframework.data.web.PagedResourcesAssembler<org.springframework.cloud.deployer.spi.app.AppStatus>) throws java.util.concurrent.ExecutionException,java.lang.InterruptedException
02-Jul-2019 06:01:43
02-Jul-2019 06:01:43 Async:
02-Jul-2019 06:01:43     Async started = false
02-Jul-2019 06:01:43      Async result = null
02-Jul-2019 06:01:43
02-Jul-2019 06:01:43 Resolved Exception:
02-Jul-2019 06:01:43              Type = null
02-Jul-2019 06:01:43
02-Jul-2019 06:01:43 ModelAndView:
02-Jul-2019 06:01:43         View name = null
02-Jul-2019 06:01:43              View = null
02-Jul-2019 06:01:43             Model = null
02-Jul-2019 06:01:43
02-Jul-2019 06:01:43 FlashMap:
02-Jul-2019 06:01:43        Attributes = null
02-Jul-2019 06:01:43
02-Jul-2019 06:01:43 MockHttpServletResponse:
02-Jul-2019 06:01:43            Status = 200
02-Jul-2019 06:01:43     Error message = null
02-Jul-2019 06:01:43           Headers = {Content-Type=[application/json;charset=UTF-8]}
02-Jul-2019 06:01:43      Content type = application/json;charset=UTF-8
02-Jul-2019 06:01:43              Body = {"links":[{"rel":"first","href":"http://localhost/runtime/apps?page=0&size=2"},{"rel":"self","href":"http://localhost/runtime/apps?page=0&size=2"},{"rel":"next","href":"http://localhost/runtime/apps?page=1&size=2"},{"rel":"last","href":"http://localhost/runtime/apps?page=1&size=2"}],"content":[{"deploymentId":"ticktock1.log","state":"deployed","instances":{"links":[],"content":[]},"links":[{"rel":"self","href":"http://localhost/runtime/apps/ticktock1.log"}]},{"deploymentId":"ticktock1.time","state":"deployed","instances":{"links":[],"content":[]},"links":[{"rel":"self","href":"http://localhost/runtime/apps/ticktock1.time"}]}],"page":{"size":2,"totalElements":4,"totalPages":2,"number":0}}
02-Jul-2019 06:01:43     Forwarded URL = null
02-Jul-2019 06:01:43    Redirected URL = null
02-Jul-2019 06:01:43           Cookies = []
02-Jul-2019 06:01:43
02-Jul-2019 06:01:43 MockHttpServletRequest:
02-Jul-2019 06:01:43       HTTP Method = GET
02-Jul-2019 06:01:43       Request URI = /runtime/apps
02-Jul-2019 06:01:43        Parameters = {page=[1], size=[2]}
02-Jul-2019 06:01:43           Headers = {Accept=[application/json]}
02-Jul-2019 06:01:43
02-Jul-2019 06:01:43 Handler:
02-Jul-2019 06:01:43              Type = org.springframework.cloud.dataflow.server.controller.RuntimeAppsController
02-Jul-2019 06:01:43            Method = public org.springframework.hateoas.PagedResources<org.springframework.cloud.dataflow.rest.resource.AppStatusResource> org.springframework.cloud.dataflow.server.controller.RuntimeAppsController.list(org.springframework.data.domain.Pageable,org.springframework.data.web.PagedResourcesAssembler<org.springframework.cloud.deployer.spi.app.AppStatus>) throws java.util.concurrent.ExecutionException,java.lang.InterruptedException
02-Jul-2019 06:01:43
02-Jul-2019 06:01:43 Async:
02-Jul-2019 06:01:43     Async started = false
02-Jul-2019 06:01:43      Async result = null
02-Jul-2019 06:01:43
02-Jul-2019 06:01:43 Resolved Exception:
02-Jul-2019 06:01:43              Type = null
02-Jul-2019 06:01:43
02-Jul-2019 06:01:43 ModelAndView:
02-Jul-2019 06:01:43         View name = null
02-Jul-2019 06:01:43              View = null
02-Jul-2019 06:01:43             Model = null
02-Jul-2019 06:01:43
02-Jul-2019 06:01:43 FlashMap:
02-Jul-2019 06:01:43        Attributes = null
02-Jul-2019 06:01:43
02-Jul-2019 06:01:43 MockHttpServletResponse:
02-Jul-2019 06:01:43            Status = 200
02-Jul-2019 06:01:43     Error message = null
02-Jul-2019 06:01:43           Headers = {Content-Type=[application/json;charset=UTF-8]}
02-Jul-2019 06:01:43      Content type = application/json;charset=UTF-8
02-Jul-2019 06:01:43              Body = {"links":[{"rel":"first","href":"http://localhost/runtime/apps?page=0&size=2"},{"rel":"prev","href":"http://localhost/runtime/apps?page=0&size=2"},{"rel":"self","href":"http://localhost/runtime/apps?page=1&size=2"},{"rel":"last","href":"http://localhost/runtime/apps?page=1&size=2"}],"content":[{"deploymentId":"ticktock2.log","state":"deployed","instances":{"links":[],"content":[]},"links":[{"rel":"self","href":"http://localhost/runtime/apps/ticktock2.log"}]},{"deploymentId":"ticktock2.time","state":"deployed","instances":{"links":[],"content":[]},"links":[{"rel":"self","href":"http://localhost/runtime/apps/ticktock2.time"}]}],"page":{"size":2,"totalElements":4,"totalPages":2,"number":1}}
02-Jul-2019 06:01:43     Forwarded URL = null
02-Jul-2019 06:01:43    Redirected URL = null
02-Jul-2019 06:01:43           Cookies = []
02-Jul-2019 06:01:43
02-Jul-2019 06:01:43 MockHttpServletRequest:
02-Jul-2019 06:01:43       HTTP Method = GET
02-Jul-2019 06:01:43       Request URI = /runtime/apps
02-Jul-2019 06:01:43        Parameters = {page=[3], size=[1]}
02-Jul-2019 06:01:43           Headers = {Accept=[application/json]}
02-Jul-2019 06:01:43
02-Jul-2019 06:01:43 Handler:
02-Jul-2019 06:01:43              Type = org.springframework.cloud.dataflow.server.controller.RuntimeAppsController
02-Jul-2019 06:01:43            Method = public org.springframework.hateoas.PagedResources<org.springframework.cloud.dataflow.rest.resource.AppStatusResource> org.springframework.cloud.dataflow.server.controller.RuntimeAppsController.list(org.springframework.data.domain.Pageable,org.springframework.data.web.PagedResourcesAssembler<org.springframework.cloud.deployer.spi.app.AppStatus>) throws java.util.concurrent.ExecutionException,java.lang.InterruptedException
02-Jul-2019 06:01:43
02-Jul-2019 06:01:43 Async:
02-Jul-2019 06:01:43     Async started = false
02-Jul-2019 06:01:43      Async result = null
02-Jul-2019 06:01:43
02-Jul-2019 06:01:43 Resolved Exception:
02-Jul-2019 06:01:43              Type = null
02-Jul-2019 06:01:43
02-Jul-2019 06:01:43 ModelAndView:
02-Jul-2019 06:01:43         View name = null
02-Jul-2019 06:01:43              View = null
02-Jul-2019 06:01:43             Model = null
02-Jul-2019 06:01:43
02-Jul-2019 06:01:43 FlashMap:
02-Jul-2019 06:01:43        Attributes = null
02-Jul-2019 06:01:43
02-Jul-2019 06:01:43 MockHttpServletResponse:
02-Jul-2019 06:01:43            Status = 200
02-Jul-2019 06:01:43     Error message = null
02-Jul-2019 06:01:43           Headers = {Content-Type=[application/json;charset=UTF-8]}
02-Jul-2019 06:01:43      Content type = application/json;charset=UTF-8
02-Jul-2019 06:01:43              Body = {"links":[{"rel":"first","href":"http://localhost/runtime/apps?page=0&size=1"},{"rel":"prev","href":"http://localhost/runtime/apps?page=2&size=1"},{"rel":"self","href":"http://localhost/runtime/apps?page=3&size=1"},{"rel":"last","href":"http://localhost/runtime/apps?page=3&size=1"}],"content":[{"deploymentId":"ticktock2.time","state":"deployed","instances":{"links":[],"content":[]},"links":[{"rel":"self","href":"http://localhost/runtime/apps/ticktock2.time"}]}],"page":{"size":1,"totalElements":4,"totalPages":4,"number":3}}
02-Jul-2019 06:01:43     Forwarded URL = null
02-Jul-2019 06:01:43    Redirected URL = null
02-Jul-2019 06:01:43           Cookies = []
02-Jul-2019 06:01:43 2019-07-02 06:01:43.221  INFO 10721 --- [           main] j.LocalContainerEntityManagerFactoryBean : Closing JPA EntityManagerFactory for persistence unit 'default'
02-Jul-2019 06:01:43 2019-07-02 06:01:43.221  INFO 10721 --- [           main] .SchemaDropperImpl$DelayedDropActionImpl : HHH000477: Starting delayed drop of schema as part of SessionFactory shut-down'
02-Jul-2019 06:01:43 2019-07-02 06:01:43.221  INFO 10721 --- [           main] o.s.j.d.e.EmbeddedDatabaseFactory        : Shutting down embedded database: url='jdbc:h2:mem:testdb;DB_CLOSE_DELAY=-1;DB_CLOSE_ON_EXIT=false'
02-Jul-2019 06:01:43 [INFO] Tests run: 4, Failures: 0, Errors: 0, Skipped: 0, Time elapsed: 2.503 s - in org.springframework.cloud.dataflow.server.controller.RuntimeAppsControllerTests
02-Jul-2019 06:01:43 [INFO] Running org.springframework.cloud.dataflow.server.controller.AboutControllerTests$ChecksumDisabledTests
02-Jul-2019 06:01:43 2019-07-02 06:01:43.223  INFO 10721 --- [           main] o.s.t.c.support.AbstractContextLoader    : Could not detect default resource locations for test class [org.springframework.cloud.dataflow.server.controller.AboutControllerTests$ChecksumDisabledTests]: no resource found for suffixes {-context.xml, Context.groovy}.
02-Jul-2019 06:01:43   ____                              ____ _                __
02-Jul-2019 06:01:43 / ___| _ __  _ __(_)_ __   __ _   / ___| | ___  _   _  __| |
02-Jul-2019 06:01:43 \___ \| '_ \| '__| | '_ \ / _` | | |   | |/ _ \| | | |/ _` |
02-Jul-2019 06:01:43   ___) | |_) | |  | | | | | (_| | | |___| | (_) | |_| | (_| |
02-Jul-2019 06:01:43 |____/| .__/|_|  |_|_| |_|\__, |  \____|_|\___/ \__,_|\__,_|
02-Jul-2019 06:01:43   ____ |_|    _          __|___/                 __________
02-Jul-2019 06:01:43 |  _ \  __ _| |_ __ _  |  ___| | _____      __  \ \ \ \ \ \
02-Jul-2019 06:01:43 | | | |/ _` | __/ _` | | |_  | |/ _ \ \ /\ / /   \ \ \ \ \ \
02-Jul-2019 06:01:43 | |_| | (_| | || (_| | |  _| | | (_) \ V  V /    / / / / / /
02-Jul-2019 06:01:43 |____/ \__,_|\__\__,_| |_|   |_|\___/ \_/\_/    /_/_/_/_/_/
02-Jul-2019 06:01:43
02-Jul-2019 06:01:43
02-Jul-2019 06:01:43
02-Jul-2019 06:01:43 2019-07-02 06:01:43.416  INFO 10721 --- [           main] c.c.c.ConfigServicePropertySourceLocator : Fetching config from server at: http://localhost:8888
02-Jul-2019 06:01:43 2019-07-02 06:01:43.417  WARN 10721 --- [           main] c.c.c.ConfigServicePropertySourceLocator : Could not locate PropertySource: I/O error on GET request for "http://localhost:8888/application/default": Connection refused (Connection refused); nested exception is java.net.ConnectException: Connection refused (Connection refused)
02-Jul-2019 06:01:43 2019-07-02 06:01:43.419  INFO 10721 --- [           main] outControllerTests$ChecksumDisabledTests : No active profile set, falling back to default profiles: default
02-Jul-2019 06:01:43 2019-07-02 06:01:43.445  INFO 10721 --- [           main] .s.d.r.c.RepositoryConfigurationDelegate : Multiple Spring Data modules found, entering strict repository configuration mode!
02-Jul-2019 06:01:43 2019-07-02 06:01:43.546  INFO 10721 --- [           main] o.s.j.d.e.EmbeddedDatabaseFactory        : Starting embedded database: url='jdbc:h2:mem:testdb;DB_CLOSE_DELAY=-1;DB_CLOSE_ON_EXIT=false', username='sa'
02-Jul-2019 06:01:43 2019-07-02 06:01:43.573  INFO 10721 --- [           main] j.LocalContainerEntityManagerFactoryBean : Building JPA container EntityManagerFactory for persistence unit 'default'
02-Jul-2019 06:01:43 2019-07-02 06:01:43.574  INFO 10721 --- [           main] o.hibernate.jpa.internal.util.LogHelper  : HHH000204: Processing PersistenceUnitInfo [
02-Jul-2019 06:01:43         name: default
02-Jul-2019 06:01:43         ...]
02-Jul-2019 06:01:43 2019-07-02 06:01:43.578  INFO 10721 --- [           main] org.hibernate.dialect.Dialect            : HHH000400: Using dialect: org.hibernate.dialect.H2Dialect
02-Jul-2019 06:01:43 2019-07-02 06:01:43.593  INFO 10721 --- [           main] o.h.t.schema.internal.SchemaCreatorImpl  : HHH000476: Executing import script 'org.hibernate.tool.schema.internal.exec.ScriptSourceInputNonExistentImpl@2c6799fe'
02-Jul-2019 06:01:43 2019-07-02 06:01:43.593  INFO 10721 --- [           main] j.LocalContainerEntityManagerFactoryBean : Initialized JPA EntityManagerFactory for persistence unit 'default'
02-Jul-2019 06:01:43 2019-07-02 06:01:43.749  INFO 10721 --- [           main] o.s.c.d.s.c.support.MetricStore          : Metrics Collector URI = []
02-Jul-2019 06:01:43 2019-07-02 06:01:43.812  INFO 10721 --- [           main] outControllerTests$ChecksumDisabledTests : Started AboutControllerTests.ChecksumDisabledTests in 0.582 seconds (JVM running for 159.031)
02-Jul-2019 06:01:43 2019-07-02 06:01:43.814  INFO 10721 --- [           main] junit.logTestName                        : Starting Test testChecksumDisabled
02-Jul-2019 06:01:43 2019-07-02 06:01:43.815  INFO 10721 --- [           main] o.s.t.web.servlet.TestDispatcherServlet  : FrameworkServlet '': initialization started
02-Jul-2019 06:01:43 2019-07-02 06:01:43.818  INFO 10721 --- [           main] o.s.t.web.servlet.TestDispatcherServlet  : FrameworkServlet '': initialization completed in 3 ms
02-Jul-2019 06:01:43
02-Jul-2019 06:01:43 MockHttpServletRequest:
02-Jul-2019 06:01:43       HTTP Method = GET
02-Jul-2019 06:01:43       Request URI = /about
02-Jul-2019 06:01:43        Parameters = {}
02-Jul-2019 06:01:43           Headers = {Accept=[application/json]}
02-Jul-2019 06:01:43
02-Jul-2019 06:01:43 Handler:
02-Jul-2019 06:01:43              Type = org.springframework.cloud.dataflow.server.controller.AboutController
02-Jul-2019 06:01:43            Method = public org.springframework.cloud.dataflow.rest.resource.about.AboutResource org.springframework.cloud.dataflow.server.controller.AboutController.getAboutResource()
02-Jul-2019 06:01:43
02-Jul-2019 06:01:43 Async:
02-Jul-2019 06:01:43     Async started = false
02-Jul-2019 06:01:43      Async result = null
02-Jul-2019 06:01:43
02-Jul-2019 06:01:43 Resolved Exception:
02-Jul-2019 06:01:43              Type = null
02-Jul-2019 06:01:43
02-Jul-2019 06:01:43 ModelAndView:
02-Jul-2019 06:01:43         View name = null
02-Jul-2019 06:01:43              View = null
02-Jul-2019 06:01:43             Model = null
02-Jul-2019 06:01:43
02-Jul-2019 06:01:43 FlashMap:
02-Jul-2019 06:01:43        Attributes = null
02-Jul-2019 06:01:43
02-Jul-2019 06:01:43 MockHttpServletResponse:
02-Jul-2019 06:01:43            Status = 200
02-Jul-2019 06:01:43     Error message = null
02-Jul-2019 06:01:43           Headers = {Content-Type=[application/json;charset=UTF-8]}
02-Jul-2019 06:01:43      Content type = application/json;charset=UTF-8
02-Jul-2019 06:01:43              Body = {"featureInfo":{"analyticsEnabled":true,"streamsEnabled":true,"tasksEnabled":true,"skipperEnabled":false,"schedulerEnabled":false},"versionInfo":{"implementation":{"name":"${info.app.name}","version":"${info.app.version}"},"core":{"name":"Spring Cloud Data Flow Core","version":"1.7.5.BUILD-SNAPSHOT"},"dashboard":{"name":"Spring Cloud Dataflow UI","version":"1.7.3.RELEASE"},"shell":{"name":"Spring Cloud Data Flow Shell","version":"1.2.3.SHELL.TEST","url":"https://repo.spring.io/libs-milestone/org/springframework/cloud/spring-cloud-dataflow-shell/1.3.0.BUILD-SNAPSHOT/spring-cloud-dataflow-shell-1.3.0.BUILD-SNAPSHOT.jsdfasdf"}},"securityInfo":{"authenticationEnabled":false,"authorizationEnabled":false,"formLogin":false,"authenticated":false,"username":null,"roles":[]},"runtimeEnvironment":{"appDeployer":{"deployerImplementationVersion":"testAppDepImplementationVersion","deployerName":"testAppDepImplementationName","deployerSpiVersion":"1.8.0_212","javaVersion":"1.8.0_212","platformApiVersion":"testAppDepPlatformApiVersion","platformClientVersion":"testAppDepPlatformClientVersion","platformHostVersion":"testAppDepPlatformHostVersion","platformSpecificInfo":{},"platformType":"testAppDepPlatformType","springBootVersion":"1.5.16.RELEASE","springVersion":"4.3.19.RELEASE"},"taskLauncher":{"deployerImplementationVersion":"testTaskDepImplementationVersion","deployerName":"testTaskDepImplementationName","deployerSpiVersion":"1.8.0_212","javaVersion":"1.8.0_212","platformApiVersion":"testTaskDepPlatformApiVersion","platformClientVersion":"testTaskDepPlatformClientVersion","platformHostVersion":"testTaskDepPlatformHostVersion","platformSpecificInfo":{},"platformType":"testTaskDepPlatformType","springBootVersion":"1.5.16.RELEASE","springVersion":"4.3.19.RELEASE"}},"links":[{"rel":"self","href":"http://localhost/about"}]}
02-Jul-2019 06:01:43     Forwarded URL = null
02-Jul-2019 06:01:43    Redirected URL = null
02-Jul-2019 06:01:43           Cookies = []
02-Jul-2019 06:01:43 2019-07-02 06:01:43.825  INFO 10721 --- [           main] j.LocalContainerEntityManagerFactoryBean : Closing JPA EntityManagerFactory for persistence unit 'default'
02-Jul-2019 06:01:43 2019-07-02 06:01:43.825  INFO 10721 --- [           main] .SchemaDropperImpl$DelayedDropActionImpl : HHH000477: Starting delayed drop of schema as part of SessionFactory shut-down'
02-Jul-2019 06:01:43 2019-07-02 06:01:43.826  INFO 10721 --- [           main] o.s.j.d.e.EmbeddedDatabaseFactory        : Shutting down embedded database: url='jdbc:h2:mem:testdb;DB_CLOSE_DELAY=-1;DB_CLOSE_ON_EXIT=false'
02-Jul-2019 06:01:43 2019-07-02 06:01:43.826  INFO 10721 --- [           main] junit.logTestName                        : Finished Test testChecksumDisabled
02-Jul-2019 06:01:43 [INFO] Tests run: 1, Failures: 0, Errors: 0, Skipped: 0, Time elapsed: 0.61 s - in org.springframework.cloud.dataflow.server.controller.AboutControllerTests$ChecksumDisabledTests
02-Jul-2019 06:01:43 [INFO] Running org.springframework.cloud.dataflow.server.controller.TaskExecutionControllerTests
02-Jul-2019 06:01:43 2019-07-02 06:01:43.827  INFO 10721 --- [           main] o.s.t.c.support.AbstractContextLoader    : Could not detect default resource locations for test class [org.springframework.cloud.dataflow.server.controller.TaskExecutionControllerTests]: no resource found for suffixes {-context.xml, Context.groovy}.
02-Jul-2019 06:01:44   ____                              ____ _                __
02-Jul-2019 06:01:44 / ___| _ __  _ __(_)_ __   __ _   / ___| | ___  _   _  __| |
02-Jul-2019 06:01:44 \___ \| '_ \| '__| | '_ \ / _` | | |   | |/ _ \| | | |/ _` |
02-Jul-2019 06:01:44   ___) | |_) | |  | | | | | (_| | | |___| | (_) | |_| | (_| |
02-Jul-2019 06:01:44 |____/| .__/|_|  |_|_| |_|\__, |  \____|_|\___/ \__,_|\__,_|
02-Jul-2019 06:01:44   ____ |_|    _          __|___/                 __________
02-Jul-2019 06:01:44 |  _ \  __ _| |_ __ _  |  ___| | _____      __  \ \ \ \ \ \
02-Jul-2019 06:01:44 | | | |/ _` | __/ _` | | |_  | |/ _ \ \ /\ / /   \ \ \ \ \ \
02-Jul-2019 06:01:44 | |_| | (_| | || (_| | |  _| | | (_) \ V  V /    / / / / / /
02-Jul-2019 06:01:44 |____/ \__,_|\__\__,_| |_|   |_|\___/ \_/\_/    /_/_/_/_/_/
02-Jul-2019 06:01:44
02-Jul-2019 06:01:44
02-Jul-2019 06:01:44
02-Jul-2019 06:01:44 2019-07-02 06:01:44.018  INFO 10721 --- [           main] c.c.c.ConfigServicePropertySourceLocator : Fetching config from server at: http://localhost:8888
02-Jul-2019 06:01:44 2019-07-02 06:01:44.021  WARN 10721 --- [           main] c.c.c.ConfigServicePropertySourceLocator : Could not locate PropertySource: I/O error on GET request for "http://localhost:8888/application/default": Connection refused (Connection refused); nested exception is java.net.ConnectException: Connection refused (Connection refused)
02-Jul-2019 06:01:44 2019-07-02 06:01:44.022  INFO 10721 --- [           main] o.s.c.d.s.c.TaskExecutionControllerTests : No active profile set, falling back to default profiles: default
02-Jul-2019 06:01:44 2019-07-02 06:01:44.047  INFO 10721 --- [           main] .s.d.r.c.RepositoryConfigurationDelegate : Multiple Spring Data modules found, entering strict repository configuration mode!
02-Jul-2019 06:01:44 2019-07-02 06:01:44.135  INFO 10721 --- [           main] o.s.j.d.e.EmbeddedDatabaseFactory        : Starting embedded database: url='jdbc:h2:mem:testdb;DB_CLOSE_DELAY=-1;DB_CLOSE_ON_EXIT=false', username='sa'
02-Jul-2019 06:01:44 2019-07-02 06:01:44.161  INFO 10721 --- [           main] j.LocalContainerEntityManagerFactoryBean : Building JPA container EntityManagerFactory for persistence unit 'default'
02-Jul-2019 06:01:44 2019-07-02 06:01:44.161  INFO 10721 --- [           main] o.hibernate.jpa.internal.util.LogHelper  : HHH000204: Processing PersistenceUnitInfo [
02-Jul-2019 06:01:44         name: default
02-Jul-2019 06:01:44         ...]
02-Jul-2019 06:01:44 2019-07-02 06:01:44.166  INFO 10721 --- [           main] org.hibernate.dialect.Dialect            : HHH000400: Using dialect: org.hibernate.dialect.H2Dialect
02-Jul-2019 06:01:44 2019-07-02 06:01:44.180  INFO 10721 --- [           main] o.h.t.schema.internal.SchemaCreatorImpl  : HHH000476: Executing import script 'org.hibernate.tool.schema.internal.exec.ScriptSourceInputNonExistentImpl@2c6799fe'
02-Jul-2019 06:01:44 2019-07-02 06:01:44.181  INFO 10721 --- [           main] j.LocalContainerEntityManagerFactoryBean : Initialized JPA EntityManagerFactory for persistence unit 'default'
02-Jul-2019 06:01:44 2019-07-02 06:01:44.301  INFO 10721 --- [           main] o.s.b.c.r.s.JobRepositoryFactoryBean     : No database type set, using meta data indicating: H2
02-Jul-2019 06:01:44 2019-07-02 06:01:44.304  INFO 10721 --- [           main] o.s.b.a.s.SimpleJobServiceFactoryBean    : No database type set, using meta data indicating: H2
02-Jul-2019 06:01:44 2019-07-02 06:01:44.318  INFO 10721 --- [           main] o.s.jdbc.datasource.init.ScriptUtils     : Executing SQL script from class path resource [org/springframework/cloud/task/schema-h2.sql]
02-Jul-2019 06:01:44 2019-07-02 06:01:44.322  INFO 10721 --- [           main] o.s.jdbc.datasource.init.ScriptUtils     : Executed SQL script from class path resource [org/springframework/cloud/task/schema-h2.sql] in 4 ms.
02-Jul-2019 06:01:44 2019-07-02 06:01:44.326  INFO 10721 --- [           main] o.s.jdbc.datasource.init.ScriptUtils     : Executing SQL script from class path resource [org/springframework/batch/core/schema-h2.sql]
02-Jul-2019 06:01:44 2019-07-02 06:01:44.330  INFO 10721 --- [           main] o.s.jdbc.datasource.init.ScriptUtils     : Executed SQL script from class path resource [org/springframework/batch/core/schema-h2.sql] in 3 ms.
02-Jul-2019 06:01:44 2019-07-02 06:01:44.373  INFO 10721 --- [           main] o.s.c.d.s.c.TaskExecutionControllerTests : Started TaskExecutionControllerTests in 0.537 seconds (JVM running for 159.593)
02-Jul-2019 06:01:44 2019-07-02 06:01:44.382  INFO 10721 --- [           main] o.s.t.web.servlet.TestDispatcherServlet  : FrameworkServlet '': initialization started
02-Jul-2019 06:01:44 2019-07-02 06:01:44.387  INFO 10721 --- [           main] o.s.t.web.servlet.TestDispatcherServlet  : FrameworkServlet '': initialization completed in 5 ms
02-Jul-2019 06:01:44 2019-07-02 06:01:44.423  INFO 10721 --- [           main] o.s.t.web.servlet.TestDispatcherServlet  : FrameworkServlet '': initialization started
02-Jul-2019 06:01:44 2019-07-02 06:01:44.425  INFO 10721 --- [           main] o.s.t.web.servlet.TestDispatcherServlet  : FrameworkServlet '': initialization completed in 2 ms
02-Jul-2019 06:01:44 2019-07-02 06:01:44.433  INFO 10721 --- [           main] o.s.t.web.servlet.TestDispatcherServlet  : FrameworkServlet '': initialization started
02-Jul-2019 06:01:44 2019-07-02 06:01:44.435  INFO 10721 --- [           main] o.s.t.web.servlet.TestDispatcherServlet  : FrameworkServlet '': initialization completed in 1 ms
02-Jul-2019 06:01:44 2019-07-02 06:01:44.439  INFO 10721 --- [           main] o.s.t.web.servlet.TestDispatcherServlet  : FrameworkServlet '': initialization started
02-Jul-2019 06:01:44 2019-07-02 06:01:44.441  INFO 10721 --- [           main] o.s.t.web.servlet.TestDispatcherServlet  : FrameworkServlet '': initialization completed in 2 ms
02-Jul-2019 06:01:44 2019-07-02 06:01:44.444  INFO 10721 --- [           main] o.s.t.web.servlet.TestDispatcherServlet  : FrameworkServlet '': initialization started
02-Jul-2019 06:01:44 2019-07-02 06:01:44.446  INFO 10721 --- [           main] o.s.t.web.servlet.TestDispatcherServlet  : FrameworkServlet '': initialization completed in 2 ms
02-Jul-2019 06:01:44 2019-07-02 06:01:44.448  WARN 10721 --- [           main] o.s.c.d.s.c.RestControllerAdvice         : Caught exception while handling a request: Could not find TaskExecution with id 10
02-Jul-2019 06:01:44 2019-07-02 06:01:44.450  WARN 10721 --- [           main] .m.m.a.ExceptionHandlerExceptionResolver : Resolved [org.springframework.cloud.dataflow.server.repository.NoSuchTaskExecutionException: Could not find TaskExecution with id 10]
02-Jul-2019 06:01:44 2019-07-02 06:01:44.454  INFO 10721 --- [           main] o.s.t.web.servlet.TestDispatcherServlet  : FrameworkServlet '': initialization started
02-Jul-2019 06:01:44 2019-07-02 06:01:44.456  INFO 10721 --- [           main] o.s.t.web.servlet.TestDispatcherServlet  : FrameworkServlet '': initialization completed in 1 ms
02-Jul-2019 06:01:44 2019-07-02 06:01:44.458  WARN 10721 --- [           main] o.s.c.d.s.c.RestControllerAdvice         : Caught exception while handling a request: Could not find TaskExecution with id 1345345345345
02-Jul-2019 06:01:44 2019-07-02 06:01:44.459  WARN 10721 --- [           main] .m.m.a.ExceptionHandlerExceptionResolver : Resolved [org.springframework.cloud.dataflow.server.repository.NoSuchTaskExecutionException: Could not find TaskExecution with id 1345345345345]
02-Jul-2019 06:01:44 2019-07-02 06:01:44.463  INFO 10721 --- [           main] o.s.t.web.servlet.TestDispatcherServlet  : FrameworkServlet '': initialization started
02-Jul-2019 06:01:44 2019-07-02 06:01:44.465  INFO 10721 --- [           main] o.s.t.web.servlet.TestDispatcherServlet  : FrameworkServlet '': initialization completed in 2 ms
02-Jul-2019 06:01:44 2019-07-02 06:01:44.472  INFO 10721 --- [           main] o.s.t.web.servlet.TestDispatcherServlet  : FrameworkServlet '': initialization started
02-Jul-2019 06:01:44 2019-07-02 06:01:44.475  INFO 10721 --- [           main] o.s.t.web.servlet.TestDispatcherServlet  : FrameworkServlet '': initialization completed in 2 ms
02-Jul-2019 06:01:44 2019-07-02 06:01:44.485  INFO 10721 --- [           main] o.s.t.web.servlet.TestDispatcherServlet  : FrameworkServlet '': initialization started
02-Jul-2019 06:01:44 2019-07-02 06:01:44.487  INFO 10721 --- [           main] o.s.t.web.servlet.TestDispatcherServlet  : FrameworkServlet '': initialization completed in 2 ms
02-Jul-2019 06:01:44 2019-07-02 06:01:44.494  INFO 10721 --- [           main] o.s.t.web.servlet.TestDispatcherServlet  : FrameworkServlet '': initialization started
02-Jul-2019 06:01:44 2019-07-02 06:01:44.496  INFO 10721 --- [           main] o.s.t.web.servlet.TestDispatcherServlet  : FrameworkServlet '': initialization completed in 2 ms
02-Jul-2019 06:01:44 2019-07-02 06:01:44.498  WARN 10721 --- [           main] o.s.c.d.s.c.RestControllerAdvice         : Caught exception while handling a request: Could not find task definition named BAZ
02-Jul-2019 06:01:44 2019-07-02 06:01:44.499  WARN 10721 --- [           main] .m.m.a.ExceptionHandlerExceptionResolver : Resolved [org.springframework.cloud.dataflow.server.repository.NoSuchTaskDefinitionException: Could not find task definition named BAZ]
02-Jul-2019 06:01:44 2019-07-02 06:01:44.503  INFO 10721 --- [           main] o.s.t.web.servlet.TestDispatcherServlet  : FrameworkServlet '': initialization started
02-Jul-2019 06:01:44 2019-07-02 06:01:44.505  INFO 10721 --- [           main] o.s.t.web.servlet.TestDispatcherServlet  : FrameworkServlet '': initialization completed in 2 ms
02-Jul-2019 06:01:44 2019-07-02 06:01:44.512  INFO 10721 --- [           main] o.s.t.web.servlet.TestDispatcherServlet  : FrameworkServlet '': initialization started
02-Jul-2019 06:01:44 2019-07-02 06:01:44.514  INFO 10721 --- [           main] o.s.t.web.servlet.TestDispatcherServlet  : FrameworkServlet '': initialization completed in 2 ms
02-Jul-2019 06:01:44 2019-07-02 06:01:44.517  INFO 10721 --- [           main] j.LocalContainerEntityManagerFactoryBean : Closing JPA EntityManagerFactory for persistence unit 'default'
02-Jul-2019 06:01:44 2019-07-02 06:01:44.517  INFO 10721 --- [           main] .SchemaDropperImpl$DelayedDropActionImpl : HHH000477: Starting delayed drop of schema as part of SessionFactory shut-down'
02-Jul-2019 06:01:44 2019-07-02 06:01:44.518  INFO 10721 --- [           main] o.s.j.d.e.EmbeddedDatabaseFactory        : Shutting down embedded database: url='jdbc:h2:mem:testdb;DB_CLOSE_DELAY=-1;DB_CLOSE_ON_EXIT=false'
02-Jul-2019 06:01:44 [INFO] Tests run: 12, Failures: 0, Errors: 0, Skipped: 0, Time elapsed: 0.681 s - in org.springframework.cloud.dataflow.server.controller.TaskExecutionControllerTests
02-Jul-2019 06:01:44 [INFO] Running org.springframework.cloud.dataflow.server.completion.TabOnTapCompletionProviderTests
02-Jul-2019 06:01:44 2019-07-02 06:01:44.523  INFO 10721 --- [           main] o.s.t.c.support.AbstractContextLoader    : Could not detect default resource locations for test class [org.springframework.cloud.dataflow.server.completion.TabOnTapCompletionProviderTests]: no resource found for suffixes {-context.xml, Context.groovy}.
02-Jul-2019 06:01:44   ____                              ____ _                __
02-Jul-2019 06:01:44 / ___| _ __  _ __(_)_ __   __ _   / ___| | ___  _   _  __| |
02-Jul-2019 06:01:44 \___ \| '_ \| '__| | '_ \ / _` | | |   | |/ _ \| | | |/ _` |
02-Jul-2019 06:01:44   ___) | |_) | |  | | | | | (_| | | |___| | (_) | |_| | (_| |
02-Jul-2019 06:01:44 |____/| .__/|_|  |_|_| |_|\__, |  \____|_|\___/ \__,_|\__,_|
02-Jul-2019 06:01:44   ____ |_|    _          __|___/                 __________
02-Jul-2019 06:01:44 |  _ \  __ _| |_ __ _  |  ___| | _____      __  \ \ \ \ \ \
02-Jul-2019 06:01:44 | | | |/ _` | __/ _` | | |_  | |/ _ \ \ /\ / /   \ \ \ \ \ \
02-Jul-2019 06:01:44 | |_| | (_| | || (_| | |  _| | | (_) \ V  V /    / / / / / /
02-Jul-2019 06:01:44 |____/ \__,_|\__\__,_| |_|   |_|\___/ \_/\_/    /_/_/_/_/_/
02-Jul-2019 06:01:44
02-Jul-2019 06:01:44
02-Jul-2019 06:01:44
02-Jul-2019 06:01:44 2019-07-02 06:01:44.752  INFO 10721 --- [           main] c.c.c.ConfigServicePropertySourceLocator : Fetching config from server at: http://localhost:8888
02-Jul-2019 06:01:44 2019-07-02 06:01:44.753  WARN 10721 --- [           main] c.c.c.ConfigServicePropertySourceLocator : Could not locate PropertySource: I/O error on GET request for "http://localhost:8888/application/default": Connection refused (Connection refused); nested exception is java.net.ConnectException: Connection refused (Connection refused)
02-Jul-2019 06:01:44 2019-07-02 06:01:44.754  INFO 10721 --- [           main] .c.d.s.c.TabOnTapCompletionProviderTests : No active profile set, falling back to default profiles: default
02-Jul-2019 06:01:44 2019-07-02 06:01:44.802  INFO 10721 --- [           main] .c.d.s.c.TabOnTapCompletionProviderTests : Started TabOnTapCompletionProviderTests in 0.248 seconds (JVM running for 160.021)
02-Jul-2019 06:01:44 [INFO] Tests run: 3, Failures: 0, Errors: 0, Skipped: 0, Time elapsed: 0.232 s - in org.springframework.cloud.dataflow.server.completion.TabOnTapCompletionProviderTests
02-Jul-2019 06:01:44 [INFO] Running org.springframework.cloud.dataflow.server.stream.AppDeployerStreamDeployerTests
02-Jul-2019 06:01:44 [INFO] Tests run: 3, Failures: 0, Errors: 0, Skipped: 0, Time elapsed: 0.015 s - in org.springframework.cloud.dataflow.server.stream.AppDeployerStreamDeployerTests
02-Jul-2019 06:01:44 [INFO] Running org.springframework.cloud.dataflow.server.stream.SkipperStreamDeployerTests
02-Jul-2019 06:01:44 2019-07-02 06:01:44.837 ERROR 10721 --- [           main] o.s.c.d.s.stream.SkipperStreamDeployer   : Could not parse Skipper Platform Status JSON [blah]. Exception message = Unrecognized token 'blah': was expecting ('true', 'false' or 'null')
02-Jul-2019 06:01:44 at [Source: blah; line: 1, column: 9]
02-Jul-2019 06:01:44 2019-07-02 06:01:44.848  INFO 10721 --- [           main] o.s.c.d.s.stream.SkipperStreamDeployer   : Deploying Stream test1 using skipper.
02-Jul-2019 06:01:44 2019-07-02 06:01:44.851  INFO 10721 --- [           main] o.s.c.d.s.stream.SkipperStreamDeployer   : Deploying Stream test1 using skipper.
02-Jul-2019 06:01:44 2019-07-02 06:01:44.858  INFO 10721 --- [           main] o.s.c.d.s.stream.SkipperStreamDeployer   : Deploying Stream test1 using skipper.
02-Jul-2019 06:01:44 2019-07-02 06:01:44.858  INFO 10721 --- [           main] o.s.c.d.s.stream.SkipperStreamDeployer   : Deploying Stream test1 using skipper.
02-Jul-2019 06:01:44 2019-07-02 06:01:44.859  INFO 10721 --- [           main] o.s.c.d.s.stream.SkipperStreamDeployer   : Using platform 'testPlatform'
02-Jul-2019 06:01:44 2019-07-02 06:01:44.865  INFO 10721 --- [           main] o.s.c.d.s.stream.SkipperStreamDeployer   : Deploying Stream test1 using skipper.
02-Jul-2019 06:01:44 [INFO] Tests run: 18, Failures: 0, Errors: 0, Skipped: 0, Time elapsed: 0.043 s - in org.springframework.cloud.dataflow.server.stream.SkipperStreamDeployerTests
02-Jul-2019 06:01:44 [INFO] Running org.springframework.cloud.dataflow.server.stream.ResourceUtilsTests
02-Jul-2019 06:01:44 [ERROR] Tests run: 6, Failures: 1, Errors: 0, Skipped: 0, Time elapsed: 0.031 s <<< FAILURE! - in org.springframework.cloud.dataflow.server.stream.ResourceUtilsTests
02-Jul-2019 06:01:44 [ERROR] testFileResourceProcessing(org.springframework.cloud.dataflow.server.stream.ResourceUtilsTests)  Time elapsed: 0.014 s  <<< FAILURE!
02-Jul-2019 06:01:44 org.junit.ComparisonFailure: expected:<"http[]://springcloudstream...> but was:<"http[s]://springcloudstream...>
02-Jul-2019 06:01:44         at org.springframework.cloud.dataflow.server.stream.ResourceUtilsTests.testFileResourceProcessing(ResourceUtilsTests.java:84)
02-Jul-2019 06:01:44
02-Jul-2019 06:01:44 [INFO] Running org.springframework.cloud.dataflow.server.repository.support.SearchPageableTests
02-Jul-2019 06:01:44 [INFO] Tests run: 7, Failures: 0, Errors: 0, Skipped: 0, Time elapsed: 0.001 s - in org.springframework.cloud.dataflow.server.repository.support.SearchPageableTests
02-Jul-2019 06:01:44 [INFO] Running org.springframework.cloud.dataflow.server.repository.DeploymentKeyTests
02-Jul-2019 06:01:44 [INFO] Tests run: 2, Failures: 0, Errors: 0, Skipped: 0, Time elapsed: 0 s - in org.springframework.cloud.dataflow.server.repository.DeploymentKeyTests
02-Jul-2019 06:01:44 [INFO] Running org.springframework.cloud.dataflow.server.repository.TaskExecutionExplorerTests
02-Jul-2019 06:01:44 2019-07-02 06:01:44.911  INFO 10721 --- [           main] o.s.t.c.support.AbstractContextLoader    : Could not detect default resource locations for test class [org.springframework.cloud.dataflow.server.repository.TaskExecutionExplorerTests]: no resource found for suffixes {-context.xml, Context.groovy}.
02-Jul-2019 06:01:45   ____                              ____ _                __
02-Jul-2019 06:01:45 / ___| _ __  _ __(_)_ __   __ _   / ___| | ___  _   _  __| |
02-Jul-2019 06:01:45 \___ \| '_ \| '__| | '_ \ / _` | | |   | |/ _ \| | | |/ _` |
02-Jul-2019 06:01:45   ___) | |_) | |  | | | | | (_| | | |___| | (_) | |_| | (_| |
02-Jul-2019 06:01:45 |____/| .__/|_|  |_|_| |_|\__, |  \____|_|\___/ \__,_|\__,_|
02-Jul-2019 06:01:45   ____ |_|    _          __|___/                 __________
02-Jul-2019 06:01:45 |  _ \  __ _| |_ __ _  |  ___| | _____      __  \ \ \ \ \ \
02-Jul-2019 06:01:45 | | | |/ _` | __/ _` | | |_  | |/ _ \ \ /\ / /   \ \ \ \ \ \
02-Jul-2019 06:01:45 | |_| | (_| | || (_| | |  _| | | (_) \ V  V /    / / / / / /
02-Jul-2019 06:01:45 |____/ \__,_|\__\__,_| |_|   |_|\___/ \_/\_/    /_/_/_/_/_/
02-Jul-2019 06:01:45
02-Jul-2019 06:01:45
02-Jul-2019 06:01:45
02-Jul-2019 06:01:45 2019-07-02 06:01:45.107  INFO 10721 --- [           main] c.c.c.ConfigServicePropertySourceLocator : Fetching config from server at: http://localhost:8888
02-Jul-2019 06:01:45 2019-07-02 06:01:45.109  WARN 10721 --- [           main] c.c.c.ConfigServicePropertySourceLocator : Could not locate PropertySource: I/O error on GET request for "http://localhost:8888/application/default": Connection refused (Connection refused); nested exception is java.net.ConnectException: Connection refused (Connection refused)
02-Jul-2019 06:01:45 2019-07-02 06:01:45.111  INFO 10721 --- [           main] o.s.c.d.s.r.TaskExecutionExplorerTests   : No active profile set, falling back to default profiles: default
02-Jul-2019 06:01:45 2019-07-02 06:01:45.196  INFO 10721 --- [           main] o.s.j.d.e.EmbeddedDatabaseFactory        : Starting embedded database: url='jdbc:h2:mem:testdb;DB_CLOSE_DELAY=-1;DB_CLOSE_ON_EXIT=false', username='sa'
02-Jul-2019 06:01:45 2019-07-02 06:01:45.203  INFO 10721 --- [           main] o.s.jdbc.datasource.init.ScriptUtils     : Executing SQL script from class path resource [org/springframework/cloud/task/schema-h2.sql]
02-Jul-2019 06:01:45 2019-07-02 06:01:45.205  INFO 10721 --- [           main] o.s.jdbc.datasource.init.ScriptUtils     : Executed SQL script from class path resource [org/springframework/cloud/task/schema-h2.sql] in 1 ms.
02-Jul-2019 06:01:45 2019-07-02 06:01:45.222  INFO 10721 --- [           main] o.s.c.d.s.r.s.DataflowRdbmsInitializer   : Adding dataflow schema classpath:schemas/h2/common.sql for h2 database
02-Jul-2019 06:01:45 2019-07-02 06:01:45.223  INFO 10721 --- [           main] o.s.c.d.s.r.s.DataflowRdbmsInitializer   : Adding dataflow schema classpath:schemas/h2/streams.sql for h2 database
02-Jul-2019 06:01:45 2019-07-02 06:01:45.223  INFO 10721 --- [           main] o.s.c.d.s.r.s.DataflowRdbmsInitializer   : Adding dataflow schema classpath:schemas/h2/tasks.sql for h2 database
02-Jul-2019 06:01:45 2019-07-02 06:01:45.223  INFO 10721 --- [           main] o.s.c.d.s.r.s.DataflowRdbmsInitializer   : Adding dataflow schema classpath:schemas/h2/deployment.sql for h2 database
02-Jul-2019 06:01:45 2019-07-02 06:01:45.223  INFO 10721 --- [           main] o.s.c.d.s.r.s.DataflowRdbmsInitializer   : Adding dataflow schema classpath:schemas/h2/jpa.sql for h2 database
02-Jul-2019 06:01:45 2019-07-02 06:01:45.224  INFO 10721 --- [           main] o.s.jdbc.datasource.init.ScriptUtils     : Executing SQL script from class path resource [schemas/h2/common.sql]
02-Jul-2019 06:01:45 2019-07-02 06:01:45.224  INFO 10721 --- [           main] o.s.jdbc.datasource.init.ScriptUtils     : Executed SQL script from class path resource [schemas/h2/common.sql] in 0 ms.
02-Jul-2019 06:01:45 2019-07-02 06:01:45.224  INFO 10721 --- [           main] o.s.jdbc.datasource.init.ScriptUtils     : Executing SQL script from class path resource [schemas/h2/streams.sql]
02-Jul-2019 06:01:45 2019-07-02 06:01:45.225  INFO 10721 --- [           main] o.s.jdbc.datasource.init.ScriptUtils     : Executed SQL script from class path resource [schemas/h2/streams.sql] in 0 ms.
02-Jul-2019 06:01:45 2019-07-02 06:01:45.225  INFO 10721 --- [           main] o.s.jdbc.datasource.init.ScriptUtils     : Executing SQL script from class path resource [schemas/h2/tasks.sql]
02-Jul-2019 06:01:45 2019-07-02 06:01:45.226  INFO 10721 --- [           main] o.s.jdbc.datasource.init.ScriptUtils     : Executed SQL script from class path resource [schemas/h2/tasks.sql] in 1 ms.
02-Jul-2019 06:01:45 2019-07-02 06:01:45.226  INFO 10721 --- [           main] o.s.jdbc.datasource.init.ScriptUtils     : Executing SQL script from class path resource [schemas/h2/deployment.sql]
02-Jul-2019 06:01:45 2019-07-02 06:01:45.226  INFO 10721 --- [           main] o.s.jdbc.datasource.init.ScriptUtils     : Executed SQL script from class path resource [schemas/h2/deployment.sql] in 0 ms.
02-Jul-2019 06:01:45 2019-07-02 06:01:45.227  INFO 10721 --- [           main] o.s.jdbc.datasource.init.ScriptUtils     : Executing SQL script from class path resource [schemas/h2/jpa.sql]
02-Jul-2019 06:01:45 2019-07-02 06:01:45.227  INFO 10721 --- [           main] o.s.jdbc.datasource.init.ScriptUtils     : Executed SQL script from class path resource [schemas/h2/jpa.sql] in 0 ms.
02-Jul-2019 06:01:45 2019-07-02 06:01:45.233  INFO 10721 --- [           main] o.s.c.d.s.r.TaskExecutionExplorerTests   : Started TaskExecutionExplorerTests in 0.312 seconds (JVM running for 160.452)
02-Jul-2019 06:01:45 2019-07-02 06:01:45.246  INFO 10721 --- [           main] o.s.j.d.e.EmbeddedDatabaseFactory        : Shutting down embedded database: url='jdbc:h2:mem:testdb;DB_CLOSE_DELAY=-1;DB_CLOSE_ON_EXIT=false'
02-Jul-2019 06:01:45 [INFO] Tests run: 3, Failures: 0, Errors: 0, Skipped: 0, Time elapsed: 0.332 s - in org.springframework.cloud.dataflow.server.repository.TaskExecutionExplorerTests
02-Jul-2019 06:01:45 [INFO] Running org.springframework.cloud.dataflow.server.repository.RdbmsDeploymentIdRepositoryTests
02-Jul-2019 06:01:45 2019-07-02 06:01:45.247  INFO 10721 --- [           main] o.s.t.c.support.AbstractContextLoader    : Could not detect default resource locations for test class [org.springframework.cloud.dataflow.server.repository.RdbmsDeploymentIdRepositoryTests]: no resource found for suffixes {-context.xml, Context.groovy}.
02-Jul-2019 06:01:45   ____                              ____ _                __
02-Jul-2019 06:01:45 / ___| _ __  _ __(_)_ __   __ _   / ___| | ___  _   _  __| |
02-Jul-2019 06:01:45 \___ \| '_ \| '__| | '_ \ / _` | | |   | |/ _ \| | | |/ _` |
02-Jul-2019 06:01:45   ___) | |_) | |  | | | | | (_| | | |___| | (_) | |_| | (_| |
02-Jul-2019 06:01:45 |____/| .__/|_|  |_|_| |_|\__, |  \____|_|\___/ \__,_|\__,_|
02-Jul-2019 06:01:45   ____ |_|    _          __|___/                 __________
02-Jul-2019 06:01:45 |  _ \  __ _| |_ __ _  |  ___| | _____      __  \ \ \ \ \ \
02-Jul-2019 06:01:45 | | | |/ _` | __/ _` | | |_  | |/ _ \ \ /\ / /   \ \ \ \ \ \
02-Jul-2019 06:01:45 | |_| | (_| | || (_| | |  _| | | (_) \ V  V /    / / / / / /
02-Jul-2019 06:01:45 |____/ \__,_|\__\__,_| |_|   |_|\___/ \_/\_/    /_/_/_/_/_/
02-Jul-2019 06:01:45
02-Jul-2019 06:01:45
02-Jul-2019 06:01:45
02-Jul-2019 06:01:45 2019-07-02 06:01:45.437  INFO 10721 --- [           main] c.c.c.ConfigServicePropertySourceLocator : Fetching config from server at: http://localhost:8888
02-Jul-2019 06:01:45 2019-07-02 06:01:45.438  WARN 10721 --- [           main] c.c.c.ConfigServicePropertySourceLocator : Could not locate PropertySource: I/O error on GET request for "http://localhost:8888/application/default": Connection refused (Connection refused); nested exception is java.net.ConnectException: Connection refused (Connection refused)
02-Jul-2019 06:01:45 2019-07-02 06:01:45.439  INFO 10721 --- [           main] c.d.s.r.RdbmsDeploymentIdRepositoryTests : No active profile set, falling back to default profiles: default
02-Jul-2019 06:01:45 2019-07-02 06:01:45.513  INFO 10721 --- [           main] o.s.j.d.e.EmbeddedDatabaseFactory        : Starting embedded database: url='jdbc:h2:mem:testdb;DB_CLOSE_DELAY=-1;DB_CLOSE_ON_EXIT=false', username='sa'
02-Jul-2019 06:01:45 2019-07-02 06:01:45.533  INFO 10721 --- [           main] o.s.c.d.s.r.s.DataflowRdbmsInitializer   : Adding dataflow schema classpath:schemas/h2/common.sql for h2 database
02-Jul-2019 06:01:45 2019-07-02 06:01:45.533  INFO 10721 --- [           main] o.s.c.d.s.r.s.DataflowRdbmsInitializer   : Adding dataflow schema classpath:schemas/h2/streams.sql for h2 database
02-Jul-2019 06:01:45 2019-07-02 06:01:45.533  INFO 10721 --- [           main] o.s.c.d.s.r.s.DataflowRdbmsInitializer   : Adding dataflow schema classpath:schemas/h2/tasks.sql for h2 database
02-Jul-2019 06:01:45 2019-07-02 06:01:45.533  INFO 10721 --- [           main] o.s.c.d.s.r.s.DataflowRdbmsInitializer   : Adding dataflow schema classpath:schemas/h2/deployment.sql for h2 database
02-Jul-2019 06:01:45 2019-07-02 06:01:45.533  INFO 10721 --- [           main] o.s.c.d.s.r.s.DataflowRdbmsInitializer   : Adding dataflow schema classpath:schemas/h2/jpa.sql for h2 database
02-Jul-2019 06:01:45 2019-07-02 06:01:45.533  INFO 10721 --- [           main] o.s.jdbc.datasource.init.ScriptUtils     : Executing SQL script from class path resource [schemas/h2/common.sql]
02-Jul-2019 06:01:45 2019-07-02 06:01:45.534  INFO 10721 --- [           main] o.s.jdbc.datasource.init.ScriptUtils     : Executed SQL script from class path resource [schemas/h2/common.sql] in 1 ms.
02-Jul-2019 06:01:45 2019-07-02 06:01:45.534  INFO 10721 --- [           main] o.s.jdbc.datasource.init.ScriptUtils     : Executing SQL script from class path resource [schemas/h2/streams.sql]
02-Jul-2019 06:01:45 2019-07-02 06:01:45.534  INFO 10721 --- [           main] o.s.jdbc.datasource.init.ScriptUtils     : Executed SQL script from class path resource [schemas/h2/streams.sql] in 0 ms.
02-Jul-2019 06:01:45 2019-07-02 06:01:45.534  INFO 10721 --- [           main] o.s.jdbc.datasource.init.ScriptUtils     : Executing SQL script from class path resource [schemas/h2/tasks.sql]
02-Jul-2019 06:01:45 2019-07-02 06:01:45.534  INFO 10721 --- [           main] o.s.jdbc.datasource.init.ScriptUtils     : Executed SQL script from class path resource [schemas/h2/tasks.sql] in 0 ms.
02-Jul-2019 06:01:45 2019-07-02 06:01:45.534  INFO 10721 --- [           main] o.s.jdbc.datasource.init.ScriptUtils     : Executing SQL script from class path resource [schemas/h2/deployment.sql]
02-Jul-2019 06:01:45 2019-07-02 06:01:45.534  INFO 10721 --- [           main] o.s.jdbc.datasource.init.ScriptUtils     : Executed SQL script from class path resource [schemas/h2/deployment.sql] in 0 ms.
02-Jul-2019 06:01:45 2019-07-02 06:01:45.534  INFO 10721 --- [           main] o.s.jdbc.datasource.init.ScriptUtils     : Executing SQL script from class path resource [schemas/h2/jpa.sql]
02-Jul-2019 06:01:45 2019-07-02 06:01:45.535  INFO 10721 --- [           main] o.s.jdbc.datasource.init.ScriptUtils     : Executed SQL script from class path resource [schemas/h2/jpa.sql] in 0 ms.
02-Jul-2019 06:01:45 2019-07-02 06:01:45.539  INFO 10721 --- [           main] c.d.s.r.RdbmsDeploymentIdRepositoryTests : Started RdbmsDeploymentIdRepositoryTests in 0.285 seconds (JVM running for 160.758)
02-Jul-2019 06:01:45 [INFO] Tests run: 2, Failures: 0, Errors: 0, Skipped: 0, Time elapsed: 0.295 s - in org.springframework.cloud.dataflow.server.repository.RdbmsDeploymentIdRepositoryTests
02-Jul-2019 06:01:45 [INFO] Running org.springframework.cloud.dataflow.server.repository.RdbmsTaskDefinitionRepositoryTests
02-Jul-2019 06:01:45 2019-07-02 06:01:45.545  INFO 10721 --- [           main] o.s.t.c.support.AbstractContextLoader    : Could not detect default resource locations for test class [org.springframework.cloud.dataflow.server.repository.RdbmsTaskDefinitionRepositoryTests]: no resource found for suffixes {-context.xml, Context.groovy}.
02-Jul-2019 06:01:45   ____                              ____ _                __
02-Jul-2019 06:01:45 / ___| _ __  _ __(_)_ __   __ _   / ___| | ___  _   _  __| |
02-Jul-2019 06:01:45 \___ \| '_ \| '__| | '_ \ / _` | | |   | |/ _ \| | | |/ _` |
02-Jul-2019 06:01:45   ___) | |_) | |  | | | | | (_| | | |___| | (_) | |_| | (_| |
02-Jul-2019 06:01:45 |____/| .__/|_|  |_|_| |_|\__, |  \____|_|\___/ \__,_|\__,_|
02-Jul-2019 06:01:45   ____ |_|    _          __|___/                 __________
02-Jul-2019 06:01:45 |  _ \  __ _| |_ __ _  |  ___| | _____      __  \ \ \ \ \ \
02-Jul-2019 06:01:45 | | | |/ _` | __/ _` | | |_  | |/ _ \ \ /\ / /   \ \ \ \ \ \
02-Jul-2019 06:01:45 | |_| | (_| | || (_| | |  _| | | (_) \ V  V /    / / / / / /
02-Jul-2019 06:01:45 |____/ \__,_|\__\__,_| |_|   |_|\___/ \_/\_/    /_/_/_/_/_/
02-Jul-2019 06:01:45
02-Jul-2019 06:01:45
02-Jul-2019 06:01:45
02-Jul-2019 06:01:45 2019-07-02 06:01:45.734  INFO 10721 --- [           main] c.c.c.ConfigServicePropertySourceLocator : Fetching config from server at: http://localhost:8888
02-Jul-2019 06:01:45 2019-07-02 06:01:45.735  WARN 10721 --- [           main] c.c.c.ConfigServicePropertySourceLocator : Could not locate PropertySource: I/O error on GET request for "http://localhost:8888/application/default": Connection refused (Connection refused); nested exception is java.net.ConnectException: Connection refused (Connection refused)
02-Jul-2019 06:01:45 2019-07-02 06:01:45.736  INFO 10721 --- [           main] d.s.r.RdbmsTaskDefinitionRepositoryTests : No active profile set, falling back to default profiles: default
02-Jul-2019 06:01:45 2019-07-02 06:01:45.838  INFO 10721 --- [           main] o.s.j.d.e.EmbeddedDatabaseFactory        : Starting embedded database: url='jdbc:h2:mem:testdb;DB_CLOSE_DELAY=-1;DB_CLOSE_ON_EXIT=false', username='sa'
02-Jul-2019 06:01:45 2019-07-02 06:01:45.840  INFO 10721 --- [           main] o.s.jdbc.datasource.init.ScriptUtils     : Executing SQL script from class path resource [org/springframework/cloud/task/schema-h2.sql]
02-Jul-2019 06:01:45 2019-07-02 06:01:45.841  INFO 10721 --- [           main] o.s.jdbc.datasource.init.ScriptUtils     : Executed SQL script from class path resource [org/springframework/cloud/task/schema-h2.sql] in 1 ms.
02-Jul-2019 06:01:45 2019-07-02 06:01:45.859  INFO 10721 --- [           main] o.s.c.d.s.r.s.DataflowRdbmsInitializer   : Adding dataflow schema classpath:schemas/h2/common.sql for h2 database
02-Jul-2019 06:01:45 2019-07-02 06:01:45.859  INFO 10721 --- [           main] o.s.c.d.s.r.s.DataflowRdbmsInitializer   : Adding dataflow schema classpath:schemas/h2/streams.sql for h2 database
02-Jul-2019 06:01:45 2019-07-02 06:01:45.859  INFO 10721 --- [           main] o.s.c.d.s.r.s.DataflowRdbmsInitializer   : Adding dataflow schema classpath:schemas/h2/tasks.sql for h2 database
02-Jul-2019 06:01:45 2019-07-02 06:01:45.859  INFO 10721 --- [           main] o.s.c.d.s.r.s.DataflowRdbmsInitializer   : Adding dataflow schema classpath:schemas/h2/deployment.sql for h2 database
02-Jul-2019 06:01:45 2019-07-02 06:01:45.859  INFO 10721 --- [           main] o.s.c.d.s.r.s.DataflowRdbmsInitializer   : Adding dataflow schema classpath:schemas/h2/jpa.sql for h2 database
02-Jul-2019 06:01:45 2019-07-02 06:01:45.859  INFO 10721 --- [           main] o.s.jdbc.datasource.init.ScriptUtils     : Executing SQL script from class path resource [schemas/h2/common.sql]
02-Jul-2019 06:01:45 2019-07-02 06:01:45.860  INFO 10721 --- [           main] o.s.jdbc.datasource.init.ScriptUtils     : Executed SQL script from class path resource [schemas/h2/common.sql] in 1 ms.
02-Jul-2019 06:01:45 2019-07-02 06:01:45.860  INFO 10721 --- [           main] o.s.jdbc.datasource.init.ScriptUtils     : Executing SQL script from class path resource [schemas/h2/streams.sql]
02-Jul-2019 06:01:45 2019-07-02 06:01:45.860  INFO 10721 --- [           main] o.s.jdbc.datasource.init.ScriptUtils     : Executed SQL script from class path resource [schemas/h2/streams.sql] in 0 ms.
02-Jul-2019 06:01:45 2019-07-02 06:01:45.860  INFO 10721 --- [           main] o.s.jdbc.datasource.init.ScriptUtils     : Executing SQL script from class path resource [schemas/h2/tasks.sql]
02-Jul-2019 06:01:45 2019-07-02 06:01:45.860  INFO 10721 --- [           main] o.s.jdbc.datasource.init.ScriptUtils     : Executed SQL script from class path resource [schemas/h2/tasks.sql] in 0 ms.
02-Jul-2019 06:01:45 2019-07-02 06:01:45.860  INFO 10721 --- [           main] o.s.jdbc.datasource.init.ScriptUtils     : Executing SQL script from class path resource [schemas/h2/deployment.sql]
02-Jul-2019 06:01:45 2019-07-02 06:01:45.860  INFO 10721 --- [           main] o.s.jdbc.datasource.init.ScriptUtils     : Executed SQL script from class path resource [schemas/h2/deployment.sql] in 0 ms.
02-Jul-2019 06:01:45 2019-07-02 06:01:45.860  INFO 10721 --- [           main] o.s.jdbc.datasource.init.ScriptUtils     : Executing SQL script from class path resource [schemas/h2/jpa.sql]
02-Jul-2019 06:01:45 2019-07-02 06:01:45.861  INFO 10721 --- [           main] o.s.jdbc.datasource.init.ScriptUtils     : Executed SQL script from class path resource [schemas/h2/jpa.sql] in 1 ms.
02-Jul-2019 06:01:45 2019-07-02 06:01:45.866  INFO 10721 --- [           main] d.s.r.RdbmsTaskDefinitionRepositoryTests : Started RdbmsTaskDefinitionRepositoryTests in 0.314 seconds (JVM running for 161.085)
02-Jul-2019 06:01:45 [INFO] Tests run: 28, Failures: 0, Errors: 0, Skipped: 0, Time elapsed: 0.396 s - in org.springframework.cloud.dataflow.server.repository.RdbmsTaskDefinitionRepositoryTests
02-Jul-2019 06:01:45 [INFO] Running org.springframework.cloud.dataflow.server.repository.RdbmsStreamDefinitionRepositoryTests
02-Jul-2019 06:01:45 2019-07-02 06:01:45.945  INFO 10721 --- [           main] o.s.t.c.support.AbstractContextLoader    : Could not detect default resource locations for test class [org.springframework.cloud.dataflow.server.repository.RdbmsStreamDefinitionRepositoryTests]: no resource found for suffixes {-context.xml, Context.groovy}.
02-Jul-2019 06:01:46   ____                              ____ _                __
02-Jul-2019 06:01:46 / ___| _ __  _ __(_)_ __   __ _   / ___| | ___  _   _  __| |
02-Jul-2019 06:01:46 \___ \| '_ \| '__| | '_ \ / _` | | |   | |/ _ \| | | |/ _` |
02-Jul-2019 06:01:46   ___) | |_) | |  | | | | | (_| | | |___| | (_) | |_| | (_| |
02-Jul-2019 06:01:46 |____/| .__/|_|  |_|_| |_|\__, |  \____|_|\___/ \__,_|\__,_|
02-Jul-2019 06:01:46   ____ |_|    _          __|___/                 __________
02-Jul-2019 06:01:46 |  _ \  __ _| |_ __ _  |  ___| | _____      __  \ \ \ \ \ \
02-Jul-2019 06:01:46 | | | |/ _` | __/ _` | | |_  | |/ _ \ \ /\ / /   \ \ \ \ \ \
02-Jul-2019 06:01:46 | |_| | (_| | || (_| | |  _| | | (_) \ V  V /    / / / / / /
02-Jul-2019 06:01:46 |____/ \__,_|\__\__,_| |_|   |_|\___/ \_/\_/    /_/_/_/_/_/
02-Jul-2019 06:01:46
02-Jul-2019 06:01:46
02-Jul-2019 06:01:46
02-Jul-2019 06:01:46 2019-07-02 06:01:46.133  INFO 10721 --- [           main] c.c.c.ConfigServicePropertySourceLocator : Fetching config from server at: http://localhost:8888
02-Jul-2019 06:01:46 2019-07-02 06:01:46.134  WARN 10721 --- [           main] c.c.c.ConfigServicePropertySourceLocator : Could not locate PropertySource: I/O error on GET request for "http://localhost:8888/application/default": Connection refused (Connection refused); nested exception is java.net.ConnectException: Connection refused (Connection refused)
02-Jul-2019 06:01:46 2019-07-02 06:01:46.136  INFO 10721 --- [           main] s.r.RdbmsStreamDefinitionRepositoryTests : No active profile set, falling back to default profiles: default
02-Jul-2019 06:01:46 2019-07-02 06:01:46.236  INFO 10721 --- [           main] o.s.j.d.e.EmbeddedDatabaseFactory        : Starting embedded database: url='jdbc:h2:mem:testdb;DB_CLOSE_DELAY=-1;DB_CLOSE_ON_EXIT=false', username='sa'
02-Jul-2019 06:01:46 2019-07-02 06:01:46.254  INFO 10721 --- [           main] o.s.c.d.s.r.s.DataflowRdbmsInitializer   : Adding dataflow schema classpath:schemas/h2/common.sql for h2 database
02-Jul-2019 06:01:46 2019-07-02 06:01:46.254  INFO 10721 --- [           main] o.s.c.d.s.r.s.DataflowRdbmsInitializer   : Adding dataflow schema classpath:schemas/h2/streams.sql for h2 database
02-Jul-2019 06:01:46 2019-07-02 06:01:46.254  INFO 10721 --- [           main] o.s.c.d.s.r.s.DataflowRdbmsInitializer   : Adding dataflow schema classpath:schemas/h2/tasks.sql for h2 database
02-Jul-2019 06:01:46 2019-07-02 06:01:46.254  INFO 10721 --- [           main] o.s.c.d.s.r.s.DataflowRdbmsInitializer   : Adding dataflow schema classpath:schemas/h2/deployment.sql for h2 database
02-Jul-2019 06:01:46 2019-07-02 06:01:46.254  INFO 10721 --- [           main] o.s.c.d.s.r.s.DataflowRdbmsInitializer   : Adding dataflow schema classpath:schemas/h2/jpa.sql for h2 database
02-Jul-2019 06:01:46 2019-07-02 06:01:46.254  INFO 10721 --- [           main] o.s.jdbc.datasource.init.ScriptUtils     : Executing SQL script from class path resource [schemas/h2/common.sql]
02-Jul-2019 06:01:46 2019-07-02 06:01:46.255  INFO 10721 --- [           main] o.s.jdbc.datasource.init.ScriptUtils     : Executed SQL script from class path resource [schemas/h2/common.sql] in 1 ms.
02-Jul-2019 06:01:46 2019-07-02 06:01:46.255  INFO 10721 --- [           main] o.s.jdbc.datasource.init.ScriptUtils     : Executing SQL script from class path resource [schemas/h2/streams.sql]
02-Jul-2019 06:01:46 2019-07-02 06:01:46.255  INFO 10721 --- [           main] o.s.jdbc.datasource.init.ScriptUtils     : Executed SQL script from class path resource [schemas/h2/streams.sql] in 0 ms.
02-Jul-2019 06:01:46 2019-07-02 06:01:46.255  INFO 10721 --- [           main] o.s.jdbc.datasource.init.ScriptUtils     : Executing SQL script from class path resource [schemas/h2/tasks.sql]
02-Jul-2019 06:01:46 2019-07-02 06:01:46.255  INFO 10721 --- [           main] o.s.jdbc.datasource.init.ScriptUtils     : Executed SQL script from class path resource [schemas/h2/tasks.sql] in 0 ms.
02-Jul-2019 06:01:46 2019-07-02 06:01:46.255  INFO 10721 --- [           main] o.s.jdbc.datasource.init.ScriptUtils     : Executing SQL script from class path resource [schemas/h2/deployment.sql]
02-Jul-2019 06:01:46 2019-07-02 06:01:46.255  INFO 10721 --- [           main] o.s.jdbc.datasource.init.ScriptUtils     : Executed SQL script from class path resource [schemas/h2/deployment.sql] in 0 ms.
02-Jul-2019 06:01:46 2019-07-02 06:01:46.255  INFO 10721 --- [           main] o.s.jdbc.datasource.init.ScriptUtils     : Executing SQL script from class path resource [schemas/h2/jpa.sql]
02-Jul-2019 06:01:46 2019-07-02 06:01:46.255  INFO 10721 --- [           main] o.s.jdbc.datasource.init.ScriptUtils     : Executed SQL script from class path resource [schemas/h2/jpa.sql] in 0 ms.
02-Jul-2019 06:01:46 2019-07-02 06:01:46.262  INFO 10721 --- [           main] s.r.RdbmsStreamDefinitionRepositoryTests : Started RdbmsStreamDefinitionRepositoryTests in 0.31 seconds (JVM running for 161.481)
02-Jul-2019 06:01:46 [INFO] Tests run: 40, Failures: 0, Errors: 0, Skipped: 0, Time elapsed: 0.423 s - in org.springframework.cloud.dataflow.server.repository.RdbmsStreamDefinitionRepositoryTests
02-Jul-2019 06:01:46 [INFO] Running org.springframework.cloud.dataflow.server.repository.SchemaGenerationTests
02-Jul-2019 06:01:46 2019-07-02 06:01:46.374  INFO 10721 --- [           main] o.s.t.c.support.AbstractContextLoader    : Could not detect default resource locations for test class [org.springframework.cloud.dataflow.server.repository.SchemaGenerationTests]: no resource found for suffixes {-context.xml, Context.groovy}.
02-Jul-2019 06:01:46   ____                              ____ _                __
02-Jul-2019 06:01:46 / ___| _ __  _ __(_)_ __   __ _   / ___| | ___  _   _  __| |
02-Jul-2019 06:01:46 \___ \| '_ \| '__| | '_ \ / _` | | |   | |/ _ \| | | |/ _` |
02-Jul-2019 06:01:46   ___) | |_) | |  | | | | | (_| | | |___| | (_) | |_| | (_| |
02-Jul-2019 06:01:46 |____/| .__/|_|  |_|_| |_|\__, |  \____|_|\___/ \__,_|\__,_|
02-Jul-2019 06:01:46   ____ |_|    _          __|___/                 __________
02-Jul-2019 06:01:46 |  _ \  __ _| |_ __ _  |  ___| | _____      __  \ \ \ \ \ \
02-Jul-2019 06:01:46 | | | |/ _` | __/ _` | | |_  | |/ _ \ \ /\ / /   \ \ \ \ \ \
02-Jul-2019 06:01:46 | |_| | (_| | || (_| | |  _| | | (_) \ V  V /    / / / / / /
02-Jul-2019 06:01:46 |____/ \__,_|\__\__,_| |_|   |_|\___/ \_/\_/    /_/_/_/_/_/
02-Jul-2019 06:01:46
02-Jul-2019 06:01:46
02-Jul-2019 06:01:46
02-Jul-2019 06:01:46 2019-07-02 06:01:46.575  INFO 10721 --- [           main] c.c.c.ConfigServicePropertySourceLocator : Fetching config from server at: http://localhost:8888
02-Jul-2019 06:01:46 2019-07-02 06:01:46.577  WARN 10721 --- [           main] c.c.c.ConfigServicePropertySourceLocator : Could not locate PropertySource: I/O error on GET request for "http://localhost:8888/application/default": Connection refused (Connection refused); nested exception is java.net.ConnectException: Connection refused (Connection refused)
02-Jul-2019 06:01:46 2019-07-02 06:01:46.579  INFO 10721 --- [           main] o.s.c.d.s.r.SchemaGenerationTests        : No active profile set, falling back to default profiles: default
02-Jul-2019 06:01:46 2019-07-02 06:01:46.590  INFO 10721 --- [           main] .s.d.r.c.RepositoryConfigurationDelegate : Multiple Spring Data modules found, entering strict repository configuration mode!
02-Jul-2019 06:01:46 2019-07-02 06:01:46.660  INFO 10721 --- [           main] o.s.j.d.e.EmbeddedDatabaseFactory        : Starting embedded database: url='jdbc:h2:mem:testdb;DB_CLOSE_DELAY=-1;DB_CLOSE_ON_EXIT=false', username='sa'
02-Jul-2019 06:01:46 2019-07-02 06:01:46.684  INFO 10721 --- [           main] j.LocalContainerEntityManagerFactoryBean : Building JPA container EntityManagerFactory for persistence unit 'default'
02-Jul-2019 06:01:46 2019-07-02 06:01:46.684  INFO 10721 --- [           main] o.hibernate.jpa.internal.util.LogHelper  : HHH000204: Processing PersistenceUnitInfo [
02-Jul-2019 06:01:46         name: default
02-Jul-2019 06:01:46         ...]
02-Jul-2019 06:01:46 2019-07-02 06:01:46.688  INFO 10721 --- [           main] org.hibernate.dialect.Dialect            : HHH000400: Using dialect: org.hibernate.dialect.H2Dialect
02-Jul-2019 06:01:46 2019-07-02 06:01:46.702  INFO 10721 --- [           main] o.h.t.schema.internal.SchemaCreatorImpl  : HHH000476: Executing import script 'org.hibernate.tool.schema.internal.exec.ScriptSourceInputNonExistentImpl@2c6799fe'
02-Jul-2019 06:01:46 2019-07-02 06:01:46.702  INFO 10721 --- [           main] j.LocalContainerEntityManagerFactoryBean : Initialized JPA EntityManagerFactory for persistence unit 'default'
02-Jul-2019 06:01:46 2019-07-02 06:01:46.732  INFO 10721 --- [           main] o.s.c.d.s.r.SchemaGenerationTests        : Started SchemaGenerationTests in 0.35 seconds (JVM running for 161.952)
02-Jul-2019 06:01:46 2019-07-02 06:01:46.738  INFO 10721 --- [           main] o.s.c.d.s.r.SchemaGenerationTests        :
02-Jul-2019 06:01:46
02-Jul-2019 06:01:46 Generating DDL scripts for the following dialects:
02-Jul-2019 06:01:46
02-Jul-2019 06:01:46 H2Dialect
02-Jul-2019 06:01:46 HSQLDialect
02-Jul-2019 06:01:46 MySQL5Dialect
02-Jul-2019 06:01:46 Oracle10gDialect
02-Jul-2019 06:01:46 PostgreSQL94Dialect
02-Jul-2019 06:01:46 DB2Dialect
02-Jul-2019 06:01:46 SQLServer2012Dialect
02-Jul-2019 06:01:46
02-Jul-2019 06:01:46 2019-07-02 06:01:46.739  INFO 10721 --- [           main] o.s.c.d.s.r.SchemaGenerationTests        : Generating DDL script for H2
02-Jul-2019 06:01:46 2019-07-02 06:01:46.740  INFO 10721 --- [           main] o.s.c.d.s.r.SchemaGenerationTests        : org.springframework.cloud.dataflow.registry.domain.AppRegistration
02-Jul-2019 06:01:46 2019-07-02 06:01:46.740  INFO 10721 --- [           main] o.s.c.d.s.r.SchemaGenerationTests        : org.springframework.cloud.dataflow.registry.domain.AbstractEntity
02-Jul-2019 06:01:46 2019-07-02 06:01:46.740  INFO 10721 --- [           main] o.s.c.d.s.r.SchemaGenerationTests        : org.springframework.cloud.dataflow.registry.domain.UriPersistenceConverter
02-Jul-2019 06:01:46 2019-07-02 06:01:46.740  INFO 10721 --- [           main] o.s.c.d.s.r.SchemaGenerationTests        : org.springframework.cloud.dataflow.server.audit.domain.AuditActionTypeConverter
02-Jul-2019 06:01:46 2019-07-02 06:01:46.740  INFO 10721 --- [           main] o.s.c.d.s.r.SchemaGenerationTests        : org.springframework.cloud.dataflow.server.audit.domain.AuditOperationTypeConverter
02-Jul-2019 06:01:46 2019-07-02 06:01:46.740  INFO 10721 --- [           main] o.s.c.d.s.r.SchemaGenerationTests        : org.springframework.cloud.dataflow.server.audit.domain.AuditRecord
02-Jul-2019 06:01:46 2019-07-02 06:01:46.745  WARN 10721 --- [           main] o.h.e.j.c.i.ConnectionProviderInitiator  : HHH000181: No appropriate connection provider encountered, assuming application will be supplying connections
02-Jul-2019 06:01:46 2019-07-02 06:01:46.745  WARN 10721 --- [           main] o.h.e.j.e.i.JdbcEnvironmentInitiator     : HHH000342: Could not obtain connection to query metadata : The application must supply JDBC connections
02-Jul-2019 06:01:46 2019-07-02 06:01:46.746  INFO 10721 --- [           main] org.hibernate.dialect.Dialect            : HHH000400: Using dialect: org.hibernate.dialect.H2Dialect
02-Jul-2019 06:01:46 2019-07-02 06:01:46.750  INFO 10721 --- [           main] o.h.e.j.e.i.LobCreatorBuilderImpl        : HHH000422: Disabling contextual LOB creation as connection was null
02-Jul-2019 06:01:46 2019-07-02 06:01:46.753  INFO 10721 --- [           main] org.hibernate.tool.hbm2ddl.SchemaExport  : HHH000227: Running hbm2ddl schema export
02-Jul-2019 06:01:46 2019-07-02 06:01:46.762  INFO 10721 --- [           main] o.h.t.schema.internal.SchemaCreatorImpl  : HHH000476: Executing import script 'org.hibernate.tool.schema.internal.exec.ScriptSourceInputNonExistentImpl@2c6799fe'
02-Jul-2019 06:01:46 2019-07-02 06:01:46.762  INFO 10721 --- [           main] o.s.c.d.s.r.SchemaGenerationTests        : Generating DDL script for HSQL
02-Jul-2019 06:01:46 2019-07-02 06:01:46.763  INFO 10721 --- [           main] o.s.c.d.s.r.SchemaGenerationTests        : org.springframework.cloud.dataflow.registry.domain.AppRegistration
02-Jul-2019 06:01:46 2019-07-02 06:01:46.763  INFO 10721 --- [           main] o.s.c.d.s.r.SchemaGenerationTests        : org.springframework.cloud.dataflow.registry.domain.AbstractEntity
02-Jul-2019 06:01:46 2019-07-02 06:01:46.763  INFO 10721 --- [           main] o.s.c.d.s.r.SchemaGenerationTests        : org.springframework.cloud.dataflow.registry.domain.UriPersistenceConverter
02-Jul-2019 06:01:46 2019-07-02 06:01:46.763  INFO 10721 --- [           main] o.s.c.d.s.r.SchemaGenerationTests        : org.springframework.cloud.dataflow.server.audit.domain.AuditActionTypeConverter
02-Jul-2019 06:01:46 2019-07-02 06:01:46.764  INFO 10721 --- [           main] o.s.c.d.s.r.SchemaGenerationTests        : org.springframework.cloud.dataflow.server.audit.domain.AuditOperationTypeConverter
02-Jul-2019 06:01:46 2019-07-02 06:01:46.764  INFO 10721 --- [           main] o.s.c.d.s.r.SchemaGenerationTests        : org.springframework.cloud.dataflow.server.audit.domain.AuditRecord
02-Jul-2019 06:01:46 2019-07-02 06:01:46.765  WARN 10721 --- [           main] o.h.e.j.c.i.ConnectionProviderInitiator  : HHH000181: No appropriate connection provider encountered, assuming application will be supplying connections
02-Jul-2019 06:01:46 2019-07-02 06:01:46.765  WARN 10721 --- [           main] o.h.e.j.e.i.JdbcEnvironmentInitiator     : HHH000342: Could not obtain connection to query metadata : The application must supply JDBC connections
02-Jul-2019 06:01:46 2019-07-02 06:01:46.767  INFO 10721 --- [           main] org.hibernate.dialect.Dialect            : HHH000400: Using dialect: org.hibernate.dialect.HSQLDialect
02-Jul-2019 06:01:46 2019-07-02 06:01:46.788  INFO 10721 --- [           main] o.h.e.j.e.i.LobCreatorBuilderImpl        : HHH000422: Disabling contextual LOB creation as connection was null
02-Jul-2019 06:01:46 2019-07-02 06:01:46.792  INFO 10721 --- [           main] org.hibernate.tool.hbm2ddl.SchemaExport  : HHH000227: Running hbm2ddl schema export
02-Jul-2019 06:01:46 2019-07-02 06:01:46.793  INFO 10721 --- [           main] o.h.t.schema.internal.SchemaCreatorImpl  : HHH000476: Executing import script 'org.hibernate.tool.schema.internal.exec.ScriptSourceInputNonExistentImpl@2c6799fe'
02-Jul-2019 06:01:46 2019-07-02 06:01:46.794  INFO 10721 --- [           main] o.s.c.d.s.r.SchemaGenerationTests        : Generating DDL script for MySQL5
02-Jul-2019 06:01:46 2019-07-02 06:01:46.795  INFO 10721 --- [           main] o.s.c.d.s.r.SchemaGenerationTests        : org.springframework.cloud.dataflow.registry.domain.AppRegistration
02-Jul-2019 06:01:46 2019-07-02 06:01:46.795  INFO 10721 --- [           main] o.s.c.d.s.r.SchemaGenerationTests        : org.springframework.cloud.dataflow.registry.domain.AbstractEntity
02-Jul-2019 06:01:46 2019-07-02 06:01:46.795  INFO 10721 --- [           main] o.s.c.d.s.r.SchemaGenerationTests        : org.springframework.cloud.dataflow.registry.domain.UriPersistenceConverter
02-Jul-2019 06:01:46 2019-07-02 06:01:46.795  INFO 10721 --- [           main] o.s.c.d.s.r.SchemaGenerationTests        : org.springframework.cloud.dataflow.server.audit.domain.AuditActionTypeConverter
02-Jul-2019 06:01:46 2019-07-02 06:01:46.795  INFO 10721 --- [           main] o.s.c.d.s.r.SchemaGenerationTests        : org.springframework.cloud.dataflow.server.audit.domain.AuditOperationTypeConverter
02-Jul-2019 06:01:46 2019-07-02 06:01:46.795  INFO 10721 --- [           main] o.s.c.d.s.r.SchemaGenerationTests        : org.springframework.cloud.dataflow.server.audit.domain.AuditRecord
02-Jul-2019 06:01:46 2019-07-02 06:01:46.796  WARN 10721 --- [           main] o.h.e.j.c.i.ConnectionProviderInitiator  : HHH000181: No appropriate connection provider encountered, assuming application will be supplying connections
02-Jul-2019 06:01:46 2019-07-02 06:01:46.797  WARN 10721 --- [           main] o.h.e.j.e.i.JdbcEnvironmentInitiator     : HHH000342: Could not obtain connection to query metadata : The application must supply JDBC connections
02-Jul-2019 06:01:46 2019-07-02 06:01:46.799  INFO 10721 --- [           main] org.hibernate.dialect.Dialect            : HHH000400: Using dialect: org.hibernate.dialect.MySQL5Dialect
02-Jul-2019 06:01:46 2019-07-02 06:01:46.805  INFO 10721 --- [           main] o.h.e.j.e.i.LobCreatorBuilderImpl        : HHH000422: Disabling contextual LOB creation as connection was null
02-Jul-2019 06:01:46 2019-07-02 06:01:46.819  INFO 10721 --- [           main] org.hibernate.tool.hbm2ddl.SchemaExport  : HHH000227: Running hbm2ddl schema export
02-Jul-2019 06:01:46 2019-07-02 06:01:46.821  INFO 10721 --- [           main] o.h.t.schema.internal.SchemaCreatorImpl  : HHH000476: Executing import script 'org.hibernate.tool.schema.internal.exec.ScriptSourceInputNonExistentImpl@2c6799fe'
02-Jul-2019 06:01:46 2019-07-02 06:01:46.821  INFO 10721 --- [           main] o.s.c.d.s.r.SchemaGenerationTests        : Generating DDL script for Oracle10g
02-Jul-2019 06:01:46 2019-07-02 06:01:46.822  INFO 10721 --- [           main] o.s.c.d.s.r.SchemaGenerationTests        : org.springframework.cloud.dataflow.registry.domain.AppRegistration
02-Jul-2019 06:01:46 2019-07-02 06:01:46.822  INFO 10721 --- [           main] o.s.c.d.s.r.SchemaGenerationTests        : org.springframework.cloud.dataflow.registry.domain.AbstractEntity
02-Jul-2019 06:01:46 2019-07-02 06:01:46.822  INFO 10721 --- [           main] o.s.c.d.s.r.SchemaGenerationTests        : org.springframework.cloud.dataflow.registry.domain.UriPersistenceConverter
02-Jul-2019 06:01:46 2019-07-02 06:01:46.822  INFO 10721 --- [           main] o.s.c.d.s.r.SchemaGenerationTests        : org.springframework.cloud.dataflow.server.audit.domain.AuditActionTypeConverter
02-Jul-2019 06:01:46 2019-07-02 06:01:46.822  INFO 10721 --- [           main] o.s.c.d.s.r.SchemaGenerationTests        : org.springframework.cloud.dataflow.server.audit.domain.AuditOperationTypeConverter
02-Jul-2019 06:01:46 2019-07-02 06:01:46.823  INFO 10721 --- [           main] o.s.c.d.s.r.SchemaGenerationTests        : org.springframework.cloud.dataflow.server.audit.domain.AuditRecord
02-Jul-2019 06:01:46 2019-07-02 06:01:46.824  WARN 10721 --- [           main] o.h.e.j.c.i.ConnectionProviderInitiator  : HHH000181: No appropriate connection provider encountered, assuming application will be supplying connections
02-Jul-2019 06:01:46 2019-07-02 06:01:46.824  WARN 10721 --- [           main] o.h.e.j.e.i.JdbcEnvironmentInitiator     : HHH000342: Could not obtain connection to query metadata : The application must supply JDBC connections
02-Jul-2019 06:01:46 2019-07-02 06:01:46.827  INFO 10721 --- [           main] org.hibernate.dialect.Dialect            : HHH000400: Using dialect: org.hibernate.dialect.Oracle10gDialect
02-Jul-2019 06:01:46 2019-07-02 06:01:46.829  INFO 10721 --- [           main] o.h.e.j.e.i.LobCreatorBuilderImpl        : HHH000422: Disabling contextual LOB creation as connection was null
02-Jul-2019 06:01:46 2019-07-02 06:01:46.834  INFO 10721 --- [           main] org.hibernate.tool.hbm2ddl.SchemaExport  : HHH000227: Running hbm2ddl schema export
02-Jul-2019 06:01:46 2019-07-02 06:01:46.836  INFO 10721 --- [           main] o.h.t.schema.internal.SchemaCreatorImpl  : HHH000476: Executing import script 'org.hibernate.tool.schema.internal.exec.ScriptSourceInputNonExistentImpl@2c6799fe'
02-Jul-2019 06:01:46 2019-07-02 06:01:46.836  INFO 10721 --- [           main] o.s.c.d.s.r.SchemaGenerationTests        : Generating DDL script for PostgreSQL94
02-Jul-2019 06:01:46 2019-07-02 06:01:46.838  INFO 10721 --- [           main] o.s.c.d.s.r.SchemaGenerationTests        : org.springframework.cloud.dataflow.registry.domain.AppRegistration
02-Jul-2019 06:01:46 2019-07-02 06:01:46.838  INFO 10721 --- [           main] o.s.c.d.s.r.SchemaGenerationTests        : org.springframework.cloud.dataflow.registry.domain.AbstractEntity
02-Jul-2019 06:01:46 2019-07-02 06:01:46.838  INFO 10721 --- [           main] o.s.c.d.s.r.SchemaGenerationTests        : org.springframework.cloud.dataflow.registry.domain.UriPersistenceConverter
02-Jul-2019 06:01:46 2019-07-02 06:01:46.838  INFO 10721 --- [           main] o.s.c.d.s.r.SchemaGenerationTests        : org.springframework.cloud.dataflow.server.audit.domain.AuditActionTypeConverter
02-Jul-2019 06:01:46 2019-07-02 06:01:46.838  INFO 10721 --- [           main] o.s.c.d.s.r.SchemaGenerationTests        : org.springframework.cloud.dataflow.server.audit.domain.AuditOperationTypeConverter
02-Jul-2019 06:01:46 2019-07-02 06:01:46.838  INFO 10721 --- [           main] o.s.c.d.s.r.SchemaGenerationTests        : org.springframework.cloud.dataflow.server.audit.domain.AuditRecord
02-Jul-2019 06:01:46 2019-07-02 06:01:46.840  WARN 10721 --- [           main] o.h.e.j.c.i.ConnectionProviderInitiator  : HHH000181: No appropriate connection provider encountered, assuming application will be supplying connections
02-Jul-2019 06:01:46 2019-07-02 06:01:46.841  WARN 10721 --- [           main] o.h.e.j.e.i.JdbcEnvironmentInitiator     : HHH000342: Could not obtain connection to query metadata : The application must supply JDBC connections
02-Jul-2019 06:01:46 2019-07-02 06:01:46.843  INFO 10721 --- [           main] org.hibernate.dialect.Dialect            : HHH000400: Using dialect: org.hibernate.dialect.PostgreSQL94Dialect
02-Jul-2019 06:01:46 2019-07-02 06:01:46.845  INFO 10721 --- [           main] o.h.e.j.e.i.LobCreatorBuilderImpl        : HHH000422: Disabling contextual LOB creation as connection was null
02-Jul-2019 06:01:46 2019-07-02 06:01:46.846  INFO 10721 --- [           main] org.hibernate.type.BasicTypeRegistry     : HHH000270: Type registration [java.util.UUID] overrides previous : org.hibernate.type.UUIDBinaryType@1d960e92
02-Jul-2019 06:01:46 2019-07-02 06:01:46.851  INFO 10721 --- [           main] org.hibernate.tool.hbm2ddl.SchemaExport  : HHH000227: Running hbm2ddl schema export
02-Jul-2019 06:01:46 2019-07-02 06:01:46.853  INFO 10721 --- [           main] o.h.t.schema.internal.SchemaCreatorImpl  : HHH000476: Executing import script 'org.hibernate.tool.schema.internal.exec.ScriptSourceInputNonExistentImpl@2c6799fe'
02-Jul-2019 06:01:46 2019-07-02 06:01:46.853  INFO 10721 --- [           main] o.s.c.d.s.r.SchemaGenerationTests        : Generating DDL script for DB2
02-Jul-2019 06:01:46 2019-07-02 06:01:46.855  INFO 10721 --- [           main] o.s.c.d.s.r.SchemaGenerationTests        : org.springframework.cloud.dataflow.registry.domain.AppRegistration
02-Jul-2019 06:01:46 2019-07-02 06:01:46.855  INFO 10721 --- [           main] o.s.c.d.s.r.SchemaGenerationTests        : org.springframework.cloud.dataflow.registry.domain.AbstractEntity
02-Jul-2019 06:01:46 2019-07-02 06:01:46.855  INFO 10721 --- [           main] o.s.c.d.s.r.SchemaGenerationTests        : org.springframework.cloud.dataflow.registry.domain.UriPersistenceConverter
02-Jul-2019 06:01:46 2019-07-02 06:01:46.855  INFO 10721 --- [           main] o.s.c.d.s.r.SchemaGenerationTests        : org.springframework.cloud.dataflow.server.audit.domain.AuditActionTypeConverter
02-Jul-2019 06:01:46 2019-07-02 06:01:46.856  INFO 10721 --- [           main] o.s.c.d.s.r.SchemaGenerationTests        : org.springframework.cloud.dataflow.server.audit.domain.AuditOperationTypeConverter
02-Jul-2019 06:01:46 2019-07-02 06:01:46.856  INFO 10721 --- [           main] o.s.c.d.s.r.SchemaGenerationTests        : org.springframework.cloud.dataflow.server.audit.domain.AuditRecord
02-Jul-2019 06:01:46 2019-07-02 06:01:46.857  WARN 10721 --- [           main] o.h.e.j.c.i.ConnectionProviderInitiator  : HHH000181: No appropriate connection provider encountered, assuming application will be supplying connections
02-Jul-2019 06:01:46 2019-07-02 06:01:46.858  WARN 10721 --- [           main] o.h.e.j.e.i.JdbcEnvironmentInitiator     : HHH000342: Could not obtain connection to query metadata : The application must supply JDBC connections
02-Jul-2019 06:01:46 2019-07-02 06:01:46.860  INFO 10721 --- [           main] org.hibernate.dialect.Dialect            : HHH000400: Using dialect: org.hibernate.dialect.DB2Dialect
02-Jul-2019 06:01:46 2019-07-02 06:01:46.862  INFO 10721 --- [           main] o.h.e.j.e.i.LobCreatorBuilderImpl        : HHH000422: Disabling contextual LOB creation as connection was null
02-Jul-2019 06:01:46 2019-07-02 06:01:46.865  INFO 10721 --- [           main] org.hibernate.tool.hbm2ddl.SchemaExport  : HHH000227: Running hbm2ddl schema export
02-Jul-2019 06:01:46 2019-07-02 06:01:46.867  INFO 10721 --- [           main] o.h.t.schema.internal.SchemaCreatorImpl  : HHH000476: Executing import script 'org.hibernate.tool.schema.internal.exec.ScriptSourceInputNonExistentImpl@2c6799fe'
02-Jul-2019 06:01:46 2019-07-02 06:01:46.867  INFO 10721 --- [           main] o.s.c.d.s.r.SchemaGenerationTests        : Generating DDL script for SQLServer2012
02-Jul-2019 06:01:46 2019-07-02 06:01:46.869  INFO 10721 --- [           main] o.s.c.d.s.r.SchemaGenerationTests        : org.springframework.cloud.dataflow.registry.domain.AppRegistration
02-Jul-2019 06:01:46 2019-07-02 06:01:46.869  INFO 10721 --- [           main] o.s.c.d.s.r.SchemaGenerationTests        : org.springframework.cloud.dataflow.registry.domain.AbstractEntity
02-Jul-2019 06:01:46 2019-07-02 06:01:46.869  INFO 10721 --- [           main] o.s.c.d.s.r.SchemaGenerationTests        : org.springframework.cloud.dataflow.registry.domain.UriPersistenceConverter
02-Jul-2019 06:01:46 2019-07-02 06:01:46.870  INFO 10721 --- [           main] o.s.c.d.s.r.SchemaGenerationTests        : org.springframework.cloud.dataflow.server.audit.domain.AuditActionTypeConverter
02-Jul-2019 06:01:46 2019-07-02 06:01:46.870  INFO 10721 --- [           main] o.s.c.d.s.r.SchemaGenerationTests        : org.springframework.cloud.dataflow.server.audit.domain.AuditOperationTypeConverter
02-Jul-2019 06:01:46 2019-07-02 06:01:46.870  INFO 10721 --- [           main] o.s.c.d.s.r.SchemaGenerationTests        : org.springframework.cloud.dataflow.server.audit.domain.AuditRecord
02-Jul-2019 06:01:46 2019-07-02 06:01:46.872  WARN 10721 --- [           main] o.h.e.j.c.i.ConnectionProviderInitiator  : HHH000181: No appropriate connection provider encountered, assuming application will be supplying connections
02-Jul-2019 06:01:46 2019-07-02 06:01:46.872  WARN 10721 --- [           main] o.h.e.j.e.i.JdbcEnvironmentInitiator     : HHH000342: Could not obtain connection to query metadata : The application must supply JDBC connections
02-Jul-2019 06:01:46 2019-07-02 06:01:46.874  INFO 10721 --- [           main] org.hibernate.dialect.Dialect            : HHH000400: Using dialect: org.hibernate.dialect.SQLServer2012Dialect
02-Jul-2019 06:01:46 2019-07-02 06:01:46.881  INFO 10721 --- [           main] o.h.e.j.e.i.LobCreatorBuilderImpl        : HHH000422: Disabling contextual LOB creation as connection was null
02-Jul-2019 06:01:46 2019-07-02 06:01:46.885  INFO 10721 --- [           main] org.hibernate.tool.hbm2ddl.SchemaExport  : HHH000227: Running hbm2ddl schema export
02-Jul-2019 06:01:46 2019-07-02 06:01:46.887  INFO 10721 --- [           main] o.h.t.schema.internal.SchemaCreatorImpl  : HHH000476: Executing import script 'org.hibernate.tool.schema.internal.exec.ScriptSourceInputNonExistentImpl@2c6799fe'
02-Jul-2019 06:01:46 2019-07-02 06:01:46.887  INFO 10721 --- [           main] o.s.c.d.s.r.SchemaGenerationTests        :
02-Jul-2019 06:01:46
02-Jul-2019 06:01:46 You can find the DDL scripts in directory: /tmp/scdf-sql-8991745965291061915
02-Jul-2019 06:01:46
02-Jul-2019 06:01:46 [INFO] Tests run: 1, Failures: 0, Errors: 0, Skipped: 0, Time elapsed: 0.517 s - in org.springframework.cloud.dataflow.server.repository.SchemaGenerationTests
02-Jul-2019 06:01:46 [INFO] Running org.springframework.cloud.dataflow.server.repository.InMemoryDeploymentIdRepositoryTests
02-Jul-2019 06:01:46 [INFO] Tests run: 2, Failures: 0, Errors: 0, Skipped: 0, Time elapsed: 0 s - in org.springframework.cloud.dataflow.server.repository.InMemoryDeploymentIdRepositoryTests
02-Jul-2019 06:01:46 [INFO] Running org.springframework.cloud.dataflow.server.repository.InMemoryTaskDefinitionRepositoryTests
02-Jul-2019 06:01:46 [INFO] Tests run: 16, Failures: 0, Errors: 0, Skipped: 0, Time elapsed: 0.001 s - in org.springframework.cloud.dataflow.server.repository.InMemoryTaskDefinitionRepositoryTests
02-Jul-2019 06:01:46 [INFO] Running org.springframework.cloud.dataflow.server.audit.service.DefaultAuditRecordServiceTests
02-Jul-2019 06:01:46 2019-07-02 06:01:46.936 ERROR 10721 --- [           main] o.s.c.d.s.a.s.DefaultAuditRecordService  : Error serializing audit record data.  Data = {foo=bar}
02-Jul-2019 06:01:46 [INFO] Tests run: 8, Failures: 0, Errors: 0, Skipped: 0, Time elapsed: 0.037 s - in org.springframework.cloud.dataflow.server.audit.service.DefaultAuditRecordServiceTests
02-Jul-2019 06:01:46 [INFO] Running org.springframework.cloud.dataflow.server.registry.RdbmsUriRegistryTests
02-Jul-2019 06:01:46 2019-07-02 06:01:46.943  INFO 10721 --- [           main] o.s.t.c.support.AbstractContextLoader    : Could not detect default resource locations for test class [org.springframework.cloud.dataflow.server.registry.RdbmsUriRegistryTests]: no resource found for suffixes {-context.xml, Context.groovy}.
02-Jul-2019 06:01:47   ____                              ____ _                __
02-Jul-2019 06:01:47 / ___| _ __  _ __(_)_ __   __ _   / ___| | ___  _   _  __| |
02-Jul-2019 06:01:47 \___ \| '_ \| '__| | '_ \ / _` | | |   | |/ _ \| | | |/ _` |
02-Jul-2019 06:01:47   ___) | |_) | |  | | | | | (_| | | |___| | (_) | |_| | (_| |
02-Jul-2019 06:01:47 |____/| .__/|_|  |_|_| |_|\__, |  \____|_|\___/ \__,_|\__,_|
02-Jul-2019 06:01:47   ____ |_|    _          __|___/                 __________
02-Jul-2019 06:01:47 |  _ \  __ _| |_ __ _  |  ___| | _____      __  \ \ \ \ \ \
02-Jul-2019 06:01:47 | | | |/ _` | __/ _` | | |_  | |/ _ \ \ /\ / /   \ \ \ \ \ \
02-Jul-2019 06:01:47 | |_| | (_| | || (_| | |  _| | | (_) \ V  V /    / / / / / /
02-Jul-2019 06:01:47 |____/ \__,_|\__\__,_| |_|   |_|\___/ \_/\_/    /_/_/_/_/_/
02-Jul-2019 06:01:47
02-Jul-2019 06:01:47
02-Jul-2019 06:01:47
02-Jul-2019 06:01:47 2019-07-02 06:01:47.134  INFO 10721 --- [           main] c.c.c.ConfigServicePropertySourceLocator : Fetching config from server at: http://localhost:8888
02-Jul-2019 06:01:47 2019-07-02 06:01:47.135  WARN 10721 --- [           main] c.c.c.ConfigServicePropertySourceLocator : Could not locate PropertySource: I/O error on GET request for "http://localhost:8888/application/default": Connection refused (Connection refused); nested exception is java.net.ConnectException: Connection refused (Connection refused)
02-Jul-2019 06:01:47 2019-07-02 06:01:47.136  INFO 10721 --- [           main] o.s.c.d.s.r.RdbmsUriRegistryTests        : No active profile set, falling back to default profiles: default
02-Jul-2019 06:01:47 2019-07-02 06:01:47.212  INFO 10721 --- [           main] o.s.j.d.e.EmbeddedDatabaseFactory        : Starting embedded database: url='jdbc:h2:mem:testdb;DB_CLOSE_DELAY=-1;DB_CLOSE_ON_EXIT=false', username='sa'
02-Jul-2019 06:01:47 2019-07-02 06:01:47.233  INFO 10721 --- [           main] o.s.c.d.s.r.s.DataflowRdbmsInitializer   : Adding dataflow schema classpath:schemas/h2/common.sql for h2 database
02-Jul-2019 06:01:47 2019-07-02 06:01:47.233  INFO 10721 --- [           main] o.s.c.d.s.r.s.DataflowRdbmsInitializer   : Adding dataflow schema classpath:schemas/h2/streams.sql for h2 database
02-Jul-2019 06:01:47 2019-07-02 06:01:47.234  INFO 10721 --- [           main] o.s.c.d.s.r.s.DataflowRdbmsInitializer   : Adding dataflow schema classpath:schemas/h2/tasks.sql for h2 database
02-Jul-2019 06:01:47 2019-07-02 06:01:47.234  INFO 10721 --- [           main] o.s.c.d.s.r.s.DataflowRdbmsInitializer   : Adding dataflow schema classpath:schemas/h2/deployment.sql for h2 database
02-Jul-2019 06:01:47 2019-07-02 06:01:47.234  INFO 10721 --- [           main] o.s.c.d.s.r.s.DataflowRdbmsInitializer   : Adding dataflow schema classpath:schemas/h2/jpa.sql for h2 database
02-Jul-2019 06:01:47 2019-07-02 06:01:47.234  INFO 10721 --- [           main] o.s.jdbc.datasource.init.ScriptUtils     : Executing SQL script from class path resource [schemas/h2/common.sql]
02-Jul-2019 06:01:47 2019-07-02 06:01:47.235  INFO 10721 --- [           main] o.s.jdbc.datasource.init.ScriptUtils     : Executed SQL script from class path resource [schemas/h2/common.sql] in 1 ms.
02-Jul-2019 06:01:47 2019-07-02 06:01:47.235  INFO 10721 --- [           main] o.s.jdbc.datasource.init.ScriptUtils     : Executing SQL script from class path resource [schemas/h2/streams.sql]
02-Jul-2019 06:01:47 2019-07-02 06:01:47.235  INFO 10721 --- [           main] o.s.jdbc.datasource.init.ScriptUtils     : Executed SQL script from class path resource [schemas/h2/streams.sql] in 0 ms.
02-Jul-2019 06:01:47 2019-07-02 06:01:47.236  INFO 10721 --- [           main] o.s.jdbc.datasource.init.ScriptUtils     : Executing SQL script from class path resource [schemas/h2/tasks.sql]
02-Jul-2019 06:01:47 2019-07-02 06:01:47.236  INFO 10721 --- [           main] o.s.jdbc.datasource.init.ScriptUtils     : Executed SQL script from class path resource [schemas/h2/tasks.sql] in 0 ms.
02-Jul-2019 06:01:47 2019-07-02 06:01:47.236  INFO 10721 --- [           main] o.s.jdbc.datasource.init.ScriptUtils     : Executing SQL script from class path resource [schemas/h2/deployment.sql]
02-Jul-2019 06:01:47 2019-07-02 06:01:47.236  INFO 10721 --- [           main] o.s.jdbc.datasource.init.ScriptUtils     : Executed SQL script from class path resource [schemas/h2/deployment.sql] in 0 ms.
02-Jul-2019 06:01:47 2019-07-02 06:01:47.236  INFO 10721 --- [           main] o.s.jdbc.datasource.init.ScriptUtils     : Executing SQL script from class path resource [schemas/h2/jpa.sql]
02-Jul-2019 06:01:47 2019-07-02 06:01:47.237  INFO 10721 --- [           main] o.s.jdbc.datasource.init.ScriptUtils     : Executed SQL script from class path resource [schemas/h2/jpa.sql] in 1 ms.
02-Jul-2019 06:01:47 2019-07-02 06:01:47.241  INFO 10721 --- [           main] o.s.c.d.s.r.RdbmsUriRegistryTests        : Started RdbmsUriRegistryTests in 0.291 seconds (JVM running for 162.461)
02-Jul-2019 06:01:47 [INFO] Tests run: 5, Failures: 0, Errors: 0, Skipped: 0, Time elapsed: 0.313 s - in org.springframework.cloud.dataflow.server.registry.RdbmsUriRegistryTests
02-Jul-2019 06:01:47 2019-07-02 06:01:47.273  INFO 10721 --- [     Thread-832] o.s.j.d.e.EmbeddedDatabaseFactory        : Shutting down embedded database: url='jdbc:h2:mem:testdb;DB_CLOSE_DELAY=-1;DB_CLOSE_ON_EXIT=false'
02-Jul-2019 06:01:47 2019-07-02 06:01:47.273  INFO 10721 --- [     Thread-835] o.s.j.d.e.EmbeddedDatabaseFactory        : Shutting down embedded database: url='jdbc:h2:mem:testdb;DB_CLOSE_DELAY=-1;DB_CLOSE_ON_EXIT=false'
02-Jul-2019 06:01:47 2019-07-02 06:01:47.273  INFO 10721 --- [     Thread-829] o.s.j.d.e.EmbeddedDatabaseFactory        : Shutting down embedded database: url='jdbc:h2:mem:testdb;DB_CLOSE_DELAY=-1;DB_CLOSE_ON_EXIT=false'
02-Jul-2019 06:01:47 2019-07-02 06:01:47.273  INFO 10721 --- [     Thread-841] o.s.j.d.e.EmbeddedDatabaseFactory        : Shutting down embedded database: url='jdbc:h2:mem:testdb;DB_CLOSE_DELAY=-1;DB_CLOSE_ON_EXIT=false'
02-Jul-2019 06:01:47 2019-07-02 06:01:47.290  INFO 10721 --- [     Thread-838] j.LocalContainerEntityManagerFactoryBean : Closing JPA EntityManagerFactory for persistence unit 'default'
02-Jul-2019 06:01:47 2019-07-02 06:01:47.290  INFO 10721 --- [     Thread-838] .SchemaDropperImpl$DelayedDropActionImpl : HHH000477: Starting delayed drop of schema as part of SessionFactory shut-down'
02-Jul-2019 06:01:47 2019-07-02 06:01:47.291  INFO 10721 --- [     Thread-838] o.s.j.d.e.EmbeddedDatabaseFactory        : Shutting down embedded database: url='jdbc:h2:mem:testdb;DB_CLOSE_DELAY=-1;DB_CLOSE_ON_EXIT=false'
02-Jul-2019 06:01:47 [INFO]
02-Jul-2019 06:01:47 [INFO] Results:
02-Jul-2019 06:01:47 [INFO]
02-Jul-2019 06:01:47 [ERROR] Failures:
02-Jul-2019 06:01:47 [ERROR]   ResourceUtilsTests.testFileResourceProcessing:84 expected:<"http[]://springcloudstream...> but was:<"http[s]://springcloudstream...>
02-Jul-2019 06:01:47 [INFO]
02-Jul-2019 06:01:47 [ERROR] Tests run: 427, Failures: 1, Errors: 0, Skipped: 3
02-Jul-2019 06:01:47 [INFO]
02-Jul-2019 06:01:47 [INFO] ------------------------------------------------------------------------
02-Jul-2019 06:01:47 [INFO] Reactor Summary:
02-Jul-2019 06:01:47 [INFO]
02-Jul-2019 06:01:47 [INFO] spring-cloud-dataflow-parent 1.7.5.BUILD-SNAPSHOT .. SUCCESS [  2.935 s]
02-Jul-2019 06:01:47 [INFO] spring-cloud-dataflow-configuration-metadata ....... SUCCESS [  6.451 s]
02-Jul-2019 06:01:47 [INFO] spring-cloud-dataflow-core ......................... SUCCESS [  5.822 s]
02-Jul-2019 06:01:47 [INFO] spring-cloud-dataflow-registry ..................... SUCCESS [  9.251 s]
02-Jul-2019 06:01:47 [INFO] spring-cloud-dataflow-rest-resource ................ SUCCESS [  7.894 s]
02-Jul-2019 06:01:47 [INFO] spring-cloud-dataflow-completion ................... SUCCESS [  6.899 s]
02-Jul-2019 06:01:47 [INFO] spring-cloud-dataflow-server-core .................. FAILURE [03:11 min]
02-Jul-2019 06:01:47 [INFO] spring-cloud-dataflow-server-local-autoconfig ...... SKIPPED
02-Jul-2019 06:01:47 [INFO] spring-cloud-starter-dataflow-server-local ......... SKIPPED
02-Jul-2019 06:01:47 [INFO] Spring Cloud Data Flow Local Server ................ SKIPPED
02-Jul-2019 06:01:47 [INFO] spring-cloud-dataflow-rest-client .................. SKIPPED
02-Jul-2019 06:01:47 [INFO] spring-cloud-dataflow-shell-core ................... SKIPPED
02-Jul-2019 06:01:47 [INFO] spring-cloud-dataflow-shell ........................ SKIPPED
02-Jul-2019 06:01:47 [INFO] Spring Cloud Data Flow Docs for Classic mode ....... SKIPPED
02-Jul-2019 06:01:47 [INFO] Spring Cloud Data Flow Skipper Docs ................ SKIPPED
02-Jul-2019 06:01:47 [INFO] Spring Cloud Data Flow Docs ........................ SKIPPED
02-Jul-2019 06:01:47 [INFO] spring-cloud-dataflow-dependencies 1.7.5.BUILD-SNAPSHOT SKIPPED
02-Jul-2019 06:01:47 [INFO] ------------------------------------------------------------------------
02-Jul-2019 06:01:47 [INFO] BUILD FAILURE
02-Jul-2019 06:01:47 [INFO] ------------------------------------------------------------------------
02-Jul-2019 06:01:47 [INFO] Total time: 03:53 min
02-Jul-2019 06:01:47 [INFO] Finished at: 2019-07-02T06:01:47Z
02-Jul-2019 06:01:47 [INFO] ------------------------------------------------------------------------
02-Jul-2019 06:01:47 [ERROR] Failed to execute goal org.apache.maven.plugins:maven-surefire-plugin:2.22.0:test (default-test) on project spring-cloud-dataflow-server-core: There are test failures.
02-Jul-2019 06:01:47 [ERROR]
02-Jul-2019 06:01:47 [ERROR] Please refer to /opt/bamboo-home/xml-data/build-dir/SCD-SCDF17X-JOB1/spring-cloud-dataflow-server-core/target/surefire-reports for the individual test results.
02-Jul-2019 06:01:47 [ERROR] Please refer to dump files (if any exist) [date]-jvmRun[N].dump, [date].dumpstream and [date]-jvmRun[N].dumpstream.
02-Jul-2019 06:01:47 [ERROR] -> [Help 1]
02-Jul-2019 06:01:47 [ERROR]
02-Jul-2019 06:01:47 [ERROR] To see the full stack trace of the errors, re-run Maven with the -e switch.
02-Jul-2019 06:01:47 [ERROR] Re-run Maven using the -X switch to enable full debug logging.
02-Jul-2019 06:01:47 [ERROR]
02-Jul-2019 06:01:47 [ERROR] For more information about the errors and possible solutions, please read the following articles:
02-Jul-2019 06:01:47 [ERROR] [Help 1] http://cwiki.apache.org/confluence/display/MAVEN/MojoFailureException
02-Jul-2019 06:01:47 [ERROR]
02-Jul-2019 06:01:47 [ERROR] After correcting the problems, you can resume the build with the command
02-Jul-2019 06:01:47 [ERROR]   mvn <goals> -rf :spring-cloud-dataflow-server-core
02-Jul-2019 06:01:47
02-Jul-2019 06:01:47 Failing task since return code of [/opt/jdk-8/bin/java -cp /opt/maven-3.5/boot/plexus-classworlds-2.5.2.jar -Dclassworlds.conf=/tmp/artifactoryM28526335756762616231conf -DbuildInfoConfig.propertiesFile=/tmp/buildInfo3309600796331996512.properties -Xmx2048m -XX:MaxPermSize=1024m -Dmaven.home=/opt/maven-3.5 -Dmaven.multiModuleProjectDirectory=/opt/bamboo-home/xml-data/build-dir/SCD-SCDF17X-JOB1 org.codehaus.plexus.classworlds.launcher.Launcher -s .settings.xml clean install -Pfull --batch-mode -U -Dartifactory.publish.password=********] was 1 while expected 0
02-Jul-2019 06:01:47 Parsing test results under /opt/bamboo-home/xml-data/build-dir/SCD-SCDF17X-JOB1...
02-Jul-2019 06:01:48 Finished task 'Build and publish Spring Cloud Data' with result: Failed
02-Jul-2019 06:01:48 Running post build plugin 'Docker Container Cleanup'
02-Jul-2019 06:01:48 Running post build plugin 'NCover Results Collector'
02-Jul-2019 06:01:48 Running post build plugin 'Artifactory Release Management Staging'
02-Jul-2019 06:01:48 Running post build plugin 'Artifactory Build Info Copier'
02-Jul-2019 06:01:48 Running post build plugin 'Artifactory Gradle Properties Info Copier'
02-Jul-2019 06:01:48 Running post build plugin 'Clover Results Collector'
02-Jul-2019 06:01:48 Running post build plugin 'npm Cache Cleanup'
02-Jul-2019 06:01:48 Running post build plugin 'Artifact Copier'
02-Jul-2019 06:01:48 Publishing an artifact: Test Results
02-Jul-2019 06:01:48 Finished publishing of artifact Non required shared artifact: [Test Results], pattern: [**/target/surefire-reports/**/*.*] in 168.6 ms
02-Jul-2019 06:01:48 Successfully removed working directory at '/opt/bamboo-home/xml-data/build-dir/SCD-SCDF17X-JOB1'
02-Jul-2019 06:01:48 Finalising the build...
02-Jul-2019 06:01:48 Stopping timer.
02-Jul-2019 06:01:48 Build SCD-SCDF17X-JOB1-70 completed.
02-Jul-2019 06:01:48 Running on server: post build plugin 'NCover Results Collector'
02-Jul-2019 06:01:48 Running on server: post build plugin 'Build Hanging Detection Configuration'
02-Jul-2019 06:01:48 Running on server: post build plugin 'Clover Delta Calculator'
02-Jul-2019 06:01:48 Running on server: post build plugin 'Maven Dependencies Postprocessor'
02-Jul-2019 06:01:48 All post build plugins have finished
02-Jul-2019 06:01:48 Generating build results summary...
02-Jul-2019 06:01:48 Saving build results to disk...
02-Jul-2019 06:01:48 Logging substituted variables...
02-Jul-2019 06:01:48 Indexing build results...
02-Jul-2019 06:01:48 Finished building SCD-SCDF17X-JOB1-70.