Spring Cloud Data Flow 2.0.x

Build: #21 failed Manual run by Mark Pollack

Stages & jobs

  1. Default Stage

  2. Build Docker Images and upload

Build result summary

Details

Completed
Duration
6 minutes
Labels
None
Agent
bamboo-17.af.pivotal.io
Revision
b6b601a54996c638525336a44b87b227df9598a0 b6b601a54996c638525336a44b87b227df9598a0
Total tests
1008
Failing since
#19 (Manual run by Mark Pollack)
Fixed in
#33 (Manual run by Janne Valkealahti)

Tests

Responsible

This build has been failing since #19
No one has taken responsibility

Configuration changes

Plan configuration has changed since the last successful build. See the plan audit log for more details.

Some of the jobs or stages referenced by this result no longer exist.

Tests

New test failures 2
Status Test View job Duration
Collapse Failed LocalServerSecurityWithUsersFileTests testEndpointAuthentication[Authentication Test 23 - POST /apps - Returns: 201 CREATED] History
Build and install SCDF < 1 sec
java.lang.AssertionError: Assertion failed for parameters - httpMethod: POST, URL: /apps, URL parameters: {force=false, uri=http://repo.spring.io/libs-release/org/springframework/cloud/stream/app/spring-cloud-stream-app-descriptor/Celsius.SR1/spring-cloud-stream-app-descriptor-Celsius.SR1.stream-apps-rabbit-maven, apps=app=is_ignored}, user credentials: org.springframework.cloud.dataflow.server.single.security.LocalServerSecurityWithUsersFileTests$UserCredentials@5c4ba0e3
	at org.springframework.cloud.dataflow.server.single.security.LocalServerSecurityWithUsersFileTests.testEndpointAuthentication(LocalServerSecurityWithUsersFileTests.java:698)
Caused by: java.lang.AssertionError: Status expected:<201> but was:<500>
	at org.springframework.cloud.dataflow.server.single.security.LocalServerSecurityWithUsersFileTests.testEndpointAuthentication(LocalServerSecurityWithUsersFileTests.java:695)
Collapse Failed LocalServerSecurityWithUsersFileTests testEndpointAuthentication[Authentication Test 24 - POST /apps - Returns: 201 CREATED] History
Build and install SCDF < 1 sec
java.lang.AssertionError: Assertion failed for parameters - httpMethod: POST, URL: /apps, URL parameters: {force=false, uri=http://repo.spring.io/libs-release/org/springframework/cloud/stream/app/spring-cloud-stream-app-descriptor/Celsius.SR1/spring-cloud-stream-app-descriptor-Celsius.SR1.stream-apps-rabbit-maven}, user credentials: org.springframework.cloud.dataflow.server.single.security.LocalServerSecurityWithUsersFileTests$UserCredentials@5c4ba0e3
	at org.springframework.cloud.dataflow.server.single.security.LocalServerSecurityWithUsersFileTests.testEndpointAuthentication(LocalServerSecurityWithUsersFileTests.java:698)
Caused by: java.lang.AssertionError: Status expected:<201> but was:<500>
	at org.springframework.cloud.dataflow.server.single.security.LocalServerSecurityWithUsersFileTests.testEndpointAuthentication(LocalServerSecurityWithUsersFileTests.java:695)