Spring Cloud Data Flow 2.0.x

Build: #31 failed Manual run by Ilayaperumal Gopinathan

Stages & jobs

  1. Default Stage

  2. Build Docker Images and upload

Build result summary

Details

Completed
Duration
7 minutes
Labels
None
Agent
bamboo-17.af.pivotal.io
Revision
c01dcd777d18baf99dd885e4f112e5b5c969a641 c01dcd777d18baf99dd885e4f112e5b5c969a641
Total tests
1008
Failing since
#19 (Manual run by Mark Pollack)
Fixed in
#33 (Manual run by Janne Valkealahti)

Tests

Responsible

Configuration changes

Plan configuration has changed since the last successful build. See the plan audit log for more details.

Some of the jobs or stages referenced by this result no longer exist.

Tests

Existing test failures 2
Status Test Failing since View job Duration
java.lang.AssertionError: Assertion failed for parameters - httpMethod: POST, URL: /apps, URL parameters: {force=false, uri=http://repo.spring.io/libs-release/org/springframework/cloud/stream/app/spring-cloud-stream-app-descriptor/Celsius.SR1/spring-cloud-stream-app-descriptor-Celsius.SR1.stream-apps-rabbit-maven, apps=app=is_ignored}, user credentials: org.springframework.cloud.dataflow.server.single.security.LocalServerSecurityWithUsersFileTests$UserCredentials@129bca3
	at org.springframework.cloud.dataflow.server.single.security.LocalServerSecurityWithUsersFileTests.testEndpointAuthentication(LocalServerSecurityWithUsersFileTests.java:698)
Caused by: java.lang.AssertionError: Status expected:<201> but was:<500>
	at org.springframework.cloud.dataflow.server.single.security.LocalServerSecurityWithUsersFileTests.testEndpointAuthentication(LocalServerSecurityWithUsersFileTests.java:695)
java.lang.AssertionError: Assertion failed for parameters - httpMethod: POST, URL: /apps, URL parameters: {force=false, uri=http://repo.spring.io/libs-release/org/springframework/cloud/stream/app/spring-cloud-stream-app-descriptor/Celsius.SR1/spring-cloud-stream-app-descriptor-Celsius.SR1.stream-apps-rabbit-maven}, user credentials: org.springframework.cloud.dataflow.server.single.security.LocalServerSecurityWithUsersFileTests$UserCredentials@129bca3
	at org.springframework.cloud.dataflow.server.single.security.LocalServerSecurityWithUsersFileTests.testEndpointAuthentication(LocalServerSecurityWithUsersFileTests.java:698)
Caused by: java.lang.AssertionError: Status expected:<201> but was:<500>
	at org.springframework.cloud.dataflow.server.single.security.LocalServerSecurityWithUsersFileTests.testEndpointAuthentication(LocalServerSecurityWithUsersFileTests.java:695)