Spring Cloud Data Flow 2.0.x

Build: #31 failed Manual run by Ilayaperumal Gopinathan

Stages & jobs

  1. Default Stage

  2. Build Docker Images and upload

Test results

  • 1,008 tests in total
  • 2 tests failed
  • 11 tests were quarantined / skipped
  • 3 minutes taken in total.
Existing test failures 2
Status Test Failing since View job Duration
java.lang.AssertionError: Assertion failed for parameters - httpMethod: POST, URL: /apps, URL parameters: {force=false, uri=http://repo.spring.io/libs-release/org/springframework/cloud/stream/app/spring-cloud-stream-app-descriptor/Celsius.SR1/spring-cloud-stream-app-descriptor-Celsius.SR1.stream-apps-rabbit-maven, apps=app=is_ignored}, user credentials: org.springframework.cloud.dataflow.server.single.security.LocalServerSecurityWithUsersFileTests$UserCredentials@129bca3
	at org.springframework.cloud.dataflow.server.single.security.LocalServerSecurityWithUsersFileTests.testEndpointAuthentication(LocalServerSecurityWithUsersFileTests.java:698)
Caused by: java.lang.AssertionError: Status expected:<201> but was:<500>
	at org.springframework.cloud.dataflow.server.single.security.LocalServerSecurityWithUsersFileTests.testEndpointAuthentication(LocalServerSecurityWithUsersFileTests.java:695)
java.lang.AssertionError: Assertion failed for parameters - httpMethod: POST, URL: /apps, URL parameters: {force=false, uri=http://repo.spring.io/libs-release/org/springframework/cloud/stream/app/spring-cloud-stream-app-descriptor/Celsius.SR1/spring-cloud-stream-app-descriptor-Celsius.SR1.stream-apps-rabbit-maven}, user credentials: org.springframework.cloud.dataflow.server.single.security.LocalServerSecurityWithUsersFileTests$UserCredentials@129bca3
	at org.springframework.cloud.dataflow.server.single.security.LocalServerSecurityWithUsersFileTests.testEndpointAuthentication(LocalServerSecurityWithUsersFileTests.java:698)
Caused by: java.lang.AssertionError: Status expected:<201> but was:<500>
	at org.springframework.cloud.dataflow.server.single.security.LocalServerSecurityWithUsersFileTests.testEndpointAuthentication(LocalServerSecurityWithUsersFileTests.java:695)
Skipped tests 11
Status Test Failing since View job
Skipped StreamDefinitionToDslConverterTests quotesInParams History
Build and install SCDF
Skipped StreamDefinitionToDslConverterTests testXD2416_2 History
Build and install SCDF
Skipped StreamDefinitionToDslConverterTests testXD2416_1 History
Build and install SCDF
Skipped TaskParserTests transitionToSplit History
Build and install SCDF
Skipped DataFlowServerConfigurationTests testStartEmbeddedH2Server History
Build and install SCDF
Skipped LocalServerSecurityWithLdapSearchAndBindSslTests org.springframework.cloud.dataflow.server.local.security.LocalServerSecurityWithLdapSearchAndBindSslTests History
Build and install SCDF
Skipped LocalServerSecurityWithLdapSearchAndBindTests org.springframework.cloud.dataflow.server.local.security.LocalServerSecurityWithLdapSearchAndBindTests History
Build and install SCDF
Skipped LocalServerSecurityWithLdapSimpleBindAndDefaultManagementTests org.springframework.cloud.dataflow.server.local.security.LocalServerSecurityWithLdapSimpleBindAndDefaultManagementTests History
Build and install SCDF
Skipped LocalServerSecurityWithLdapSimpleBindGroupMappingTests org.springframework.cloud.dataflow.server.local.security.LocalServerSecurityWithLdapSimpleBindGroupMappingTests History
Build and install SCDF
Skipped LocalServerSecurityWithLdapSimpleBindTests org.springframework.cloud.dataflow.server.local.security.LocalServerSecurityWithLdapSimpleBindTests History
Build and install SCDF
Skipped LocalConfigurationTests org.springframework.cloud.dataflow.server.single.LocalConfigurationTests History
Build and install SCDF