Build: #2 failed

Job: Build and install SCDF failed

Stages & jobs

  1. Default Stage

Job result summary

Completed
Duration
6 minutes
Agent
bamboo-23.af.pivotal.io
Revision
2d1e77b2e6189f60d4fbe2dc7dd631e7ce6e6d37 2d1e77b2e6189f60d4fbe2dc7dd631e7ce6e6d37
Total tests
765
Fixed in
#4 (Manual run by Ilayaperumal Gopinathan)

Tests

  • 765 tests in total
  • 2 tests failed
  • 2 failures are new
  • 5 tests were quarantined / skipped
  • 3 minutes taken in total.
New test failures 2
Status Test Duration
Collapse Failed CloudFoundryTaskPlatformFactoryTests cloudFoundryTaskPlatformNoScheduler History
< 1 sec
java.lang.IllegalStateException: Missing runtimeEnvironmentInfo : 'org' required.
	at org.springframework.cloud.dataflow.server.config.cloudfoundry.CloudFoundryTaskPlatformFactoryTests.cloudFoundryTaskPlatformNoScheduler(CloudFoundryTaskPlatformFactoryTests.java:102)
Caused by: java.lang.IllegalArgumentException: Missing runtimeEnvironmentInfo : 'org' required.
	at org.springframework.cloud.dataflow.server.config.cloudfoundry.CloudFoundryTaskPlatformFactoryTests.cloudFoundryTaskPlatformNoScheduler(CloudFoundryTaskPlatformFactoryTests.java:102)
Collapse Failed CloudFoundryTaskPlatformFactoryTests cloudFoundryTaskPlatformWithScheduler History
< 1 sec
java.lang.IllegalStateException: Missing runtimeEnvironmentInfo : 'org' required.
	at org.springframework.cloud.dataflow.server.config.cloudfoundry.CloudFoundryTaskPlatformFactoryTests.cloudFoundryTaskPlatformWithScheduler(CloudFoundryTaskPlatformFactoryTests.java:136)
Caused by: java.lang.IllegalArgumentException: Missing runtimeEnvironmentInfo : 'org' required.
	at org.springframework.cloud.dataflow.server.config.cloudfoundry.CloudFoundryTaskPlatformFactoryTests.cloudFoundryTaskPlatformWithScheduler(CloudFoundryTaskPlatformFactoryTests.java:136)

Error summary

The build generated some errors. See the full build log for more details.

OpenJDK 64-Bit Server VM warning: ignoring option MaxPermSize=1024m; support was removed in 8.0