Spring Cloud Data Flow 2.5.x

Build: #15 failed Changes by Janne Valkealahti

Build result summary

Details

Completed
Duration
8 minutes
Labels
None
Agent
bamboo-21.af.pivotal.io
Revision
6d688b0484d47dcaf03e27cad2965495212e66d2 6d688b0484d47dcaf03e27cad2965495212e66d2
Total tests
1183
Fixed in
#16 (Manual run by Janne Valkealahti)

Tests

Responsible

Code commits

Author Commit Message Commit date
Janne Valkealahti Janne Valkealahti 6d688b0484d47dcaf03e27cad2965495212e66d2 6d688b0484d47dcaf03e27cad2965495212e66d2 Permit actuator info endpoint
- Backport #3974

Tests

New test failures 3
Status Test View job Duration
Collapse Failed LocalServerSecurityWithUsersFileTests testEndpointAuthentication[Authentication Test 283 - GET /management/info - Returns: 403 FORBIDDEN] History
Build and install SCDF < 1 sec
java.lang.AssertionError: Assertion failed for parameters - httpMethod: GET, URL: /management/info, URL parameters: null, user credentials: UserCredentials: bob/bobspassword.
	at org.springframework.cloud.dataflow.server.single.security.LocalServerSecurityWithUsersFileTests.testEndpointAuthentication(LocalServerSecurityWithUsersFileTests.java:703)
Caused by: java.lang.AssertionError: Status expected:<403> but was:<200>
	at org.springframework.cloud.dataflow.server.single.security.LocalServerSecurityWithUsersFileTests.testEndpointAuthentication(LocalServerSecurityWithUsersFileTests.java:700)
Collapse Failed LocalServerSecurityWithUsersFileTests testEndpointAuthentication[Authentication Test 284 - GET /management/info - Returns: 403 FORBIDDEN] History
Build and install SCDF < 1 sec
java.lang.AssertionError: Assertion failed for parameters - httpMethod: GET, URL: /management/info, URL parameters: null, user credentials: UserCredentials: cartman/cartmanpwd.
	at org.springframework.cloud.dataflow.server.single.security.LocalServerSecurityWithUsersFileTests.testEndpointAuthentication(LocalServerSecurityWithUsersFileTests.java:703)
Caused by: java.lang.AssertionError: Status expected:<403> but was:<200>
	at org.springframework.cloud.dataflow.server.single.security.LocalServerSecurityWithUsersFileTests.testEndpointAuthentication(LocalServerSecurityWithUsersFileTests.java:700)
Collapse Failed LocalServerSecurityWithUsersFileTests testEndpointAuthentication[Authentication Test 285 - GET /management/info - Returns: 401 UNAUTHORIZED] History
Build and install SCDF < 1 sec
java.lang.AssertionError: Assertion failed for parameters - httpMethod: GET, URL: /management/info, URL parameters: null, user credentials: null
	at org.springframework.cloud.dataflow.server.single.security.LocalServerSecurityWithUsersFileTests.testEndpointAuthentication(LocalServerSecurityWithUsersFileTests.java:703)
Caused by: java.lang.AssertionError: Status expected:<401> but was:<200>
	at org.springframework.cloud.dataflow.server.single.security.LocalServerSecurityWithUsersFileTests.testEndpointAuthentication(LocalServerSecurityWithUsersFileTests.java:700)