Spring Cloud Data Flow 2.5.x

Build: #15 failed Changes by Janne Valkealahti

Test results

  • 1,183 tests in total
  • 3 tests failed
  • 3 failures are new
  • 11 tests were quarantined / skipped
  • 4 minutes taken in total.
New test failures 3
Status Test View job Duration
Collapse Failed LocalServerSecurityWithUsersFileTests testEndpointAuthentication[Authentication Test 283 - GET /management/info - Returns: 403 FORBIDDEN] History
Build and install SCDF < 1 sec
java.lang.AssertionError: Assertion failed for parameters - httpMethod: GET, URL: /management/info, URL parameters: null, user credentials: UserCredentials: bob/bobspassword.
	at org.springframework.cloud.dataflow.server.single.security.LocalServerSecurityWithUsersFileTests.testEndpointAuthentication(LocalServerSecurityWithUsersFileTests.java:703)
Caused by: java.lang.AssertionError: Status expected:<403> but was:<200>
	at org.springframework.cloud.dataflow.server.single.security.LocalServerSecurityWithUsersFileTests.testEndpointAuthentication(LocalServerSecurityWithUsersFileTests.java:700)
Collapse Failed LocalServerSecurityWithUsersFileTests testEndpointAuthentication[Authentication Test 284 - GET /management/info - Returns: 403 FORBIDDEN] History
Build and install SCDF < 1 sec
java.lang.AssertionError: Assertion failed for parameters - httpMethod: GET, URL: /management/info, URL parameters: null, user credentials: UserCredentials: cartman/cartmanpwd.
	at org.springframework.cloud.dataflow.server.single.security.LocalServerSecurityWithUsersFileTests.testEndpointAuthentication(LocalServerSecurityWithUsersFileTests.java:703)
Caused by: java.lang.AssertionError: Status expected:<403> but was:<200>
	at org.springframework.cloud.dataflow.server.single.security.LocalServerSecurityWithUsersFileTests.testEndpointAuthentication(LocalServerSecurityWithUsersFileTests.java:700)
Collapse Failed LocalServerSecurityWithUsersFileTests testEndpointAuthentication[Authentication Test 285 - GET /management/info - Returns: 401 UNAUTHORIZED] History
Build and install SCDF < 1 sec
java.lang.AssertionError: Assertion failed for parameters - httpMethod: GET, URL: /management/info, URL parameters: null, user credentials: null
	at org.springframework.cloud.dataflow.server.single.security.LocalServerSecurityWithUsersFileTests.testEndpointAuthentication(LocalServerSecurityWithUsersFileTests.java:703)
Caused by: java.lang.AssertionError: Status expected:<401> but was:<200>
	at org.springframework.cloud.dataflow.server.single.security.LocalServerSecurityWithUsersFileTests.testEndpointAuthentication(LocalServerSecurityWithUsersFileTests.java:700)
Skipped tests 11
Status Test Failing since View job
Skipped StreamDefinitionToDslConverterTests testXD2416_1 History
Build and install SCDF
Skipped StreamDefinitionToDslConverterTests testXD2416_2 History
Build and install SCDF
Skipped StreamDefinitionToDslConverterTests quotesInParams History
Build and install SCDF
Skipped TaskParserTests transitionToSplit History
Build and install SCDF
Skipped DataFlowServerConfigurationTests testStartEmbeddedH2Server History
Build and install SCDF
Skipped LocalServerSecurityWithLdapSearchAndBindSslTests org.springframework.cloud.dataflow.server.local.security.LocalServerSecurityWithLdapSearchAndBindSslTests History
Build and install SCDF
Skipped LocalServerSecurityWithLdapSearchAndBindTests org.springframework.cloud.dataflow.server.local.security.LocalServerSecurityWithLdapSearchAndBindTests History
Build and install SCDF
Skipped LocalServerSecurityWithLdapSimpleBindAndDefaultManagementTests org.springframework.cloud.dataflow.server.local.security.LocalServerSecurityWithLdapSimpleBindAndDefaultManagementTests History
Build and install SCDF
Skipped LocalServerSecurityWithLdapSimpleBindGroupMappingTests org.springframework.cloud.dataflow.server.local.security.LocalServerSecurityWithLdapSimpleBindGroupMappingTests History
Build and install SCDF
Skipped LocalServerSecurityWithLdapSimpleBindTests org.springframework.cloud.dataflow.server.local.security.LocalServerSecurityWithLdapSimpleBindTests History
Build and install SCDF
Skipped LocalConfigurationTests org.springframework.cloud.dataflow.server.single.LocalConfigurationTests History
Build and install SCDF