Spring Cloud Data Flow 2.5.x

Build: #15 failed

Job: Build and install SCDF failed

Stages & jobs

  1. Default Stage

Job result summary

Completed
Duration
8 minutes
Agent
bamboo-21.af.pivotal.io
Revision
6d688b0484d47dcaf03e27cad2965495212e66d2 6d688b0484d47dcaf03e27cad2965495212e66d2
Total tests
1183
Fixed in
#16 (Manual run by Janne Valkealahti)

Tests

  • 1,183 tests in total
  • 3 tests failed
  • 3 failures are new
  • 11 tests were quarantined / skipped
  • 4 minutes taken in total.
New test failures 3
Status Test Duration
Collapse Failed LocalServerSecurityWithUsersFileTests testEndpointAuthentication[Authentication Test 283 - GET /management/info - Returns: 403 FORBIDDEN] History
< 1 sec
java.lang.AssertionError: Assertion failed for parameters - httpMethod: GET, URL: /management/info, URL parameters: null, user credentials: UserCredentials: bob/bobspassword.
	at org.springframework.cloud.dataflow.server.single.security.LocalServerSecurityWithUsersFileTests.testEndpointAuthentication(LocalServerSecurityWithUsersFileTests.java:703)
Caused by: java.lang.AssertionError: Status expected:<403> but was:<200>
	at org.springframework.cloud.dataflow.server.single.security.LocalServerSecurityWithUsersFileTests.testEndpointAuthentication(LocalServerSecurityWithUsersFileTests.java:700)
Collapse Failed LocalServerSecurityWithUsersFileTests testEndpointAuthentication[Authentication Test 284 - GET /management/info - Returns: 403 FORBIDDEN] History
< 1 sec
java.lang.AssertionError: Assertion failed for parameters - httpMethod: GET, URL: /management/info, URL parameters: null, user credentials: UserCredentials: cartman/cartmanpwd.
	at org.springframework.cloud.dataflow.server.single.security.LocalServerSecurityWithUsersFileTests.testEndpointAuthentication(LocalServerSecurityWithUsersFileTests.java:703)
Caused by: java.lang.AssertionError: Status expected:<403> but was:<200>
	at org.springframework.cloud.dataflow.server.single.security.LocalServerSecurityWithUsersFileTests.testEndpointAuthentication(LocalServerSecurityWithUsersFileTests.java:700)
Collapse Failed LocalServerSecurityWithUsersFileTests testEndpointAuthentication[Authentication Test 285 - GET /management/info - Returns: 401 UNAUTHORIZED] History
< 1 sec
java.lang.AssertionError: Assertion failed for parameters - httpMethod: GET, URL: /management/info, URL parameters: null, user credentials: null
	at org.springframework.cloud.dataflow.server.single.security.LocalServerSecurityWithUsersFileTests.testEndpointAuthentication(LocalServerSecurityWithUsersFileTests.java:703)
Caused by: java.lang.AssertionError: Status expected:<401> but was:<200>
	at org.springframework.cloud.dataflow.server.single.security.LocalServerSecurityWithUsersFileTests.testEndpointAuthentication(LocalServerSecurityWithUsersFileTests.java:700)

Error summary

The build generated some errors. See the full build log for more details.

OpenJDK 64-Bit Server VM warning: ignoring option MaxPermSize=1024m; support was removed in 8.0
Jun 09, 2020 4:38:34 PM okhttp3.mockwebserver.MockWebServer$3 execute
INFO: MockWebServer[52157] starting to accept connections