Spring Cloud Data Flow 2.5.x

Build: #15 failed

Job: Build and install SCDF failed

Stages & jobs

  1. Default Stage

Test results

  • 1,183 tests in total
  • 3 tests failed
  • 3 failures are new
  • 11 tests were quarantined / skipped
  • 4 minutes taken in total.

Build 15 has the following 3 errors: 3 new failure(s) occurred since the previous build.

New test failures 3
Status Test Duration
Collapse Failed LocalServerSecurityWithUsersFileTests testEndpointAuthentication[Authentication Test 283 - GET /management/info - Returns: 403 FORBIDDEN] History
< 1 sec
java.lang.AssertionError: Assertion failed for parameters - httpMethod: GET, URL: /management/info, URL parameters: null, user credentials: UserCredentials: bob/bobspassword.
	at org.springframework.cloud.dataflow.server.single.security.LocalServerSecurityWithUsersFileTests.testEndpointAuthentication(LocalServerSecurityWithUsersFileTests.java:703)
Caused by: java.lang.AssertionError: Status expected:<403> but was:<200>
	at org.springframework.cloud.dataflow.server.single.security.LocalServerSecurityWithUsersFileTests.testEndpointAuthentication(LocalServerSecurityWithUsersFileTests.java:700)
Collapse Failed LocalServerSecurityWithUsersFileTests testEndpointAuthentication[Authentication Test 284 - GET /management/info - Returns: 403 FORBIDDEN] History
< 1 sec
java.lang.AssertionError: Assertion failed for parameters - httpMethod: GET, URL: /management/info, URL parameters: null, user credentials: UserCredentials: cartman/cartmanpwd.
	at org.springframework.cloud.dataflow.server.single.security.LocalServerSecurityWithUsersFileTests.testEndpointAuthentication(LocalServerSecurityWithUsersFileTests.java:703)
Caused by: java.lang.AssertionError: Status expected:<403> but was:<200>
	at org.springframework.cloud.dataflow.server.single.security.LocalServerSecurityWithUsersFileTests.testEndpointAuthentication(LocalServerSecurityWithUsersFileTests.java:700)
Collapse Failed LocalServerSecurityWithUsersFileTests testEndpointAuthentication[Authentication Test 285 - GET /management/info - Returns: 401 UNAUTHORIZED] History
< 1 sec
java.lang.AssertionError: Assertion failed for parameters - httpMethod: GET, URL: /management/info, URL parameters: null, user credentials: null
	at org.springframework.cloud.dataflow.server.single.security.LocalServerSecurityWithUsersFileTests.testEndpointAuthentication(LocalServerSecurityWithUsersFileTests.java:703)
Caused by: java.lang.AssertionError: Status expected:<401> but was:<200>
	at org.springframework.cloud.dataflow.server.single.security.LocalServerSecurityWithUsersFileTests.testEndpointAuthentication(LocalServerSecurityWithUsersFileTests.java:700)