Spring Cloud Data Flow Samples

Build: #84 failed

Job: Build SCDF Samples failed

Stages & jobs

  1. Default Stage

  2. Build Module Launcher Docker Image and upload

Build log

The build generated 2,657 lines of output.The output is too long and has been truncated to the last 1,000 lines. Download or view full build log

26-Jul-2019 07:25:29 400/427 KB   348/497 KB   10/10 KB   396/927 KB   
26-Jul-2019 07:25:29 400/427 KB   352/497 KB   10/10 KB   396/927 KB   
26-Jul-2019 07:25:29 400/427 KB   352/497 KB   10/10 KB   400/927 KB   
26-Jul-2019 07:25:29 404/427 KB   352/497 KB   10/10 KB   400/927 KB   
26-Jul-2019 07:25:29 408/427 KB   352/497 KB   10/10 KB   400/927 KB   
26-Jul-2019 07:25:29 412/427 KB   352/497 KB   10/10 KB   400/927 KB   
26-Jul-2019 07:25:29 416/427 KB   352/497 KB   10/10 KB   400/927 KB   
26-Jul-2019 07:25:29 416/427 KB   356/497 KB   10/10 KB   400/927 KB   
26-Jul-2019 07:25:29 416/427 KB   360/497 KB   10/10 KB   400/927 KB   
26-Jul-2019 07:25:29 416/427 KB   360/497 KB   10/10 KB   404/927 KB   
26-Jul-2019 07:25:29 416/427 KB   364/497 KB   10/10 KB   404/927 KB   
26-Jul-2019 07:25:29 416/427 KB   368/497 KB   10/10 KB   404/927 KB   
26-Jul-2019 07:25:29 416/427 KB   368/497 KB   10/10 KB   408/927 KB   
26-Jul-2019 07:25:29 420/427 KB   368/497 KB   10/10 KB   408/927 KB   
26-Jul-2019 07:25:29 420/427 KB   368/497 KB   10/10 KB   412/927 KB   
26-Jul-2019 07:25:29 424/427 KB   368/497 KB   10/10 KB   412/927 KB   
26-Jul-2019 07:25:29 424/427 KB   368/497 KB   10/10 KB   416/927 KB   
26-Jul-2019 07:25:29 427/427 KB   368/497 KB   10/10 KB   416/927 KB   
26-Jul-2019 07:25:29 427/427 KB   368/497 KB   10/10 KB   420/927 KB   
26-Jul-2019 07:25:29 427/427 KB   368/497 KB   10/10 KB   424/927 KB   
26-Jul-2019 07:25:29 427/427 KB   368/497 KB   10/10 KB   428/927 KB   
26-Jul-2019 07:25:29 427/427 KB   372/497 KB   10/10 KB   428/927 KB   
26-Jul-2019 07:25:29 427/427 KB   372/497 KB   10/10 KB   432/927 KB   
26-Jul-2019 07:25:29 427/427 KB   376/497 KB   10/10 KB   432/927 KB   
26-Jul-2019 07:25:29 427/427 KB   380/497 KB   10/10 KB   432/927 KB   
26-Jul-2019 07:25:29 427/427 KB   384/497 KB   10/10 KB   432/927 KB   
26-Jul-2019 07:25:29 427/427 KB   384/497 KB   10/10 KB   436/927 KB   
26-Jul-2019 07:25:29 427/427 KB   384/497 KB   10/10 KB   440/927 KB   
26-Jul-2019 07:25:29 427/427 KB   388/497 KB   10/10 KB   444/927 KB   
26-Jul-2019 07:25:29 427/427 KB   388/497 KB   10/10 KB   444/927 KB   
26-Jul-2019 07:25:29 427/427 KB   392/497 KB   10/10 KB   444/927 KB   
26-Jul-2019 07:25:29 427/427 KB   396/497 KB   10/10 KB   448/927 KB   
26-Jul-2019 07:25:29 427/427 KB   396/497 KB   10/10 KB   448/927 KB   
26-Jul-2019 07:25:29 427/427 KB   400/497 KB   10/10 KB   448/927 KB   
26-Jul-2019 07:25:29 427/427 KB   404/497 KB   10/10 KB   452/927 KB   
26-Jul-2019 07:25:29 427/427 KB   404/497 KB   10/10 KB   452/927 KB   
26-Jul-2019 07:25:29 427/427 KB   408/497 KB   10/10 KB   452/927 KB   
26-Jul-2019 07:25:29 427/427 KB   408/497 KB   10/10 KB   456/927 KB   
26-Jul-2019 07:25:29 427/427 KB   412/497 KB   10/10 KB   456/927 KB   
26-Jul-2019 07:25:29 427/427 KB   416/497 KB   10/10 KB   456/927 KB   
26-Jul-2019 07:25:29 427/427 KB   416/497 KB   10/10 KB   460/927 KB   
26-Jul-2019 07:25:29 427/427 KB   416/497 KB   10/10 KB   464/927 KB   
26-Jul-2019 07:25:29 427/427 KB   416/497 KB   10/10 KB   468/927 KB   
26-Jul-2019 07:25:29 427/427 KB   416/497 KB   10/10 KB   472/927 KB   
26-Jul-2019 07:25:29 427/427 KB   416/497 KB   10/10 KB   476/927 KB   
26-Jul-2019 07:25:29 427/427 KB   420/497 KB   10/10 KB   476/927 KB   
26-Jul-2019 07:25:29 427/427 KB   420/497 KB   10/10 KB   480/927 KB   
26-Jul-2019 07:25:29 427/427 KB   424/497 KB   10/10 KB   480/927 KB   
26-Jul-2019 07:25:29 427/427 KB   428/497 KB   10/10 KB   480/927 KB   
26-Jul-2019 07:25:29 427/427 KB   432/497 KB   10/10 KB   480/927 KB   
26-Jul-2019 07:25:29 427/427 KB   432/497 KB   10/10 KB   484/927 KB   
26-Jul-2019 07:25:29 427/427 KB   432/497 KB   10/10 KB   488/927 KB   
26-Jul-2019 07:25:29 427/427 KB   432/497 KB   10/10 KB   492/927 KB   
26-Jul-2019 07:25:29 427/427 KB   432/497 KB   10/10 KB   496/927 KB   
26-Jul-2019 07:25:29 427/427 KB   436/497 KB   10/10 KB   496/927 KB   
26-Jul-2019 07:25:29 427/427 KB   440/497 KB   10/10 KB   496/927 KB   
26-Jul-2019 07:25:29 427/427 KB   444/497 KB   10/10 KB   496/927 KB   
26-Jul-2019 07:25:29 427/427 KB   448/497 KB   10/10 KB   496/927 KB   
26-Jul-2019 07:25:29 427/427 KB   448/497 KB   10/10 KB   500/927 KB   
26-Jul-2019 07:25:29 427/427 KB   448/497 KB   10/10 KB   504/927 KB   
26-Jul-2019 07:25:29 427/427 KB   448/497 KB   10/10 KB   508/927 KB   
26-Jul-2019 07:25:29 427/427 KB   448/497 KB   10/10 KB   512/927 KB   
26-Jul-2019 07:25:29 427/427 KB   448/497 KB   10/10 KB   516/927 KB   
26-Jul-2019 07:25:29 427/427 KB   452/497 KB   10/10 KB   516/927 KB   
26-Jul-2019 07:25:29 427/427 KB   452/497 KB   10/10 KB   520/927 KB   
26-Jul-2019 07:25:29 427/427 KB   452/497 KB   10/10 KB   524/927 KB   
26-Jul-2019 07:25:29 427/427 KB   456/497 KB   10/10 KB   528/927 KB   
26-Jul-2019 07:25:29 427/427 KB   456/497 KB   10/10 KB   528/927 KB   
26-Jul-2019 07:25:29 427/427 KB   460/497 KB   10/10 KB   528/927 KB   
26-Jul-2019 07:25:29 427/427 KB   464/497 KB   10/10 KB   528/927 KB   
26-Jul-2019 07:25:29 427/427 KB   464/497 KB   10/10 KB   532/927 KB   
26-Jul-2019 07:25:29 427/427 KB   464/497 KB   10/10 KB   536/927 KB   
26-Jul-2019 07:25:29 427/427 KB   464/497 KB   10/10 KB   540/927 KB   
26-Jul-2019 07:25:29 427/427 KB   464/497 KB   10/10 KB   544/927 KB   
26-Jul-2019 07:25:29 427/427 KB   468/497 KB   10/10 KB   544/927 KB   
26-Jul-2019 07:25:29 427/427 KB   472/497 KB   10/10 KB   544/927 KB   
26-Jul-2019 07:25:29 427/427 KB   476/497 KB   10/10 KB   544/927 KB   
26-Jul-2019 07:25:29 427/427 KB   480/497 KB   10/10 KB   544/927 KB   
26-Jul-2019 07:25:29 427/427 KB   484/497 KB   10/10 KB   544/927 KB   
26-Jul-2019 07:25:29 427/427 KB   488/497 KB   10/10 KB   544/927 KB   
26-Jul-2019 07:25:29 427/427 KB   492/497 KB   10/10 KB   544/927 KB   
26-Jul-2019 07:25:29 427/427 KB   492/497 KB   10/10 KB   544/927 KB   406/406 B   
26-Jul-2019 07:25:29 427/427 KB   496/497 KB   10/10 KB   544/927 KB   406/406 B   
26-Jul-2019 07:25:29 427/427 KB   497/497 KB   10/10 KB   544/927 KB   406/406 B   
26-Jul-2019 07:25:29 427/427 KB   497/497 KB   10/10 KB   548/927 KB   406/406 B   
26-Jul-2019 07:25:29 427/427 KB   497/497 KB   10/10 KB   552/927 KB   406/406 B   
26-Jul-2019 07:25:29 427/427 KB   497/497 KB   10/10 KB   556/927 KB   406/406 B   
26-Jul-2019 07:25:29 427/427 KB   497/497 KB   10/10 KB   560/927 KB   406/406 B   
26-Jul-2019 07:25:29 427/427 KB   497/497 KB   10/10 KB   564/927 KB   406/406 B   
26-Jul-2019 07:25:29 427/427 KB   497/497 KB   10/10 KB   568/927 KB   406/406 B   
26-Jul-2019 07:25:29 427/427 KB   497/497 KB   10/10 KB   572/927 KB   406/406 B   
26-Jul-2019 07:25:29 427/427 KB   497/497 KB   10/10 KB   576/927 KB   406/406 B   
26-Jul-2019 07:25:29 427/427 KB   497/497 KB   10/10 KB   580/927 KB   406/406 B   
26-Jul-2019 07:25:29 427/427 KB   497/497 KB   10/10 KB   584/927 KB   406/406 B   
26-Jul-2019 07:25:29 427/427 KB   497/497 KB   10/10 KB   588/927 KB   406/406 B   
26-Jul-2019 07:25:29 427/427 KB   497/497 KB   10/10 KB   592/927 KB   406/406 B   
26-Jul-2019 07:25:29 427/427 KB   497/497 KB   10/10 KB   596/927 KB   406/406 B   
26-Jul-2019 07:25:29 427/427 KB   497/497 KB   10/10 KB   600/927 KB   406/406 B   
26-Jul-2019 07:25:29 427/427 KB   497/497 KB   10/10 KB   604/927 KB   406/406 B   
26-Jul-2019 07:25:29 427/427 KB   497/497 KB   10/10 KB   608/927 KB   406/406 B   
26-Jul-2019 07:25:29 427/427 KB   497/497 KB   10/10 KB   612/927 KB   406/406 B   
26-Jul-2019 07:25:29 427/427 KB   497/497 KB   10/10 KB   616/927 KB   406/406 B   
26-Jul-2019 07:25:29 427/427 KB   497/497 KB   10/10 KB   620/927 KB   406/406 B   
26-Jul-2019 07:25:29 427/427 KB   497/497 KB   10/10 KB   624/927 KB   406/406 B   
26-Jul-2019 07:25:29 427/427 KB   497/497 KB   10/10 KB   628/927 KB   406/406 B   
26-Jul-2019 07:25:29 427/427 KB   497/497 KB   10/10 KB   632/927 KB   406/406 B   
26-Jul-2019 07:25:29 427/427 KB   497/497 KB   10/10 KB   636/927 KB   406/406 B   
26-Jul-2019 07:25:29 427/427 KB   497/497 KB   10/10 KB   640/927 KB   406/406 B   
26-Jul-2019 07:25:29 427/427 KB   497/497 KB   10/10 KB   644/927 KB   406/406 B   
26-Jul-2019 07:25:29 427/427 KB   497/497 KB   10/10 KB   648/927 KB   406/406 B   
26-Jul-2019 07:25:29 427/427 KB   497/497 KB   10/10 KB   652/927 KB   406/406 B   
26-Jul-2019 07:25:29 427/427 KB   497/497 KB   10/10 KB   656/927 KB   406/406 B   
26-Jul-2019 07:25:29 427/427 KB   497/497 KB   10/10 KB   660/927 KB   406/406 B   
26-Jul-2019 07:25:29 427/427 KB   497/497 KB   10/10 KB   664/927 KB   406/406 B   
26-Jul-2019 07:25:29 427/427 KB   497/497 KB   10/10 KB   668/927 KB   406/406 B   
26-Jul-2019 07:25:29 427/427 KB   497/497 KB   10/10 KB   672/927 KB   406/406 B   
26-Jul-2019 07:25:29                                                              
26-Jul-2019 07:25:29 427/427 KB   497/497 KB   676/927 KB   406/406 B             
26-Jul-2019 07:25:29 427/427 KB   497/497 KB   680/927 KB   406/406 B   
26-Jul-2019 07:25:29 Downloaded: https://repo.maven.apache.org/maven2/org/springframework/cloud/stream/app/app-starters-security-common/2.1.0.RELEASE/app-starters-security-common-2.1.0.RELEASE.jar (10 KB at 28.1 KB/sec)
26-Jul-2019 07:25:29 427/427 KB   497/497 KB   684/927 KB   406/406 B   
26-Jul-2019 07:25:29 Downloading: https://repo.maven.apache.org/maven2/org/springframework/boot/spring-boot-starter-json/2.1.3.RELEASE/spring-boot-starter-json-2.1.3.RELEASE.jar
26-Jul-2019 07:25:29 427/427 KB   497/497 KB   688/927 KB   406/406 B   
26-Jul-2019 07:25:29 427/427 KB   497/497 KB   692/927 KB   406/406 B   
26-Jul-2019 07:25:29 427/427 KB   497/497 KB   696/927 KB   406/406 B   
26-Jul-2019 07:25:29 427/427 KB   497/497 KB   700/927 KB   406/406 B   
26-Jul-2019 07:25:29 427/427 KB   497/497 KB   704/927 KB   406/406 B   
26-Jul-2019 07:25:29                                                    
26-Jul-2019 07:25:29 Downloaded: https://repo.maven.apache.org/maven2/org/springframework/boot/spring-boot-actuator-autoconfigure/2.1.3.RELEASE/spring-boot-actuator-autoconfigure-2.1.3.RELEASE.jar (427 KB at 1259.5 KB/sec)
26-Jul-2019 07:25:29 Downloading: https://repo.maven.apache.org/maven2/org/springframework/boot/spring-boot-starter-tomcat/2.1.3.RELEASE/spring-boot-starter-tomcat-2.1.3.RELEASE.jar
26-Jul-2019 07:25:29 497/497 KB   708/927 KB   406/406 B               
26-Jul-2019 07:25:29 497/497 KB   712/927 KB   406/406 B   
26-Jul-2019 07:25:29 497/497 KB   716/927 KB   406/406 B   
26-Jul-2019 07:25:29 497/497 KB   720/927 KB   406/406 B   
26-Jul-2019 07:25:29 497/497 KB   724/927 KB   406/406 B   
26-Jul-2019 07:25:29 497/497 KB   728/927 KB   406/406 B   
26-Jul-2019 07:25:29 497/497 KB   732/927 KB   406/406 B   
26-Jul-2019 07:25:29 497/497 KB   736/927 KB   406/406 B   
26-Jul-2019 07:25:29 497/497 KB   740/927 KB   406/406 B   
26-Jul-2019 07:25:29 497/497 KB   744/927 KB   406/406 B   
26-Jul-2019 07:25:29 497/497 KB   748/927 KB   406/406 B   
26-Jul-2019 07:25:29 497/497 KB   752/927 KB   406/406 B   
26-Jul-2019 07:25:29 497/497 KB   756/927 KB   406/406 B   
26-Jul-2019 07:25:29 497/497 KB   760/927 KB   406/406 B   
26-Jul-2019 07:25:29 497/497 KB   764/927 KB   406/406 B   
26-Jul-2019 07:25:29 497/497 KB   768/927 KB   406/406 B   
26-Jul-2019 07:25:29 497/497 KB   772/927 KB   406/406 B   
26-Jul-2019 07:25:29 497/497 KB   776/927 KB   406/406 B   
26-Jul-2019 07:25:29 497/497 KB   780/927 KB   406/406 B   
26-Jul-2019 07:25:29 497/497 KB   784/927 KB   406/406 B   
26-Jul-2019 07:25:29 497/497 KB   788/927 KB   406/406 B   
26-Jul-2019 07:25:29 497/497 KB   792/927 KB   406/406 B   
26-Jul-2019 07:25:29 497/497 KB   796/927 KB   406/406 B   
26-Jul-2019 07:25:29 497/497 KB   800/927 KB   406/406 B   
26-Jul-2019 07:25:29 497/497 KB   804/927 KB   406/406 B   
26-Jul-2019 07:25:29 497/497 KB   808/927 KB   406/406 B   
26-Jul-2019 07:25:29 497/497 KB   812/927 KB   406/406 B   
26-Jul-2019 07:25:29 497/497 KB   816/927 KB   406/406 B   
26-Jul-2019 07:25:29 497/497 KB   820/927 KB   406/406 B   
26-Jul-2019 07:25:29 497/497 KB   824/927 KB   406/406 B   
26-Jul-2019 07:25:29 497/497 KB   828/927 KB   406/406 B   
26-Jul-2019 07:25:29 497/497 KB   832/927 KB   406/406 B   
26-Jul-2019 07:25:29                                      
26-Jul-2019 07:25:29 Downloaded: https://repo.maven.apache.org/maven2/org/springframework/boot/spring-boot-starter-web/2.1.3.RELEASE/spring-boot-starter-web-2.1.3.RELEASE.jar (406 B at 1.1 KB/sec)
26-Jul-2019 07:25:29 Downloading: https://repo.maven.apache.org/maven2/org/apache/tomcat/embed/tomcat-embed-core/9.0.16/tomcat-embed-core-9.0.16.jar
26-Jul-2019 07:25:29                                      
26-Jul-2019 07:25:29 Downloaded: https://repo.maven.apache.org/maven2/org/springframework/boot/spring-boot-actuator/2.1.3.RELEASE/spring-boot-actuator-2.1.3.RELEASE.jar (497 KB at 1439.3 KB/sec)
26-Jul-2019 07:25:29 Downloading: https://repo.maven.apache.org/maven2/org/apache/tomcat/embed/tomcat-embed-websocket/9.0.16/tomcat-embed-websocket-9.0.16.jar
26-Jul-2019 07:25:29 836/927 KB                           
26-Jul-2019 07:25:29 840/927 KB   
26-Jul-2019 07:25:29 844/927 KB   
26-Jul-2019 07:25:29 848/927 KB   
26-Jul-2019 07:25:29 852/927 KB   
26-Jul-2019 07:25:29 856/927 KB   
26-Jul-2019 07:25:29 860/927 KB   
26-Jul-2019 07:25:29 864/927 KB   
26-Jul-2019 07:25:29 868/927 KB   
26-Jul-2019 07:25:29 872/927 KB   
26-Jul-2019 07:25:29 876/927 KB   
26-Jul-2019 07:25:29 880/927 KB   
26-Jul-2019 07:25:29 884/927 KB   
26-Jul-2019 07:25:29 888/927 KB   
26-Jul-2019 07:25:29 892/927 KB   
26-Jul-2019 07:25:29 896/927 KB   
26-Jul-2019 07:25:29 900/927 KB   
26-Jul-2019 07:25:29 904/927 KB   
26-Jul-2019 07:25:29 908/927 KB   
26-Jul-2019 07:25:29 912/927 KB   
26-Jul-2019 07:25:29 916/927 KB   
26-Jul-2019 07:25:29 920/927 KB   
26-Jul-2019 07:25:29 924/927 KB   
26-Jul-2019 07:25:29 927/927 KB   
26-Jul-2019 07:25:29 405/405 B   927/927 KB   
26-Jul-2019 07:25:29 406/406 B   405/405 B   927/927 KB   
26-Jul-2019 07:25:29                                      
26-Jul-2019 07:25:29 Downloaded: https://repo.maven.apache.org/maven2/org/apache/tomcat/embed/tomcat-embed-websocket/9.0.16/tomcat-embed-websocket-9.0.16.jar (0 B at 0.0 KB/sec)
26-Jul-2019 07:25:29 Downloading: https://repo.maven.apache.org/maven2/org/hibernate/validator/hibernate-validator/6.0.14.Final/hibernate-validator-6.0.14.Final.jar
26-Jul-2019 07:25:29                                      
26-Jul-2019 07:25:29 Downloaded: https://repo.maven.apache.org/maven2/org/apache/tomcat/embed/tomcat-embed-core/9.0.16/tomcat-embed-core-9.0.16.jar (0 B at 0.0 KB/sec)
26-Jul-2019 07:25:29 Downloading: https://repo.maven.apache.org/maven2/org/springframework/spring-web/5.1.5.RELEASE/spring-web-5.1.5.RELEASE.jar
26-Jul-2019 07:25:29                                      
26-Jul-2019 07:25:29 Downloaded: https://repo.maven.apache.org/maven2/org/springframework/boot/spring-boot/2.1.3.RELEASE/spring-boot-2.1.3.RELEASE.jar (927 KB at 2566.4 KB/sec)
26-Jul-2019 07:25:29 Downloading: https://repo.maven.apache.org/maven2/org/springframework/boot/spring-boot-starter-logging/2.1.3.RELEASE/spring-boot-starter-logging-2.1.3.RELEASE.jar
26-Jul-2019 07:25:29                                      
26-Jul-2019 07:25:29                                      
26-Jul-2019 07:25:29 Downloaded: https://repo.maven.apache.org/maven2/org/springframework/boot/spring-boot-starter-tomcat/2.1.3.RELEASE/spring-boot-starter-tomcat-2.1.3.RELEASE.jar (406 B at 1.1 KB/sec)
26-Jul-2019 07:25:29 Downloaded: https://repo.maven.apache.org/maven2/org/springframework/boot/spring-boot-starter-json/2.1.3.RELEASE/spring-boot-starter-json-2.1.3.RELEASE.jar (405 B at 1.1 KB/sec)
26-Jul-2019 07:25:29 Downloading: https://repo.maven.apache.org/maven2/org/springframework/boot/spring-boot-starter-security/2.1.3.RELEASE/spring-boot-starter-security-2.1.3.RELEASE.jar
26-Jul-2019 07:25:29 Downloading: https://repo.maven.apache.org/maven2/org/springframework/spring-aop/5.1.5.RELEASE/spring-aop-5.1.5.RELEASE.jar
26-Jul-2019 07:25:29                                      
26-Jul-2019 07:25:29 Downloaded: https://repo.maven.apache.org/maven2/org/hibernate/validator/hibernate-validator/6.0.14.Final/hibernate-validator-6.0.14.Final.jar (0 B at 0.0 KB/sec)
26-Jul-2019 07:25:29 Downloading: https://repo.maven.apache.org/maven2/org/springframework/security/spring-security-config/5.1.4.RELEASE/spring-security-config-5.1.4.RELEASE.jar
26-Jul-2019 07:25:29 407/407 B                           
26-Jul-2019 07:25:29            
26-Jul-2019 07:25:29 Downloaded: https://repo.maven.apache.org/maven2/org/springframework/spring-web/5.1.5.RELEASE/spring-web-5.1.5.RELEASE.jar (0 B at 0.0 KB/sec)
26-Jul-2019 07:25:29 Downloading: https://repo.maven.apache.org/maven2/org/springframework/security/spring-security-core/5.1.4.RELEASE/spring-security-core-5.1.4.RELEASE.jar
26-Jul-2019 07:25:29            
26-Jul-2019 07:25:29 Downloaded: https://repo.maven.apache.org/maven2/org/springframework/spring-aop/5.1.5.RELEASE/spring-aop-5.1.5.RELEASE.jar (0 B at 0.0 KB/sec)
26-Jul-2019 07:25:29 Downloading: https://repo.maven.apache.org/maven2/org/springframework/security/spring-security-web/5.1.4.RELEASE/spring-security-web-5.1.4.RELEASE.jar
26-Jul-2019 07:25:29 408/408 B   407/407 B   
26-Jul-2019 07:25:29                        
26-Jul-2019 07:25:29 Downloaded: https://repo.maven.apache.org/maven2/org/springframework/security/spring-security-config/5.1.4.RELEASE/spring-security-config-5.1.4.RELEASE.jar (0 B at 0.0 KB/sec)
26-Jul-2019 07:25:29                        
26-Jul-2019 07:25:29 Downloaded: https://repo.maven.apache.org/maven2/org/springframework/boot/spring-boot-starter-logging/2.1.3.RELEASE/spring-boot-starter-logging-2.1.3.RELEASE.jar (407 B at 1.0 KB/sec)
26-Jul-2019 07:25:29                        
26-Jul-2019 07:25:29 Downloaded: https://repo.maven.apache.org/maven2/org/springframework/security/spring-security-core/5.1.4.RELEASE/spring-security-core-5.1.4.RELEASE.jar (0 B at 0.0 KB/sec)
26-Jul-2019 07:25:29                        
26-Jul-2019 07:25:29 Downloaded: https://repo.maven.apache.org/maven2/org/springframework/security/spring-security-web/5.1.4.RELEASE/spring-security-web-5.1.4.RELEASE.jar (0 B at 0.0 KB/sec)
26-Jul-2019 07:25:29                        
26-Jul-2019 07:25:29 Downloaded: https://repo.maven.apache.org/maven2/org/springframework/boot/spring-boot-starter-security/2.1.3.RELEASE/spring-boot-starter-security-2.1.3.RELEASE.jar (408 B at 1.0 KB/sec)
26-Jul-2019 07:25:29 [INFO]
26-Jul-2019 07:25:29 [INFO] --- maven-clean-plugin:3.1.0:clean (default-clean) @ http-ingest ---
26-Jul-2019 07:25:29 [INFO]
26-Jul-2019 07:25:29 [INFO] --- maven-resources-plugin:3.1.0:resources (default-resources) @ http-ingest ---
26-Jul-2019 07:25:29 [INFO] Using 'UTF-8' encoding to copy filtered resources.
26-Jul-2019 07:25:29 [INFO] Copying 1 resource
26-Jul-2019 07:25:29 [INFO] Copying 0 resource
26-Jul-2019 07:25:29 [INFO]
26-Jul-2019 07:25:29 [INFO] --- maven-compiler-plugin:3.8.0:compile (default-compile) @ http-ingest ---
26-Jul-2019 07:25:29 [INFO] Changes detected - recompiling the module!
26-Jul-2019 07:25:29 [INFO] Compiling 1 source file to /opt/bamboo-home/xml-data/build-dir/SCD-SCDFSAMPLES-JOB1/kafka-samples/http-ingest/target/classes
26-Jul-2019 07:25:30 [INFO]
26-Jul-2019 07:25:30 [INFO] --- maven-resources-plugin:3.1.0:testResources (default-testResources) @ http-ingest ---
26-Jul-2019 07:25:30 [INFO] Using 'UTF-8' encoding to copy filtered resources.
26-Jul-2019 07:25:30 [INFO] skip non existing resourceDirectory /opt/bamboo-home/xml-data/build-dir/SCD-SCDFSAMPLES-JOB1/kafka-samples/http-ingest/src/test/resources
26-Jul-2019 07:25:30 [INFO]
26-Jul-2019 07:25:30 [INFO] --- maven-compiler-plugin:3.8.0:testCompile (default-testCompile) @ http-ingest ---
26-Jul-2019 07:25:30 [INFO] No sources to compile
26-Jul-2019 07:25:30 [INFO]
26-Jul-2019 07:25:30 [INFO] --- maven-surefire-plugin:2.22.1:test (default-test) @ http-ingest ---
26-Jul-2019 07:25:30 [INFO] No tests to run.
26-Jul-2019 07:25:30 [INFO]
26-Jul-2019 07:25:30 [INFO] --- maven-jar-plugin:3.1.1:jar (default-jar) @ http-ingest ---
26-Jul-2019 07:25:30 [INFO] Building jar: /opt/bamboo-home/xml-data/build-dir/SCD-SCDFSAMPLES-JOB1/kafka-samples/http-ingest/target/http-ingest-1.0.0.BUILD-SNAPSHOT.jar
26-Jul-2019 07:25:30 [INFO]
26-Jul-2019 07:25:30 [INFO] --- spring-boot-maven-plugin:2.1.3.RELEASE:repackage (repackage) @ http-ingest ---
26-Jul-2019 07:25:30 Downloading: https://repo.maven.apache.org/maven2/org/springframework/boot/spring-boot-loader-tools/2.1.3.RELEASE/spring-boot-loader-tools-2.1.3.RELEASE.pom
26-Jul-2019 07:25:30 3/3 KB                 
26-Jul-2019 07:25:30 3/3 KB   
26-Jul-2019 07:25:30          
26-Jul-2019 07:25:30 Downloaded: https://repo.maven.apache.org/maven2/org/springframework/boot/spring-boot-loader-tools/2.1.3.RELEASE/spring-boot-loader-tools-2.1.3.RELEASE.pom (3 KB at 103.6 KB/sec)
26-Jul-2019 07:25:30 Downloading: https://repo.maven.apache.org/maven2/org/springframework/boot/spring-boot-loader-tools/2.1.3.RELEASE/spring-boot-loader-tools-2.1.3.RELEASE.jar
26-Jul-2019 07:25:30 3/146 KB   
26-Jul-2019 07:25:30 5/146 KB   
26-Jul-2019 07:25:30 8/146 KB   
26-Jul-2019 07:25:30 11/146 KB   
26-Jul-2019 07:25:30 13/146 KB   
26-Jul-2019 07:25:30 16/146 KB   
26-Jul-2019 07:25:30 19/146 KB   
26-Jul-2019 07:25:30 21/146 KB   
26-Jul-2019 07:25:30 24/146 KB   
26-Jul-2019 07:25:30 27/146 KB   
26-Jul-2019 07:25:30 29/146 KB   
26-Jul-2019 07:25:30 32/146 KB   
26-Jul-2019 07:25:30 36/146 KB   
26-Jul-2019 07:25:30 40/146 KB   
26-Jul-2019 07:25:30 44/146 KB   
26-Jul-2019 07:25:30 48/146 KB   
26-Jul-2019 07:25:30 52/146 KB   
26-Jul-2019 07:25:30 56/146 KB   
26-Jul-2019 07:25:30 60/146 KB   
26-Jul-2019 07:25:30 64/146 KB   
26-Jul-2019 07:25:30 68/146 KB   
26-Jul-2019 07:25:30 72/146 KB   
26-Jul-2019 07:25:30 76/146 KB   
26-Jul-2019 07:25:30 80/146 KB   
26-Jul-2019 07:25:30 84/146 KB   
26-Jul-2019 07:25:30 88/146 KB   
26-Jul-2019 07:25:30 92/146 KB   
26-Jul-2019 07:25:30 96/146 KB   
26-Jul-2019 07:25:30 100/146 KB   
26-Jul-2019 07:25:30 104/146 KB   
26-Jul-2019 07:25:30 108/146 KB   
26-Jul-2019 07:25:30 112/146 KB   
26-Jul-2019 07:25:30 116/146 KB   
26-Jul-2019 07:25:30 120/146 KB   
26-Jul-2019 07:25:30 124/146 KB   
26-Jul-2019 07:25:30 128/146 KB   
26-Jul-2019 07:25:30 132/146 KB   
26-Jul-2019 07:25:30 136/146 KB   
26-Jul-2019 07:25:30 140/146 KB   
26-Jul-2019 07:25:30 144/146 KB   
26-Jul-2019 07:25:30 146/146 KB   
26-Jul-2019 07:25:30              
26-Jul-2019 07:25:30 Downloaded: https://repo.maven.apache.org/maven2/org/springframework/boot/spring-boot-loader-tools/2.1.3.RELEASE/spring-boot-loader-tools-2.1.3.RELEASE.jar (146 KB at 4836.9 KB/sec)
26-Jul-2019 07:25:30 [INFO] Replacing main artifact with repackaged archive
26-Jul-2019 07:25:30 [INFO]
26-Jul-2019 07:25:30 [INFO] --- maven-install-plugin:2.5.2:install (default-install) @ http-ingest ---
26-Jul-2019 07:25:30 [INFO] Installing /opt/bamboo-home/xml-data/build-dir/SCD-SCDFSAMPLES-JOB1/kafka-samples/http-ingest/target/http-ingest-1.0.0.BUILD-SNAPSHOT.jar to /home/bamboo/.m2/repository/org/springframework/cloud/dataflow/samples/http-ingest/1.0.0.BUILD-SNAPSHOT/http-ingest-1.0.0.BUILD-SNAPSHOT.jar
26-Jul-2019 07:25:30 [INFO] Installing /opt/bamboo-home/xml-data/build-dir/SCD-SCDFSAMPLES-JOB1/kafka-samples/http-ingest/pom.xml to /home/bamboo/.m2/repository/org/springframework/cloud/dataflow/samples/http-ingest/1.0.0.BUILD-SNAPSHOT/http-ingest-1.0.0.BUILD-SNAPSHOT.pom
26-Jul-2019 07:25:31 [INFO]                                                                         
26-Jul-2019 07:25:31 [INFO] ------------------------------------------------------------------------
26-Jul-2019 07:25:31 [INFO] Building kstreams-join-user-clicks-and-region 1.0.0.BUILD-SNAPSHOT
26-Jul-2019 07:25:31 [INFO] ------------------------------------------------------------------------
26-Jul-2019 07:25:31 Downloading: https://repo.maven.apache.org/maven2/org/springframework/cloud/spring-cloud-stream-binder-kafka-streams/2.1.1.RELEASE/spring-cloud-stream-binder-kafka-streams-2.1.1.RELEASE.pom
26-Jul-2019 07:25:31 3/4 KB       
26-Jul-2019 07:25:31 4/4 KB   
26-Jul-2019 07:25:31          
26-Jul-2019 07:25:31 Downloaded: https://repo.maven.apache.org/maven2/org/springframework/cloud/spring-cloud-stream-binder-kafka-streams/2.1.1.RELEASE/spring-cloud-stream-binder-kafka-streams-2.1.1.RELEASE.pom (4 KB at 26.3 KB/sec)
26-Jul-2019 07:25:31 Downloading: https://repo.maven.apache.org/maven2/org/springframework/cloud/spring-cloud-stream-binder-kafka-streams/2.1.1.RELEASE/spring-cloud-stream-binder-kafka-streams-2.1.1.RELEASE.jar
26-Jul-2019 07:25:31 3/96 KB   
26-Jul-2019 07:25:31 5/96 KB   
26-Jul-2019 07:25:31 8/96 KB   
26-Jul-2019 07:25:31 11/96 KB   
26-Jul-2019 07:25:31 13/96 KB   
26-Jul-2019 07:25:31 16/96 KB   
26-Jul-2019 07:25:31 19/96 KB   
26-Jul-2019 07:25:31 21/96 KB   
26-Jul-2019 07:25:31 24/96 KB   
26-Jul-2019 07:25:31 27/96 KB   
26-Jul-2019 07:25:31 29/96 KB   
26-Jul-2019 07:25:31 32/96 KB   
26-Jul-2019 07:25:31 36/96 KB   
26-Jul-2019 07:25:31 40/96 KB   
26-Jul-2019 07:25:31 44/96 KB   
26-Jul-2019 07:25:31 48/96 KB   
26-Jul-2019 07:25:31 52/96 KB   
26-Jul-2019 07:25:31 56/96 KB   
26-Jul-2019 07:25:31 60/96 KB   
26-Jul-2019 07:25:31 64/96 KB   
26-Jul-2019 07:25:31 68/96 KB   
26-Jul-2019 07:25:31 72/96 KB   
26-Jul-2019 07:25:31 76/96 KB   
26-Jul-2019 07:25:31 80/96 KB   
26-Jul-2019 07:25:31 84/96 KB   
26-Jul-2019 07:25:31 88/96 KB   
26-Jul-2019 07:25:31 92/96 KB   
26-Jul-2019 07:25:31 96/96 KB   
26-Jul-2019 07:25:31            
26-Jul-2019 07:25:31 Downloaded: https://repo.maven.apache.org/maven2/org/springframework/cloud/spring-cloud-stream-binder-kafka-streams/2.1.1.RELEASE/spring-cloud-stream-binder-kafka-streams-2.1.1.RELEASE.jar (96 KB at 522.2 KB/sec)
26-Jul-2019 07:25:31 [INFO]
26-Jul-2019 07:25:31 [INFO] --- maven-clean-plugin:3.1.0:clean (default-clean) @ kstreams-join-user-clicks-and-region ---
26-Jul-2019 07:25:31 [INFO]
26-Jul-2019 07:25:31 [INFO] --- maven-resources-plugin:3.1.0:resources (default-resources) @ kstreams-join-user-clicks-and-region ---
26-Jul-2019 07:25:31 [INFO] Using 'UTF-8' encoding to copy filtered resources.
26-Jul-2019 07:25:31 [INFO] Copying 1 resource
26-Jul-2019 07:25:31 [INFO] Copying 1 resource
26-Jul-2019 07:25:31 [INFO]
26-Jul-2019 07:25:31 [INFO] --- maven-compiler-plugin:3.8.0:compile (default-compile) @ kstreams-join-user-clicks-and-region ---
26-Jul-2019 07:25:31 [INFO] Changes detected - recompiling the module!
26-Jul-2019 07:25:31 [INFO] Compiling 1 source file to /opt/bamboo-home/xml-data/build-dir/SCD-SCDFSAMPLES-JOB1/kafka-samples/kstreams-join-user-clicks-and-region/target/classes
26-Jul-2019 07:25:31 [INFO]
26-Jul-2019 07:25:31 [INFO] --- maven-resources-plugin:3.1.0:testResources (default-testResources) @ kstreams-join-user-clicks-and-region ---
26-Jul-2019 07:25:31 [INFO] Using 'UTF-8' encoding to copy filtered resources.
26-Jul-2019 07:25:31 [INFO] skip non existing resourceDirectory /opt/bamboo-home/xml-data/build-dir/SCD-SCDFSAMPLES-JOB1/kafka-samples/kstreams-join-user-clicks-and-region/src/test/resources
26-Jul-2019 07:25:31 [INFO]
26-Jul-2019 07:25:31 [INFO] --- maven-compiler-plugin:3.8.0:testCompile (default-testCompile) @ kstreams-join-user-clicks-and-region ---
26-Jul-2019 07:25:31 [INFO] No sources to compile
26-Jul-2019 07:25:31 [INFO]
26-Jul-2019 07:25:31 [INFO] --- maven-surefire-plugin:2.22.1:test (default-test) @ kstreams-join-user-clicks-and-region ---
26-Jul-2019 07:25:31 [INFO] No tests to run.
26-Jul-2019 07:25:31 [INFO]
26-Jul-2019 07:25:31 [INFO] --- maven-jar-plugin:3.1.1:jar (default-jar) @ kstreams-join-user-clicks-and-region ---
26-Jul-2019 07:25:31 [INFO] Building jar: /opt/bamboo-home/xml-data/build-dir/SCD-SCDFSAMPLES-JOB1/kafka-samples/kstreams-join-user-clicks-and-region/target/kstreams-join-user-clicks-and-region-1.0.0.BUILD-SNAPSHOT.jar
26-Jul-2019 07:25:31 [INFO]
26-Jul-2019 07:25:31 [INFO] --- spring-boot-maven-plugin:2.1.3.RELEASE:repackage (repackage) @ kstreams-join-user-clicks-and-region ---
26-Jul-2019 07:25:31 [INFO] Replacing main artifact with repackaged archive
26-Jul-2019 07:25:31 [INFO]
26-Jul-2019 07:25:31 [INFO] --- maven-install-plugin:2.5.2:install (default-install) @ kstreams-join-user-clicks-and-region ---
26-Jul-2019 07:25:31 [INFO] Installing /opt/bamboo-home/xml-data/build-dir/SCD-SCDFSAMPLES-JOB1/kafka-samples/kstreams-join-user-clicks-and-region/target/kstreams-join-user-clicks-and-region-1.0.0.BUILD-SNAPSHOT.jar to /home/bamboo/.m2/repository/org/springframework/cloud/dataflow/samples/kstreams-join-user-clicks-and-region/1.0.0.BUILD-SNAPSHOT/kstreams-join-user-clicks-and-region-1.0.0.BUILD-SNAPSHOT.jar
26-Jul-2019 07:25:31 [INFO] Installing /opt/bamboo-home/xml-data/build-dir/SCD-SCDFSAMPLES-JOB1/kafka-samples/kstreams-join-user-clicks-and-region/pom.xml to /home/bamboo/.m2/repository/org/springframework/cloud/dataflow/samples/kstreams-join-user-clicks-and-region/1.0.0.BUILD-SNAPSHOT/kstreams-join-user-clicks-and-region-1.0.0.BUILD-SNAPSHOT.pom
26-Jul-2019 07:25:32 [INFO]                                                                         
26-Jul-2019 07:25:32 [INFO] ------------------------------------------------------------------------
26-Jul-2019 07:25:32 [INFO] Building kstreams-log-user-clicks-per-region 1.0.0.BUILD-SNAPSHOT
26-Jul-2019 07:25:32 [INFO] ------------------------------------------------------------------------
26-Jul-2019 07:25:32 [INFO]
26-Jul-2019 07:25:32 [INFO] --- maven-clean-plugin:3.1.0:clean (default-clean) @ kstreams-log-user-clicks-per-region ---
26-Jul-2019 07:25:32 [INFO]
26-Jul-2019 07:25:32 [INFO] --- maven-resources-plugin:3.1.0:resources (default-resources) @ kstreams-log-user-clicks-per-region ---
26-Jul-2019 07:25:32 [INFO] Using 'UTF-8' encoding to copy filtered resources.
26-Jul-2019 07:25:32 [INFO] Copying 1 resource
26-Jul-2019 07:25:32 [INFO] Copying 0 resource
26-Jul-2019 07:25:32 [INFO]
26-Jul-2019 07:25:32 [INFO] --- maven-compiler-plugin:3.8.0:compile (default-compile) @ kstreams-log-user-clicks-per-region ---
26-Jul-2019 07:25:32 [INFO] Changes detected - recompiling the module!
26-Jul-2019 07:25:32 [INFO] Compiling 1 source file to /opt/bamboo-home/xml-data/build-dir/SCD-SCDFSAMPLES-JOB1/kafka-samples/kstreams-log-user-clicks-per-region/target/classes
26-Jul-2019 07:25:32 [INFO]
26-Jul-2019 07:25:32 [INFO] --- maven-resources-plugin:3.1.0:testResources (default-testResources) @ kstreams-log-user-clicks-per-region ---
26-Jul-2019 07:25:32 [INFO] Using 'UTF-8' encoding to copy filtered resources.
26-Jul-2019 07:25:32 [INFO] skip non existing resourceDirectory /opt/bamboo-home/xml-data/build-dir/SCD-SCDFSAMPLES-JOB1/kafka-samples/kstreams-log-user-clicks-per-region/src/test/resources
26-Jul-2019 07:25:32 [INFO]
26-Jul-2019 07:25:32 [INFO] --- maven-compiler-plugin:3.8.0:testCompile (default-testCompile) @ kstreams-log-user-clicks-per-region ---
26-Jul-2019 07:25:32 [INFO] No sources to compile
26-Jul-2019 07:25:32 [INFO]
26-Jul-2019 07:25:32 [INFO] --- maven-surefire-plugin:2.22.1:test (default-test) @ kstreams-log-user-clicks-per-region ---
26-Jul-2019 07:25:32 [INFO] No tests to run.
26-Jul-2019 07:25:32 [INFO]
26-Jul-2019 07:25:32 [INFO] --- maven-jar-plugin:3.1.1:jar (default-jar) @ kstreams-log-user-clicks-per-region ---
26-Jul-2019 07:25:32 [INFO] Building jar: /opt/bamboo-home/xml-data/build-dir/SCD-SCDFSAMPLES-JOB1/kafka-samples/kstreams-log-user-clicks-per-region/target/kstreams-log-user-clicks-per-region-1.0.0.BUILD-SNAPSHOT.jar
26-Jul-2019 07:25:32 [INFO]
26-Jul-2019 07:25:32 [INFO] --- spring-boot-maven-plugin:2.1.3.RELEASE:repackage (repackage) @ kstreams-log-user-clicks-per-region ---
26-Jul-2019 07:25:32 [INFO] Replacing main artifact with repackaged archive
26-Jul-2019 07:25:32 [INFO]
26-Jul-2019 07:25:32 [INFO] --- maven-install-plugin:2.5.2:install (default-install) @ kstreams-log-user-clicks-per-region ---
26-Jul-2019 07:25:32 [INFO] Installing /opt/bamboo-home/xml-data/build-dir/SCD-SCDFSAMPLES-JOB1/kafka-samples/kstreams-log-user-clicks-per-region/target/kstreams-log-user-clicks-per-region-1.0.0.BUILD-SNAPSHOT.jar to /home/bamboo/.m2/repository/org/springframework/cloud/dataflow/samples/kstreams-log-user-clicks-per-region/1.0.0.BUILD-SNAPSHOT/kstreams-log-user-clicks-per-region-1.0.0.BUILD-SNAPSHOT.jar
26-Jul-2019 07:25:32 [INFO] Installing /opt/bamboo-home/xml-data/build-dir/SCD-SCDFSAMPLES-JOB1/kafka-samples/kstreams-log-user-clicks-per-region/pom.xml to /home/bamboo/.m2/repository/org/springframework/cloud/dataflow/samples/kstreams-log-user-clicks-per-region/1.0.0.BUILD-SNAPSHOT/kstreams-log-user-clicks-per-region-1.0.0.BUILD-SNAPSHOT.pom
26-Jul-2019 07:25:32 [INFO]                                                                         
26-Jul-2019 07:25:32 [INFO] ------------------------------------------------------------------------
26-Jul-2019 07:25:32 [INFO] Building kstreams-word-count 1.0.0.BUILD-SNAPSHOT
26-Jul-2019 07:25:32 [INFO] ------------------------------------------------------------------------
26-Jul-2019 07:25:32 [INFO]
26-Jul-2019 07:25:32 [INFO] --- maven-clean-plugin:3.1.0:clean (default-clean) @ kstreams-word-count ---
26-Jul-2019 07:25:32 [INFO]
26-Jul-2019 07:25:32 [INFO] --- maven-resources-plugin:3.1.0:resources (default-resources) @ kstreams-word-count ---
26-Jul-2019 07:25:32 [INFO] Using 'UTF-8' encoding to copy filtered resources.
26-Jul-2019 07:25:32 [INFO] Copying 1 resource
26-Jul-2019 07:25:32 [INFO] Copying 0 resource
26-Jul-2019 07:25:32 [INFO]
26-Jul-2019 07:25:32 [INFO] --- maven-compiler-plugin:3.8.0:compile (default-compile) @ kstreams-word-count ---
26-Jul-2019 07:25:32 [INFO] Changes detected - recompiling the module!
26-Jul-2019 07:25:32 [INFO] Compiling 1 source file to /opt/bamboo-home/xml-data/build-dir/SCD-SCDFSAMPLES-JOB1/kafka-samples/kstreams-word-count/target/classes
26-Jul-2019 07:25:32 [INFO]
26-Jul-2019 07:25:32 [INFO] --- maven-resources-plugin:3.1.0:testResources (default-testResources) @ kstreams-word-count ---
26-Jul-2019 07:25:32 [INFO] Using 'UTF-8' encoding to copy filtered resources.
26-Jul-2019 07:25:32 [INFO] skip non existing resourceDirectory /opt/bamboo-home/xml-data/build-dir/SCD-SCDFSAMPLES-JOB1/kafka-samples/kstreams-word-count/src/test/resources
26-Jul-2019 07:25:32 [INFO]
26-Jul-2019 07:25:32 [INFO] --- maven-compiler-plugin:3.8.0:testCompile (default-testCompile) @ kstreams-word-count ---
26-Jul-2019 07:25:32 [INFO] No sources to compile
26-Jul-2019 07:25:32 [INFO]
26-Jul-2019 07:25:32 [INFO] --- maven-surefire-plugin:2.22.1:test (default-test) @ kstreams-word-count ---
26-Jul-2019 07:25:32 [INFO] No tests to run.
26-Jul-2019 07:25:32 [INFO]
26-Jul-2019 07:25:32 [INFO] --- maven-jar-plugin:3.1.1:jar (default-jar) @ kstreams-word-count ---
26-Jul-2019 07:25:32 [INFO] Building jar: /opt/bamboo-home/xml-data/build-dir/SCD-SCDFSAMPLES-JOB1/kafka-samples/kstreams-word-count/target/kstreams-word-count-1.0.0.BUILD-SNAPSHOT.jar
26-Jul-2019 07:25:32 [INFO]
26-Jul-2019 07:25:32 [INFO] --- spring-boot-maven-plugin:2.1.3.RELEASE:repackage (repackage) @ kstreams-word-count ---
26-Jul-2019 07:25:33 [INFO] Replacing main artifact with repackaged archive
26-Jul-2019 07:25:33 [INFO]
26-Jul-2019 07:25:33 [INFO] --- maven-install-plugin:2.5.2:install (default-install) @ kstreams-word-count ---
26-Jul-2019 07:25:33 [INFO] Installing /opt/bamboo-home/xml-data/build-dir/SCD-SCDFSAMPLES-JOB1/kafka-samples/kstreams-word-count/target/kstreams-word-count-1.0.0.BUILD-SNAPSHOT.jar to /home/bamboo/.m2/repository/org/springframework/cloud/dataflow/samples/kstreams-word-count/1.0.0.BUILD-SNAPSHOT/kstreams-word-count-1.0.0.BUILD-SNAPSHOT.jar
26-Jul-2019 07:25:33 [INFO] Installing /opt/bamboo-home/xml-data/build-dir/SCD-SCDFSAMPLES-JOB1/kafka-samples/kstreams-word-count/pom.xml to /home/bamboo/.m2/repository/org/springframework/cloud/dataflow/samples/kstreams-word-count/1.0.0.BUILD-SNAPSHOT/kstreams-word-count-1.0.0.BUILD-SNAPSHOT.pom
26-Jul-2019 07:25:33 [INFO]                                                                         
26-Jul-2019 07:25:33 [INFO] ------------------------------------------------------------------------
26-Jul-2019 07:25:33 [INFO] Building kafka-samples-parent 1.0.0.BUILD-SNAPSHOT
26-Jul-2019 07:25:33 [INFO] ------------------------------------------------------------------------
26-Jul-2019 07:25:33 [INFO]
26-Jul-2019 07:25:33 [INFO] --- maven-clean-plugin:2.5:clean (default-clean) @ kafka-samples-parent ---
26-Jul-2019 07:25:33 [INFO]
26-Jul-2019 07:25:33 [INFO] --- maven-install-plugin:2.4:install (default-install) @ kafka-samples-parent ---
26-Jul-2019 07:25:33 [INFO] Installing /opt/bamboo-home/xml-data/build-dir/SCD-SCDFSAMPLES-JOB1/kafka-samples/pom.xml to /home/bamboo/.m2/repository/org/springframework/cloud/dataflow/samples/kafka-samples-parent/1.0.0.BUILD-SNAPSHOT/kafka-samples-parent-1.0.0.BUILD-SNAPSHOT.pom
26-Jul-2019 07:25:34 [INFO] Artifactory Build Info Recorder: Saving Build Info to '/opt/bamboo-home/xml-data/build-dir/SCD-SCDFSAMPLES-JOB1/kafka-samples/target/build-info.json'
26-Jul-2019 07:25:34 [INFO] Deploying artifact: https://repo.spring.io/libs-snapshot-local/org/springframework/cloud/dataflow/samples/kstreams-join-user-clicks-and-region/1.0.0.BUILD-SNAPSHOT/kstreams-join-user-clicks-and-region-1.0.0.BUILD-SNAPSHOT.jar
26-Jul-2019 07:25:37 [INFO] Deploying artifact: https://repo.spring.io/libs-snapshot-local/org/springframework/cloud/dataflow/samples/kstreams-join-user-clicks-and-region/1.0.0.BUILD-SNAPSHOT/kstreams-join-user-clicks-and-region-1.0.0.BUILD-SNAPSHOT.pom
26-Jul-2019 07:25:38 [INFO] Deploying artifact: https://repo.spring.io/libs-snapshot-local/org/springframework/cloud/dataflow/samples/http-ingest/1.0.0.BUILD-SNAPSHOT/http-ingest-1.0.0.BUILD-SNAPSHOT.jar
26-Jul-2019 07:25:40 [INFO] Deploying artifact: https://repo.spring.io/libs-snapshot-local/org/springframework/cloud/dataflow/samples/http-ingest/1.0.0.BUILD-SNAPSHOT/http-ingest-1.0.0.BUILD-SNAPSHOT.pom
26-Jul-2019 07:25:40 [INFO] Deploying artifact: https://repo.spring.io/libs-snapshot-local/org/springframework/cloud/dataflow/samples/kstreams-word-count/1.0.0.BUILD-SNAPSHOT/kstreams-word-count-1.0.0.BUILD-SNAPSHOT.jar
26-Jul-2019 07:25:43 [INFO] Deploying artifact: https://repo.spring.io/libs-snapshot-local/org/springframework/cloud/dataflow/samples/kstreams-word-count/1.0.0.BUILD-SNAPSHOT/kstreams-word-count-1.0.0.BUILD-SNAPSHOT.pom
26-Jul-2019 07:25:43 [INFO] Deploying artifact: https://repo.spring.io/libs-snapshot-local/org/springframework/cloud/dataflow/samples/kafka-samples-parent/1.0.0.BUILD-SNAPSHOT/kafka-samples-parent-1.0.0.BUILD-SNAPSHOT.pom
26-Jul-2019 07:25:44 [INFO] Deploying artifact: https://repo.spring.io/libs-snapshot-local/org/springframework/cloud/dataflow/samples/kstreams-log-user-clicks-per-region/1.0.0.BUILD-SNAPSHOT/kstreams-log-user-clicks-per-region-1.0.0.BUILD-SNAPSHOT.jar
26-Jul-2019 07:25:46 [INFO] Deploying artifact: https://repo.spring.io/libs-snapshot-local/org/springframework/cloud/dataflow/samples/kstreams-log-user-clicks-per-region/1.0.0.BUILD-SNAPSHOT/kstreams-log-user-clicks-per-region-1.0.0.BUILD-SNAPSHOT.pom
26-Jul-2019 07:25:46 [INFO] Artifactory Build Info Recorder: Deploying build info ...
26-Jul-2019 07:25:46 [INFO] Deploying build descriptor to: https://repo.spring.io/api/build
26-Jul-2019 07:25:48 [INFO] Build successfully deployed. Browse it in Artifactory under https://repo.spring.io/webapp/builds/Spring%20Cloud%20Data%20Flow%20-%20Spring%20Cloud%20Data%20Flow%20Samples%20-%20Build%20SCDF%20Samples/84
26-Jul-2019 07:25:48 [INFO] ------------------------------------------------------------------------
26-Jul-2019 07:25:48 [INFO] Reactor Summary:
26-Jul-2019 07:25:48 [INFO]
26-Jul-2019 07:25:48 [INFO] http-ingest ........................................ SUCCESS [  4.392 s]
26-Jul-2019 07:25:48 [INFO] kstreams-join-user-clicks-and-region ............... SUCCESS [  0.712 s]
26-Jul-2019 07:25:48 [INFO] kstreams-log-user-clicks-per-region ................ SUCCESS [  0.210 s]
26-Jul-2019 07:25:48 [INFO] kstreams-word-count ................................ SUCCESS [  0.451 s]
26-Jul-2019 07:25:48 [INFO] kafka-samples-parent ............................... SUCCESS [  0.050 s]
26-Jul-2019 07:25:48 [INFO] ------------------------------------------------------------------------
26-Jul-2019 07:25:48 [INFO] BUILD SUCCESS
26-Jul-2019 07:25:48 [INFO] ------------------------------------------------------------------------
26-Jul-2019 07:25:48 [INFO] Total time: 23.906 s
26-Jul-2019 07:25:48 [INFO] Finished at: 2019-07-26T07:25:48+00:00
26-Jul-2019 07:25:48 [INFO] Final Memory: 61M/610M
26-Jul-2019 07:25:48 [INFO] ------------------------------------------------------------------------
26-Jul-2019 07:25:48 [WARNING] The requested profile "full" could not be activated because it does not exist.
26-Jul-2019 07:25:48 Finished task 'Build and Publish to repo' with result: Success
26-Jul-2019 07:25:48 Starting task 'Build and Publish Kafka samples' of type 'org.jfrog.bamboo.bamboo-artifactory-plugin:maven3Task'
26-Jul-2019 07:25:48 Bamboo Artifactory Plugin version: 2.6.3
26-Jul-2019 07:25:48
Beginning to execute external process for build 'Spring Cloud Data Flow - Spring Cloud Data Flow Samples - Build SCDF Samples #84 (SCD-SCDFSAMPLES-JOB1-84)'
... running command line:
/opt/jdk-8/bin/java -cp /opt/maven-3.3/boot/plexus-classworlds-2.5.2.jar -Dclassworlds.conf=/tmp/artifactoryM23492208274627715064conf -DbuildInfoConfig.propertiesFile=/tmp/buildInfo8620315909526026832.properties -Dmaven.home=/opt/maven-3.3 -Dmaven.multiModuleProjectDirectory=/opt/bamboo-home/xml-data/build-dir/SCD-SCDFSAMPLES-JOB1/kafka-samples org.codehaus.plexus.classworlds.launcher.Launcher clean install -Dartifactory.publish.password=********
... in: /opt/bamboo-home/xml-data/build-dir/SCD-SCDFSAMPLES-JOB1/kafka-samples
... using extra environment variables:
bamboo_planRepository_1_branch=master
bamboo_********_username_password=********
bamboo_signing_store_password=********
bamboo_capability_system_builder_ant_Ant_1_9=/opt/ant-1.9
bamboo_capability_system_builder_ant_Ant_1_8=/opt/ant-1.8
bamboo_planRepository_1_branchDisplayName=master
bamboo_artifactory_override_resolve_repo=libs-milestone
bamboo_capability_system_builder_node_Node_js_10_16=/opt/node-10.16/bin/node
bamboo_repository_revision_number=2d0c3cd5d77c85015834e1fbb411759dbe67a41b
bamboo_RIAK_BIN=/usr/sbin/riak
WRAPPER_BITS=32
bamboo_buildKey=SCD-SCDFSAMPLES-JOB1
bamboo_bintray_password=********
bamboo_sonar_token_password=********
PWD=/opt/bamboo-home/bin
bamboo_shortJobName=Build SCDF Samples
bamboo_repository_254541938_git_repositoryUrl=https://github.com/spring-cloud/spring-cloud-dataflow-samples.git
bamboo_artifactory_override_resolver_password=********
bamboo_sonatype_token=RSJChaox
bamboo_capability_system_builder_gradle___gradlew=./gradlew
bamboo_buildResultsUrl=https://build.spring.io/browse/SCD-SCDFSAMPLES-JOB1-84
bamboo_capability_system_builder_mvn3_Maven_3_3=/opt/maven-3.3
bamboo_repository_254541938_name=Git
bamboo_capability_system_builder_mvn3_Maven_3_2=/opt/maven-3.2
bamboo_capability_system_builder_mvn3_Maven_3_1=/opt/maven-3.1
bamboo_planRepository_repositoryUrl=https://github.com/spring-cloud/spring-cloud-dataflow-samples.git
bamboo_capability_system_builder_mvn3_Maven_3_6=/opt/maven-3.6
bamboo_agentId=286195714
bamboo_capability_system_builder_mvn3_Maven_3_5=/opt/maven-3.5
bamboo_capability_system_builder_mvn3_Maven_3_0=/opt/maven-3.0
bamboo_planRepository_revision=2d0c3cd5d77c85015834e1fbb411759dbe67a41b
bamboo_planRepository_previousRevision=dbbf78588b4c016a8829543780609347461b05db
bamboo_capability_remote_build=true
bamboo_repository_branch_name=master
bamboo_sonatype_token_password=********
bamboo_build_commandline_org_jfrog_bamboo_bamboo_artifactory_plugin_maven3Task_8=/opt/jdk-8/bin/java -cp /opt/maven-3.3/boot/plexus-classworlds-2.5.2.jar -Dclassworlds.conf=/tmp/artifactoryM24659829728282835841conf -DbuildInfoConfig.propertiesFile=/tmp/buildInfo403602777587515602.properties -Dmaven.home=/opt/maven-3.3 -Dmaven.multiModuleProjectDirectory=/opt/bamboo-home/xml-data/build-dir/SCD-SCDFSAMPLES-JOB1/kafka-samples org.codehaus.plexus.classworlds.launcher.Launcher clean install -P spring,full -Dartifactory.publish.password=********
bamboo_sonatype_user=springsource
SHLVL=1
bamboo_org_jfrog_bamboo_buildInfo_serverUrl=https://repo.spring.io
bamboo_scdf_acceptance_tests_password=********
bamboo_repository_254541938_previous_revision_number=dbbf78588b4c016a8829543780609347461b05db
WRAPPER_OS=linux
TERM=linux
XDG_SESSION_ID=c1
bamboo_repository_254541938_git_branch=master
bamboo_planRepository_branch=master
bamboo_org_jfrog_bamboo_release_activated=false
bamboo_planRepository_1_type=gitv2
bamboo_planRepository_branchName=master
bamboo_capability_system_jdk_JDK_12=/opt/jdk-12
WRAPPER_FILE_SEPARATOR=/
_=/opt/bamboo-home/bin/bamboo-agent.sh
bamboo_capability_system_builder_gradlew_gradlew=./
bamboo_capability_system_builder_ant_Ant_1_10=/opt/ant-1.10
WRAPPER_PATH_SEPARATOR=:
bamboo_sonar_password=********
bamboo_hg_cache_directory=/opt/bamboo-home/xml-data/build-dir/_hg-repositories-cache
bamboo_planRepository_1_username=spring-buildmaster
bamboo_planRepository_type=gitv2
bamboo_git_cache_directory=/opt/bamboo-home/xml-data/build-dir/_git-repositories-cache
bamboo_repository_254541938_git_username=spring-buildmaster
bamboo_artifactory_username=buildmaster
bamboo_tmp_directory=/opt/bamboo-home/temp
bamboo_planKey=SCD-SCDFSAMPLES
bamboo_planRepository_username=spring-buildmaster
bamboo_JDK8_HOME=/opt/jdk-8
bamboo_planRepository_1_branchName=master
bamboo_sonar_version=5.6.3
bamboo_sonar_jdbc_password=********
bamboo_bintray_api_key_password=********
XDG_DATA_DIRS=/usr/local/share:/usr/share:/var/lib/snapd/desktop
bamboo_capability_system_jdk_JDK_1_11=/opt/jdk-11
bamboo_resultsUrl=https://build.spring.io/browse/SCD-SCDFSAMPLES-JOB1-84
bamboo_capability_system_jdk_JDK_1_10=/opt/jdk-10
bamboo_build_working_directory=/opt/bamboo-home/xml-data/build-dir/SCD-SCDFSAMPLES-JOB1
bamboo_planRepository_1_name=Git
bamboo_capability_system_os=ubuntu1804
bamboo_nexusPush_stagingProfile=buildmaster
bamboo_shortPlanName=Spring Cloud Data Flow Samples
MAIL=/var/mail/bamboo
bamboo_planRepository_name=Git
LOGNAME=bamboo
bamboo_buildNumber=84
SHELL=/bin/bash
bamboo_repository_254541938_branch_name=master
bamboo_planName=Spring Cloud Data Flow - Spring Cloud Data Flow Samples
bamboo_JDK7_HOME=/opt/jdk-7
bamboo_shortPlanKey=SCDFSAMPLES
OLDPWD=/opt/users/bamboo
bamboo_shortJobKey=JOB1
bamboo_artifactory_password=********
bamboo_buildTimeStamp=2019-07-26T07:25:03.789Z
bamboo_repository_previous_revision_number=dbbf78588b4c016a8829543780609347461b05db
bamboo_sonar_username=buildmaster
bamboo_********_password=********
bamboo_repository_git_branch=master
bamboo_buildResultKey=SCD-SCDFSAMPLES-JOB1-84
bamboo_nexusPush_close=true
bamboo_artifactory_override_resolver_username=buildmaster
bamboo_buildPlanName=Spring Cloud Data Flow - Spring Cloud Data Flow Samples - Build SCDF Samples
bamboo_planRepository_1_revision=2d0c3cd5d77c85015834e1fbb411759dbe67a41b
bamboo_repository_name=Git
bamboo_signing_key_password=********
bamboo_repository_254541938_revision_number=2d0c3cd5d77c85015834e1fbb411759dbe67a41b
bamboo_capability_system_builder_groovy_Groovy_2_5=/opt/groovy-2.5
LANG=en_US.UTF-8
bamboo_buildFailed=false
bamboo_capability_system_docker_executable=/usr/bin/docker
DISPLAY=localhost:1.0
bamboo_capability_system_jdk_OpenJDK_7=/opt/jdk-7
bamboo_capability_system_builder_groovy_Groovy_2_4=/opt/groovy-2.4
bamboo_artifactory_override_deployer_username=buildmaster
bamboo_capability_system_builder_command_Bash=/bin/bash
bamboo_artifactory_password_mask_a=********
bamboo_agentWorkingDirectory=/opt/bamboo-home/xml-data/build-dir
bamboo_capability_system_git_executable=/usr/bin/git
bamboo_repository_git_username=spring-buildmaster
bamboo_planRepository_1_previousRevision=dbbf78588b4c016a8829543780609347461b05db
bamboo_capability_os_family=unix
bamboo_planRepository_branchDisplayName=master
bamboo_capability_system_builder_maven_Artifactory_Maven_3_6=/opt/maven-3.6
bamboo_capability_system_builder_maven_Artifactory_Maven_3_5=/opt/maven-3.5
GIT_SSL_NO_VERIFY=true
bamboo_capability_system_builder_maven_Artifactory_Maven_3_3=/opt/maven-3.3
bamboo_capability_system_builder_maven_Artifactory_Maven_3_2=/opt/maven-3.2
bamboo_s3_properties=/home/bamboo/tools/s3.properties
bamboo_capability_system_builder_maven_Artifactory_Maven_3_1=/opt/maven-3.1
bamboo_artifactory_override_deploy_repo=libs-snapshot-local
bamboo_capability_system_builder_maven_Artifactory_Maven_3_0=/opt/maven-3.0
bamboo_plan_storageTag=plan-254345444
bamboo_bintray_username_password=********
USER=bamboo
bamboo_repository_git_repositoryUrl=https://github.com/spring-cloud/spring-cloud-dataflow-samples.git
bamboo_working_directory=/opt/bamboo-home/xml-data/build-dir/SCD-SCDFSAMPLES-JOB1
bamboo_org_jfrog_bamboo_buildInfo_activated=true
bamboo_planRepository_1_repositoryUrl=https://github.com/spring-cloud/spring-cloud-dataflow-samples.git
bamboo_capability_system_jdk_JDK_1_8=/opt/jdk-8
bamboo_artifactory_override_deployer_password=********
bamboo_capability_system_jdk_JDK_1_9=/opt/jdk-9
WRAPPER_ARCH=x86
bamboo_capability_system_jdk_JDK_1_6=/opt/jdk-6
bamboo_sonatype_password=********
bamboo_capability_system_jdk_JDK_1_7=/opt/jdk-7
bamboo_sonar_ip=10.194.6.9
XDG_RUNTIME_DIR=/run/user/1002
HOME=/home/bamboo
PATH=/bin:/home/bamboo/bin:/usr/local/sbin:/usr/local/bin:/usr/sbin:/usr/bin:/sbin:/bin:/usr/games:/usr/local/games:/snap/bin:/home/bamboo/bin:/usr/local/bin:/bin:/home/bamboo/bin:/usr/local/sbin:/usr/local/bin:/usr/sbin:/usr/bin:/sbin:/bin:/usr/games:/usr/local/games:/snap/bin:/home/bamboo/bin:/usr/local/bin
26-Jul-2019 07:25:49 [INFO] Scanning for projects...
26-Jul-2019 07:25:50 [WARNING]
26-Jul-2019 07:25:50 [WARNING] Some problems were encountered while building the effective model for org.springframework.cloud.dataflow.samples:http-ingest:jar:1.0.0.BUILD-SNAPSHOT
26-Jul-2019 07:25:50 [WARNING] 'parent.relativePath' of POM org.springframework.cloud.dataflow.samples:http-ingest:1.0.0.BUILD-SNAPSHOT (/opt/bamboo-home/xml-data/build-dir/SCD-SCDFSAMPLES-JOB1/kafka-samples/http-ingest/pom.xml) points at org.springframework.cloud.dataflow.samples:kafka-samples-parent instead of org.springframework.boot:spring-boot-starter-parent, please verify your project structure @ line 5, column 11
26-Jul-2019 07:25:50 [WARNING]
26-Jul-2019 07:25:50 [WARNING] Some problems were encountered while building the effective model for org.springframework.cloud.dataflow.samples:kstreams-join-user-clicks-and-region:jar:1.0.0.BUILD-SNAPSHOT
26-Jul-2019 07:25:50 [WARNING] 'parent.relativePath' of POM org.springframework.cloud.dataflow.samples:kstreams-join-user-clicks-and-region:1.0.0.BUILD-SNAPSHOT (/opt/bamboo-home/xml-data/build-dir/SCD-SCDFSAMPLES-JOB1/kafka-samples/kstreams-join-user-clicks-and-region/pom.xml) points at org.springframework.cloud.dataflow.samples:kafka-samples-parent instead of org.springframework.boot:spring-boot-starter-parent, please verify your project structure @ line 6, column 10
26-Jul-2019 07:25:50 [WARNING]
26-Jul-2019 07:25:50 [WARNING] Some problems were encountered while building the effective model for org.springframework.cloud.dataflow.samples:kstreams-log-user-clicks-per-region:jar:1.0.0.BUILD-SNAPSHOT
26-Jul-2019 07:25:50 [WARNING] 'parent.relativePath' of POM org.springframework.cloud.dataflow.samples:kstreams-log-user-clicks-per-region:1.0.0.BUILD-SNAPSHOT (/opt/bamboo-home/xml-data/build-dir/SCD-SCDFSAMPLES-JOB1/kafka-samples/kstreams-log-user-clicks-per-region/pom.xml) points at org.springframework.cloud.dataflow.samples:kafka-samples-parent instead of org.springframework.boot:spring-boot-starter-parent, please verify your project structure @ line 5, column 11
26-Jul-2019 07:25:50 [WARNING]
26-Jul-2019 07:25:50 [WARNING] Some problems were encountered while building the effective model for org.springframework.cloud.dataflow.samples:kstreams-word-count:jar:1.0.0.BUILD-SNAPSHOT
26-Jul-2019 07:25:50 [WARNING] 'parent.relativePath' of POM org.springframework.cloud.dataflow.samples:kstreams-word-count:1.0.0.BUILD-SNAPSHOT (/opt/bamboo-home/xml-data/build-dir/SCD-SCDFSAMPLES-JOB1/kafka-samples/kstreams-word-count/pom.xml) points at org.springframework.cloud.dataflow.samples:kafka-samples-parent instead of org.springframework.boot:spring-boot-starter-parent, please verify your project structure @ line 6, column 10
26-Jul-2019 07:25:50 [WARNING]
26-Jul-2019 07:25:50 [WARNING] It is highly recommended to fix these problems because they threaten the stability of your build.
26-Jul-2019 07:25:50 [WARNING]
26-Jul-2019 07:25:50 [WARNING] For this reason, future Maven versions might no longer support building such malformed projects.
26-Jul-2019 07:25:50 [WARNING]
26-Jul-2019 07:25:50 [INFO] Initializing Artifactory Build-Info Recording
26-Jul-2019 07:25:50 [INFO] ------------------------------------------------------------------------
26-Jul-2019 07:25:50 [INFO] Reactor Build Order:
26-Jul-2019 07:25:50 [INFO]
26-Jul-2019 07:25:50 [INFO] http-ingest
26-Jul-2019 07:25:50 [INFO] kstreams-join-user-clicks-and-region
26-Jul-2019 07:25:50 [INFO] kstreams-log-user-clicks-per-region
26-Jul-2019 07:25:50 [INFO] kstreams-word-count
26-Jul-2019 07:25:50 [INFO] kafka-samples-parent
26-Jul-2019 07:25:50 [INFO]                                                                         
26-Jul-2019 07:25:50 [INFO] ------------------------------------------------------------------------
26-Jul-2019 07:25:50 [INFO] Building http-ingest 1.0.0.BUILD-SNAPSHOT
26-Jul-2019 07:25:50 [INFO] ------------------------------------------------------------------------
26-Jul-2019 07:25:50 [INFO]
26-Jul-2019 07:25:50 [INFO] --- maven-clean-plugin:3.1.0:clean (default-clean) @ http-ingest ---
26-Jul-2019 07:25:50 [INFO] Deleting /opt/bamboo-home/xml-data/build-dir/SCD-SCDFSAMPLES-JOB1/kafka-samples/http-ingest/target
26-Jul-2019 07:25:50 [INFO]
26-Jul-2019 07:25:50 [INFO] --- maven-resources-plugin:3.1.0:resources (default-resources) @ http-ingest ---
26-Jul-2019 07:25:51 [INFO] Using 'UTF-8' encoding to copy filtered resources.
26-Jul-2019 07:25:51 [INFO] Copying 1 resource
26-Jul-2019 07:25:51 [INFO] Copying 0 resource
26-Jul-2019 07:25:51 [INFO]
26-Jul-2019 07:25:51 [INFO] --- maven-compiler-plugin:3.8.0:compile (default-compile) @ http-ingest ---
26-Jul-2019 07:25:51 [INFO] Changes detected - recompiling the module!
26-Jul-2019 07:25:51 [INFO] Compiling 1 source file to /opt/bamboo-home/xml-data/build-dir/SCD-SCDFSAMPLES-JOB1/kafka-samples/http-ingest/target/classes
26-Jul-2019 07:25:51 [INFO]
26-Jul-2019 07:25:51 [INFO] --- maven-resources-plugin:3.1.0:testResources (default-testResources) @ http-ingest ---
26-Jul-2019 07:25:51 [INFO] Using 'UTF-8' encoding to copy filtered resources.
26-Jul-2019 07:25:51 [INFO] skip non existing resourceDirectory /opt/bamboo-home/xml-data/build-dir/SCD-SCDFSAMPLES-JOB1/kafka-samples/http-ingest/src/test/resources
26-Jul-2019 07:25:51 [INFO]
26-Jul-2019 07:25:51 [INFO] --- maven-compiler-plugin:3.8.0:testCompile (default-testCompile) @ http-ingest ---
26-Jul-2019 07:25:51 [INFO] No sources to compile
26-Jul-2019 07:25:51 [INFO]
26-Jul-2019 07:25:51 [INFO] --- maven-surefire-plugin:2.22.1:test (default-test) @ http-ingest ---
26-Jul-2019 07:25:51 [INFO] No tests to run.
26-Jul-2019 07:25:51 [INFO]
26-Jul-2019 07:25:51 [INFO] --- maven-jar-plugin:3.1.1:jar (default-jar) @ http-ingest ---
26-Jul-2019 07:25:51 [INFO] Building jar: /opt/bamboo-home/xml-data/build-dir/SCD-SCDFSAMPLES-JOB1/kafka-samples/http-ingest/target/http-ingest-1.0.0.BUILD-SNAPSHOT.jar
26-Jul-2019 07:25:51 [INFO]
26-Jul-2019 07:25:51 [INFO] --- spring-boot-maven-plugin:2.1.3.RELEASE:repackage (repackage) @ http-ingest ---
26-Jul-2019 07:25:52 [INFO] Replacing main artifact with repackaged archive
26-Jul-2019 07:25:52 [INFO]
26-Jul-2019 07:25:52 [INFO] --- maven-install-plugin:2.5.2:install (default-install) @ http-ingest ---
26-Jul-2019 07:25:52 [INFO] Installing /opt/bamboo-home/xml-data/build-dir/SCD-SCDFSAMPLES-JOB1/kafka-samples/http-ingest/target/http-ingest-1.0.0.BUILD-SNAPSHOT.jar to /home/bamboo/.m2/repository/org/springframework/cloud/dataflow/samples/http-ingest/1.0.0.BUILD-SNAPSHOT/http-ingest-1.0.0.BUILD-SNAPSHOT.jar
26-Jul-2019 07:25:52 [INFO] Installing /opt/bamboo-home/xml-data/build-dir/SCD-SCDFSAMPLES-JOB1/kafka-samples/http-ingest/pom.xml to /home/bamboo/.m2/repository/org/springframework/cloud/dataflow/samples/http-ingest/1.0.0.BUILD-SNAPSHOT/http-ingest-1.0.0.BUILD-SNAPSHOT.pom
26-Jul-2019 07:25:52 [INFO]                                                                         
26-Jul-2019 07:25:52 [INFO] ------------------------------------------------------------------------
26-Jul-2019 07:25:52 [INFO] Building kstreams-join-user-clicks-and-region 1.0.0.BUILD-SNAPSHOT
26-Jul-2019 07:25:52 [INFO] ------------------------------------------------------------------------
26-Jul-2019 07:25:52 [INFO]
26-Jul-2019 07:25:52 [INFO] --- maven-clean-plugin:3.1.0:clean (default-clean) @ kstreams-join-user-clicks-and-region ---
26-Jul-2019 07:25:52 [INFO] Deleting /opt/bamboo-home/xml-data/build-dir/SCD-SCDFSAMPLES-JOB1/kafka-samples/kstreams-join-user-clicks-and-region/target
26-Jul-2019 07:25:52 [INFO]
26-Jul-2019 07:25:52 [INFO] --- maven-resources-plugin:3.1.0:resources (default-resources) @ kstreams-join-user-clicks-and-region ---
26-Jul-2019 07:25:52 [INFO] Using 'UTF-8' encoding to copy filtered resources.
26-Jul-2019 07:25:52 [INFO] Copying 1 resource
26-Jul-2019 07:25:52 [INFO] Copying 1 resource
26-Jul-2019 07:25:52 [INFO]
26-Jul-2019 07:25:52 [INFO] --- maven-compiler-plugin:3.8.0:compile (default-compile) @ kstreams-join-user-clicks-and-region ---
26-Jul-2019 07:25:52 [INFO] Changes detected - recompiling the module!
26-Jul-2019 07:25:52 [INFO] Compiling 1 source file to /opt/bamboo-home/xml-data/build-dir/SCD-SCDFSAMPLES-JOB1/kafka-samples/kstreams-join-user-clicks-and-region/target/classes
26-Jul-2019 07:25:52 [INFO]
26-Jul-2019 07:25:52 [INFO] --- maven-resources-plugin:3.1.0:testResources (default-testResources) @ kstreams-join-user-clicks-and-region ---
26-Jul-2019 07:25:52 [INFO] Using 'UTF-8' encoding to copy filtered resources.
26-Jul-2019 07:25:52 [INFO] skip non existing resourceDirectory /opt/bamboo-home/xml-data/build-dir/SCD-SCDFSAMPLES-JOB1/kafka-samples/kstreams-join-user-clicks-and-region/src/test/resources
26-Jul-2019 07:25:52 [INFO]
26-Jul-2019 07:25:52 [INFO] --- maven-compiler-plugin:3.8.0:testCompile (default-testCompile) @ kstreams-join-user-clicks-and-region ---
26-Jul-2019 07:25:52 [INFO] No sources to compile
26-Jul-2019 07:25:52 [INFO]
26-Jul-2019 07:25:52 [INFO] --- maven-surefire-plugin:2.22.1:test (default-test) @ kstreams-join-user-clicks-and-region ---
26-Jul-2019 07:25:52 [INFO] No tests to run.
26-Jul-2019 07:25:52 [INFO]
26-Jul-2019 07:25:52 [INFO] --- maven-jar-plugin:3.1.1:jar (default-jar) @ kstreams-join-user-clicks-and-region ---
26-Jul-2019 07:25:52 [INFO] Building jar: /opt/bamboo-home/xml-data/build-dir/SCD-SCDFSAMPLES-JOB1/kafka-samples/kstreams-join-user-clicks-and-region/target/kstreams-join-user-clicks-and-region-1.0.0.BUILD-SNAPSHOT.jar
26-Jul-2019 07:25:52 [INFO]
26-Jul-2019 07:25:52 [INFO] --- spring-boot-maven-plugin:2.1.3.RELEASE:repackage (repackage) @ kstreams-join-user-clicks-and-region ---
26-Jul-2019 07:25:52 [INFO] Replacing main artifact with repackaged archive
26-Jul-2019 07:25:52 [INFO]
26-Jul-2019 07:25:52 [INFO] --- maven-install-plugin:2.5.2:install (default-install) @ kstreams-join-user-clicks-and-region ---
26-Jul-2019 07:25:52 [INFO] Installing /opt/bamboo-home/xml-data/build-dir/SCD-SCDFSAMPLES-JOB1/kafka-samples/kstreams-join-user-clicks-and-region/target/kstreams-join-user-clicks-and-region-1.0.0.BUILD-SNAPSHOT.jar to /home/bamboo/.m2/repository/org/springframework/cloud/dataflow/samples/kstreams-join-user-clicks-and-region/1.0.0.BUILD-SNAPSHOT/kstreams-join-user-clicks-and-region-1.0.0.BUILD-SNAPSHOT.jar
26-Jul-2019 07:25:53 [INFO] Installing /opt/bamboo-home/xml-data/build-dir/SCD-SCDFSAMPLES-JOB1/kafka-samples/kstreams-join-user-clicks-and-region/pom.xml to /home/bamboo/.m2/repository/org/springframework/cloud/dataflow/samples/kstreams-join-user-clicks-and-region/1.0.0.BUILD-SNAPSHOT/kstreams-join-user-clicks-and-region-1.0.0.BUILD-SNAPSHOT.pom
26-Jul-2019 07:25:53 [INFO]                                                                         
26-Jul-2019 07:25:53 [INFO] ------------------------------------------------------------------------
26-Jul-2019 07:25:53 [INFO] Building kstreams-log-user-clicks-per-region 1.0.0.BUILD-SNAPSHOT
26-Jul-2019 07:25:53 [INFO] ------------------------------------------------------------------------
26-Jul-2019 07:25:53 [INFO]
26-Jul-2019 07:25:53 [INFO] --- maven-clean-plugin:3.1.0:clean (default-clean) @ kstreams-log-user-clicks-per-region ---
26-Jul-2019 07:25:53 [INFO] Deleting /opt/bamboo-home/xml-data/build-dir/SCD-SCDFSAMPLES-JOB1/kafka-samples/kstreams-log-user-clicks-per-region/target
26-Jul-2019 07:25:53 [INFO]
26-Jul-2019 07:25:53 [INFO] --- maven-resources-plugin:3.1.0:resources (default-resources) @ kstreams-log-user-clicks-per-region ---
26-Jul-2019 07:25:53 [INFO] Using 'UTF-8' encoding to copy filtered resources.
26-Jul-2019 07:25:53 [INFO] Copying 1 resource
26-Jul-2019 07:25:53 [INFO] Copying 0 resource
26-Jul-2019 07:25:53 [INFO]
26-Jul-2019 07:25:53 [INFO] --- maven-compiler-plugin:3.8.0:compile (default-compile) @ kstreams-log-user-clicks-per-region ---
26-Jul-2019 07:25:53 [INFO] Changes detected - recompiling the module!
26-Jul-2019 07:25:53 [INFO] Compiling 1 source file to /opt/bamboo-home/xml-data/build-dir/SCD-SCDFSAMPLES-JOB1/kafka-samples/kstreams-log-user-clicks-per-region/target/classes
26-Jul-2019 07:25:53 [INFO]
26-Jul-2019 07:25:53 [INFO] --- maven-resources-plugin:3.1.0:testResources (default-testResources) @ kstreams-log-user-clicks-per-region ---
26-Jul-2019 07:25:53 [INFO] Using 'UTF-8' encoding to copy filtered resources.
26-Jul-2019 07:25:53 [INFO] skip non existing resourceDirectory /opt/bamboo-home/xml-data/build-dir/SCD-SCDFSAMPLES-JOB1/kafka-samples/kstreams-log-user-clicks-per-region/src/test/resources
26-Jul-2019 07:25:53 [INFO]
26-Jul-2019 07:25:53 [INFO] --- maven-compiler-plugin:3.8.0:testCompile (default-testCompile) @ kstreams-log-user-clicks-per-region ---
26-Jul-2019 07:25:53 [INFO] No sources to compile
26-Jul-2019 07:25:53 [INFO]
26-Jul-2019 07:25:53 [INFO] --- maven-surefire-plugin:2.22.1:test (default-test) @ kstreams-log-user-clicks-per-region ---
26-Jul-2019 07:25:53 [INFO] No tests to run.
26-Jul-2019 07:25:53 [INFO]
26-Jul-2019 07:25:53 [INFO] --- maven-jar-plugin:3.1.1:jar (default-jar) @ kstreams-log-user-clicks-per-region ---
26-Jul-2019 07:25:53 [INFO] Building jar: /opt/bamboo-home/xml-data/build-dir/SCD-SCDFSAMPLES-JOB1/kafka-samples/kstreams-log-user-clicks-per-region/target/kstreams-log-user-clicks-per-region-1.0.0.BUILD-SNAPSHOT.jar
26-Jul-2019 07:25:53 [INFO]
26-Jul-2019 07:25:53 [INFO] --- spring-boot-maven-plugin:2.1.3.RELEASE:repackage (repackage) @ kstreams-log-user-clicks-per-region ---
26-Jul-2019 07:25:53 [INFO] Replacing main artifact with repackaged archive
26-Jul-2019 07:25:53 [INFO]
26-Jul-2019 07:25:53 [INFO] --- maven-install-plugin:2.5.2:install (default-install) @ kstreams-log-user-clicks-per-region ---
26-Jul-2019 07:25:53 [INFO] Installing /opt/bamboo-home/xml-data/build-dir/SCD-SCDFSAMPLES-JOB1/kafka-samples/kstreams-log-user-clicks-per-region/target/kstreams-log-user-clicks-per-region-1.0.0.BUILD-SNAPSHOT.jar to /home/bamboo/.m2/repository/org/springframework/cloud/dataflow/samples/kstreams-log-user-clicks-per-region/1.0.0.BUILD-SNAPSHOT/kstreams-log-user-clicks-per-region-1.0.0.BUILD-SNAPSHOT.jar
26-Jul-2019 07:25:53 [INFO] Installing /opt/bamboo-home/xml-data/build-dir/SCD-SCDFSAMPLES-JOB1/kafka-samples/kstreams-log-user-clicks-per-region/pom.xml to /home/bamboo/.m2/repository/org/springframework/cloud/dataflow/samples/kstreams-log-user-clicks-per-region/1.0.0.BUILD-SNAPSHOT/kstreams-log-user-clicks-per-region-1.0.0.BUILD-SNAPSHOT.pom
26-Jul-2019 07:25:53 [INFO]                                                                         
26-Jul-2019 07:25:53 [INFO] ------------------------------------------------------------------------
26-Jul-2019 07:25:53 [INFO] Building kstreams-word-count 1.0.0.BUILD-SNAPSHOT
26-Jul-2019 07:25:53 [INFO] ------------------------------------------------------------------------
26-Jul-2019 07:25:53 [INFO]
26-Jul-2019 07:25:53 [INFO] --- maven-clean-plugin:3.1.0:clean (default-clean) @ kstreams-word-count ---
26-Jul-2019 07:25:53 [INFO] Deleting /opt/bamboo-home/xml-data/build-dir/SCD-SCDFSAMPLES-JOB1/kafka-samples/kstreams-word-count/target
26-Jul-2019 07:25:53 [INFO]
26-Jul-2019 07:25:53 [INFO] --- maven-resources-plugin:3.1.0:resources (default-resources) @ kstreams-word-count ---
26-Jul-2019 07:25:53 [INFO] Using 'UTF-8' encoding to copy filtered resources.
26-Jul-2019 07:25:53 [INFO] Copying 1 resource
26-Jul-2019 07:25:53 [INFO] Copying 0 resource
26-Jul-2019 07:25:53 [INFO]
26-Jul-2019 07:25:53 [INFO] --- maven-compiler-plugin:3.8.0:compile (default-compile) @ kstreams-word-count ---
26-Jul-2019 07:25:53 [INFO] Changes detected - recompiling the module!
26-Jul-2019 07:25:53 [INFO] Compiling 1 source file to /opt/bamboo-home/xml-data/build-dir/SCD-SCDFSAMPLES-JOB1/kafka-samples/kstreams-word-count/target/classes
26-Jul-2019 07:25:53 [INFO]
26-Jul-2019 07:25:53 [INFO] --- maven-resources-plugin:3.1.0:testResources (default-testResources) @ kstreams-word-count ---
26-Jul-2019 07:25:53 [INFO] Using 'UTF-8' encoding to copy filtered resources.
26-Jul-2019 07:25:53 [INFO] skip non existing resourceDirectory /opt/bamboo-home/xml-data/build-dir/SCD-SCDFSAMPLES-JOB1/kafka-samples/kstreams-word-count/src/test/resources
26-Jul-2019 07:25:53 [INFO]
26-Jul-2019 07:25:53 [INFO] --- maven-compiler-plugin:3.8.0:testCompile (default-testCompile) @ kstreams-word-count ---
26-Jul-2019 07:25:53 [INFO] No sources to compile
26-Jul-2019 07:25:53 [INFO]
26-Jul-2019 07:25:53 [INFO] --- maven-surefire-plugin:2.22.1:test (default-test) @ kstreams-word-count ---
26-Jul-2019 07:25:53 [INFO] No tests to run.
26-Jul-2019 07:25:53 [INFO]
26-Jul-2019 07:25:53 [INFO] --- maven-jar-plugin:3.1.1:jar (default-jar) @ kstreams-word-count ---
26-Jul-2019 07:25:53 [INFO] Building jar: /opt/bamboo-home/xml-data/build-dir/SCD-SCDFSAMPLES-JOB1/kafka-samples/kstreams-word-count/target/kstreams-word-count-1.0.0.BUILD-SNAPSHOT.jar
26-Jul-2019 07:25:54 [INFO]
26-Jul-2019 07:25:54 [INFO] --- spring-boot-maven-plugin:2.1.3.RELEASE:repackage (repackage) @ kstreams-word-count ---
26-Jul-2019 07:25:54 [INFO] Replacing main artifact with repackaged archive
26-Jul-2019 07:25:54 [INFO]
26-Jul-2019 07:25:54 [INFO] --- maven-install-plugin:2.5.2:install (default-install) @ kstreams-word-count ---
26-Jul-2019 07:25:54 [INFO] Installing /opt/bamboo-home/xml-data/build-dir/SCD-SCDFSAMPLES-JOB1/kafka-samples/kstreams-word-count/target/kstreams-word-count-1.0.0.BUILD-SNAPSHOT.jar to /home/bamboo/.m2/repository/org/springframework/cloud/dataflow/samples/kstreams-word-count/1.0.0.BUILD-SNAPSHOT/kstreams-word-count-1.0.0.BUILD-SNAPSHOT.jar
26-Jul-2019 07:25:54 [INFO] Installing /opt/bamboo-home/xml-data/build-dir/SCD-SCDFSAMPLES-JOB1/kafka-samples/kstreams-word-count/pom.xml to /home/bamboo/.m2/repository/org/springframework/cloud/dataflow/samples/kstreams-word-count/1.0.0.BUILD-SNAPSHOT/kstreams-word-count-1.0.0.BUILD-SNAPSHOT.pom
26-Jul-2019 07:25:54 [INFO]                                                                         
26-Jul-2019 07:25:54 [INFO] ------------------------------------------------------------------------
26-Jul-2019 07:25:54 [INFO] Building kafka-samples-parent 1.0.0.BUILD-SNAPSHOT
26-Jul-2019 07:25:54 [INFO] ------------------------------------------------------------------------
26-Jul-2019 07:25:54 [INFO]
26-Jul-2019 07:25:54 [INFO] --- maven-clean-plugin:2.5:clean (default-clean) @ kafka-samples-parent ---
26-Jul-2019 07:25:54 [INFO] Deleting /opt/bamboo-home/xml-data/build-dir/SCD-SCDFSAMPLES-JOB1/kafka-samples/target
26-Jul-2019 07:25:54 [INFO]
26-Jul-2019 07:25:54 [INFO] --- maven-install-plugin:2.4:install (default-install) @ kafka-samples-parent ---
26-Jul-2019 07:25:54 [INFO] Installing /opt/bamboo-home/xml-data/build-dir/SCD-SCDFSAMPLES-JOB1/kafka-samples/pom.xml to /home/bamboo/.m2/repository/org/springframework/cloud/dataflow/samples/kafka-samples-parent/1.0.0.BUILD-SNAPSHOT/kafka-samples-parent-1.0.0.BUILD-SNAPSHOT.pom
26-Jul-2019 07:25:55 [INFO] Artifactory Build Info Recorder: Saving Build Info to '/opt/bamboo-home/xml-data/build-dir/SCD-SCDFSAMPLES-JOB1/kafka-samples/target/build-info.json'
26-Jul-2019 07:25:55 [INFO] Deploying artifact: https://repo.spring.io/libs-snapshot-local/org/springframework/cloud/dataflow/samples/kstreams-join-user-clicks-and-region/1.0.0.BUILD-SNAPSHOT/kstreams-join-user-clicks-and-region-1.0.0.BUILD-SNAPSHOT.jar
26-Jul-2019 07:25:58 [INFO] Deploying artifact: https://repo.spring.io/libs-snapshot-local/org/springframework/cloud/dataflow/samples/kstreams-join-user-clicks-and-region/1.0.0.BUILD-SNAPSHOT/kstreams-join-user-clicks-and-region-1.0.0.BUILD-SNAPSHOT.pom
26-Jul-2019 07:25:59 [INFO] Deploying artifact: https://repo.spring.io/libs-snapshot-local/org/springframework/cloud/dataflow/samples/http-ingest/1.0.0.BUILD-SNAPSHOT/http-ingest-1.0.0.BUILD-SNAPSHOT.jar
26-Jul-2019 07:26:01 [INFO] Deploying artifact: https://repo.spring.io/libs-snapshot-local/org/springframework/cloud/dataflow/samples/http-ingest/1.0.0.BUILD-SNAPSHOT/http-ingest-1.0.0.BUILD-SNAPSHOT.pom
26-Jul-2019 07:26:01 [INFO] Deploying artifact: https://repo.spring.io/libs-snapshot-local/org/springframework/cloud/dataflow/samples/kstreams-word-count/1.0.0.BUILD-SNAPSHOT/kstreams-word-count-1.0.0.BUILD-SNAPSHOT.jar
26-Jul-2019 07:26:04 [INFO] Deploying artifact: https://repo.spring.io/libs-snapshot-local/org/springframework/cloud/dataflow/samples/kstreams-word-count/1.0.0.BUILD-SNAPSHOT/kstreams-word-count-1.0.0.BUILD-SNAPSHOT.pom
26-Jul-2019 07:26:04 [INFO] Deploying artifact: https://repo.spring.io/libs-snapshot-local/org/springframework/cloud/dataflow/samples/kafka-samples-parent/1.0.0.BUILD-SNAPSHOT/kafka-samples-parent-1.0.0.BUILD-SNAPSHOT.pom
26-Jul-2019 07:26:04 [INFO] Deploying artifact: https://repo.spring.io/libs-snapshot-local/org/springframework/cloud/dataflow/samples/kstreams-log-user-clicks-per-region/1.0.0.BUILD-SNAPSHOT/kstreams-log-user-clicks-per-region-1.0.0.BUILD-SNAPSHOT.jar
26-Jul-2019 07:26:06 [INFO] Deploying artifact: https://repo.spring.io/libs-snapshot-local/org/springframework/cloud/dataflow/samples/kstreams-log-user-clicks-per-region/1.0.0.BUILD-SNAPSHOT/kstreams-log-user-clicks-per-region-1.0.0.BUILD-SNAPSHOT.pom
26-Jul-2019 07:26:07 [INFO] Artifactory Build Info Recorder: Deploying build info ...
26-Jul-2019 07:26:08 [INFO] Deploying build descriptor to: https://repo.spring.io/api/build
26-Jul-2019 07:26:09 [INFO] Build successfully deployed. Browse it in Artifactory under https://repo.spring.io/webapp/builds/Spring%20Cloud%20Data%20Flow%20-%20Spring%20Cloud%20Data%20Flow%20Samples%20-%20Build%20SCDF%20Samples/84
26-Jul-2019 07:26:09 [INFO] ------------------------------------------------------------------------
26-Jul-2019 07:26:09 [INFO] Reactor Summary:
26-Jul-2019 07:26:09 [INFO]
26-Jul-2019 07:26:09 [INFO] http-ingest ........................................ SUCCESS [  1.898 s]
26-Jul-2019 07:26:09 [INFO] kstreams-join-user-clicks-and-region ............... SUCCESS [  0.376 s]
26-Jul-2019 07:26:09 [INFO] kstreams-log-user-clicks-per-region ................ SUCCESS [  0.308 s]
26-Jul-2019 07:26:09 [INFO] kstreams-word-count ................................ SUCCESS [  0.305 s]
26-Jul-2019 07:26:09 [INFO] kafka-samples-parent ............................... SUCCESS [  0.051 s]
26-Jul-2019 07:26:09 [INFO] ------------------------------------------------------------------------
26-Jul-2019 07:26:09 [INFO] BUILD SUCCESS
26-Jul-2019 07:26:09 [INFO] ------------------------------------------------------------------------
26-Jul-2019 07:26:09 [INFO] Total time: 19.428 s
26-Jul-2019 07:26:09 [INFO] Finished at: 2019-07-26T07:26:09+00:00
26-Jul-2019 07:26:09 [INFO] Final Memory: 67M/770M
26-Jul-2019 07:26:09 [INFO] ------------------------------------------------------------------------
26-Jul-2019 07:26:09 Finished task 'Build and Publish Kafka samples' with result: Success
26-Jul-2019 07:26:09 Starting task 'Build and Publish streams guide RabbitMQ samples' of type 'org.jfrog.bamboo.bamboo-artifactory-plugin:maven3Task'
26-Jul-2019 07:26:09 Bamboo Artifactory Plugin version: 2.6.3
26-Jul-2019 07:26:09
Beginning to execute external process for build 'Spring Cloud Data Flow - Spring Cloud Data Flow Samples - Build SCDF Samples #84 (SCD-SCDFSAMPLES-JOB1-84)'
... running command line:
/opt/jdk-8/bin/java -cp /opt/maven-3.0/boot/plexus-classworlds-2.4.jar -Dclassworlds.conf=/tmp/artifactoryM23423060271617732316conf -DbuildInfoConfig.propertiesFile=/tmp/buildInfo2615710026002427687.properties -Dmaven.home=/opt/maven-3.0 -Dmaven.multiModuleProjectDirectory=/opt/bamboo-home/xml-data/build-dir/SCD-SCDFSAMPLES-JOB1/dataflow-website/stream-developer-guides/streams/standalone-stream-rabbitmq org.codehaus.plexus.classworlds.launcher.Launcher clean install jib:dockerBuild -Dartifactory.publish.password=********
... in: /opt/bamboo-home/xml-data/build-dir/SCD-SCDFSAMPLES-JOB1/dataflow-website/stream-developer-guides/streams/standalone-stream-rabbitmq
... using extra environment variables:
bamboo_planRepository_1_branch=master
bamboo_********_username_password=********
bamboo_signing_store_password=********
bamboo_capability_system_builder_ant_Ant_1_9=/opt/ant-1.9
bamboo_capability_system_builder_ant_Ant_1_8=/opt/ant-1.8
bamboo_planRepository_1_branchDisplayName=master
bamboo_artifactory_override_resolve_repo=libs-milestone
bamboo_capability_system_builder_node_Node_js_10_16=/opt/node-10.16/bin/node
bamboo_repository_revision_number=2d0c3cd5d77c85015834e1fbb411759dbe67a41b
bamboo_RIAK_BIN=/usr/sbin/riak
WRAPPER_BITS=32
bamboo_buildKey=SCD-SCDFSAMPLES-JOB1
bamboo_bintray_password=********
bamboo_sonar_token_password=********
PWD=/opt/bamboo-home/bin
bamboo_shortJobName=Build SCDF Samples
bamboo_repository_254541938_git_repositoryUrl=https://github.com/spring-cloud/spring-cloud-dataflow-samples.git
bamboo_artifactory_override_resolver_password=********
bamboo_sonatype_token=RSJChaox
bamboo_capability_system_builder_gradle___gradlew=./gradlew
bamboo_buildResultsUrl=https://build.spring.io/browse/SCD-SCDFSAMPLES-JOB1-84
bamboo_capability_system_builder_mvn3_Maven_3_3=/opt/maven-3.3
bamboo_repository_254541938_name=Git
bamboo_build_commandline_org_jfrog_bamboo_bamboo_artifactory_plugin_maven3Task_9=/opt/jdk-8/bin/java -cp /opt/maven-3.3/boot/plexus-classworlds-2.5.2.jar -Dclassworlds.conf=/tmp/artifactoryM23492208274627715064conf -DbuildInfoConfig.propertiesFile=/tmp/buildInfo8620315909526026832.properties -Dmaven.home=/opt/maven-3.3 -Dmaven.multiModuleProjectDirectory=/opt/bamboo-home/xml-data/build-dir/SCD-SCDFSAMPLES-JOB1/kafka-samples org.codehaus.plexus.classworlds.launcher.Launcher clean install -Dartifactory.publish.password=********
bamboo_capability_system_builder_mvn3_Maven_3_2=/opt/maven-3.2
bamboo_capability_system_builder_mvn3_Maven_3_1=/opt/maven-3.1
bamboo_planRepository_repositoryUrl=https://github.com/spring-cloud/spring-cloud-dataflow-samples.git
bamboo_capability_system_builder_mvn3_Maven_3_6=/opt/maven-3.6
bamboo_agentId=286195714
bamboo_capability_system_builder_mvn3_Maven_3_5=/opt/maven-3.5
bamboo_capability_system_builder_mvn3_Maven_3_0=/opt/maven-3.0
bamboo_planRepository_revision=2d0c3cd5d77c85015834e1fbb411759dbe67a41b
bamboo_planRepository_previousRevision=dbbf78588b4c016a8829543780609347461b05db
bamboo_capability_remote_build=true
bamboo_repository_branch_name=master
bamboo_sonatype_token_password=********
bamboo_build_commandline_org_jfrog_bamboo_bamboo_artifactory_plugin_maven3Task_8=/opt/jdk-8/bin/java -cp /opt/maven-3.3/boot/plexus-classworlds-2.5.2.jar -Dclassworlds.conf=/tmp/artifactoryM24659829728282835841conf -DbuildInfoConfig.propertiesFile=/tmp/buildInfo403602777587515602.properties -Dmaven.home=/opt/maven-3.3 -Dmaven.multiModuleProjectDirectory=/opt/bamboo-home/xml-data/build-dir/SCD-SCDFSAMPLES-JOB1/kafka-samples org.codehaus.plexus.classworlds.launcher.Launcher clean install -P spring,full -Dartifactory.publish.password=********
bamboo_sonatype_user=springsource
SHLVL=1
bamboo_org_jfrog_bamboo_buildInfo_serverUrl=https://repo.spring.io
bamboo_scdf_acceptance_tests_password=********
bamboo_repository_254541938_previous_revision_number=dbbf78588b4c016a8829543780609347461b05db
WRAPPER_OS=linux
TERM=linux
XDG_SESSION_ID=c1
bamboo_repository_254541938_git_branch=master
bamboo_planRepository_branch=master
bamboo_org_jfrog_bamboo_release_activated=false
bamboo_planRepository_1_type=gitv2
bamboo_planRepository_branchName=master
bamboo_capability_system_jdk_JDK_12=/opt/jdk-12
WRAPPER_FILE_SEPARATOR=/
_=/opt/bamboo-home/bin/bamboo-agent.sh
bamboo_capability_system_builder_gradlew_gradlew=./
bamboo_capability_system_builder_ant_Ant_1_10=/opt/ant-1.10
WRAPPER_PATH_SEPARATOR=:
bamboo_sonar_password=********
bamboo_hg_cache_directory=/opt/bamboo-home/xml-data/build-dir/_hg-repositories-cache
bamboo_planRepository_1_username=spring-buildmaster
bamboo_planRepository_type=gitv2
bamboo_git_cache_directory=/opt/bamboo-home/xml-data/build-dir/_git-repositories-cache
bamboo_repository_254541938_git_username=spring-buildmaster
bamboo_artifactory_username=buildmaster
bamboo_tmp_directory=/opt/bamboo-home/temp
bamboo_planKey=SCD-SCDFSAMPLES
bamboo_planRepository_username=spring-buildmaster
bamboo_JDK8_HOME=/opt/jdk-8
bamboo_planRepository_1_branchName=master
bamboo_sonar_version=5.6.3
bamboo_sonar_jdbc_password=********
bamboo_bintray_api_key_password=********
XDG_DATA_DIRS=/usr/local/share:/usr/share:/var/lib/snapd/desktop
bamboo_capability_system_jdk_JDK_1_11=/opt/jdk-11
bamboo_resultsUrl=https://build.spring.io/browse/SCD-SCDFSAMPLES-JOB1-84
bamboo_capability_system_jdk_JDK_1_10=/opt/jdk-10
bamboo_build_working_directory=/opt/bamboo-home/xml-data/build-dir/SCD-SCDFSAMPLES-JOB1
bamboo_planRepository_1_name=Git
bamboo_capability_system_os=ubuntu1804
bamboo_nexusPush_stagingProfile=buildmaster
bamboo_shortPlanName=Spring Cloud Data Flow Samples
MAIL=/var/mail/bamboo
bamboo_planRepository_name=Git
LOGNAME=bamboo
bamboo_buildNumber=84
SHELL=/bin/bash
bamboo_repository_254541938_branch_name=master
bamboo_planName=Spring Cloud Data Flow - Spring Cloud Data Flow Samples
bamboo_JDK7_HOME=/opt/jdk-7
bamboo_shortPlanKey=SCDFSAMPLES
OLDPWD=/opt/users/bamboo
bamboo_shortJobKey=JOB1
bamboo_artifactory_password=********
bamboo_buildTimeStamp=2019-07-26T07:25:03.789Z
bamboo_repository_previous_revision_number=dbbf78588b4c016a8829543780609347461b05db
bamboo_sonar_username=buildmaster
bamboo_********_password=********
bamboo_repository_git_branch=master
bamboo_buildResultKey=SCD-SCDFSAMPLES-JOB1-84
bamboo_nexusPush_close=true
bamboo_artifactory_override_resolver_username=buildmaster
bamboo_buildPlanName=Spring Cloud Data Flow - Spring Cloud Data Flow Samples - Build SCDF Samples
bamboo_planRepository_1_revision=2d0c3cd5d77c85015834e1fbb411759dbe67a41b
bamboo_repository_name=Git
bamboo_signing_key_password=********
bamboo_repository_254541938_revision_number=2d0c3cd5d77c85015834e1fbb411759dbe67a41b
bamboo_capability_system_builder_groovy_Groovy_2_5=/opt/groovy-2.5
LANG=en_US.UTF-8
bamboo_buildFailed=false
bamboo_capability_system_docker_executable=/usr/bin/docker
DISPLAY=localhost:1.0
bamboo_capability_system_jdk_OpenJDK_7=/opt/jdk-7
bamboo_capability_system_builder_groovy_Groovy_2_4=/opt/groovy-2.4
bamboo_artifactory_override_deployer_username=buildmaster
bamboo_capability_system_builder_command_Bash=/bin/bash
bamboo_artifactory_password_mask_a=********
bamboo_agentWorkingDirectory=/opt/bamboo-home/xml-data/build-dir
bamboo_capability_system_git_executable=/usr/bin/git
bamboo_repository_git_username=spring-buildmaster
bamboo_planRepository_1_previousRevision=dbbf78588b4c016a8829543780609347461b05db
bamboo_capability_os_family=unix
bamboo_planRepository_branchDisplayName=master
bamboo_capability_system_builder_maven_Artifactory_Maven_3_6=/opt/maven-3.6
bamboo_capability_system_builder_maven_Artifactory_Maven_3_5=/opt/maven-3.5
GIT_SSL_NO_VERIFY=true
bamboo_capability_system_builder_maven_Artifactory_Maven_3_3=/opt/maven-3.3
bamboo_capability_system_builder_maven_Artifactory_Maven_3_2=/opt/maven-3.2
bamboo_s3_properties=/home/bamboo/tools/s3.properties
bamboo_capability_system_builder_maven_Artifactory_Maven_3_1=/opt/maven-3.1
bamboo_artifactory_override_deploy_repo=libs-snapshot-local
bamboo_capability_system_builder_maven_Artifactory_Maven_3_0=/opt/maven-3.0
bamboo_plan_storageTag=plan-254345444
bamboo_bintray_username_password=********
USER=bamboo
bamboo_repository_git_repositoryUrl=https://github.com/spring-cloud/spring-cloud-dataflow-samples.git
bamboo_working_directory=/opt/bamboo-home/xml-data/build-dir/SCD-SCDFSAMPLES-JOB1
bamboo_org_jfrog_bamboo_buildInfo_activated=true
bamboo_planRepository_1_repositoryUrl=https://github.com/spring-cloud/spring-cloud-dataflow-samples.git
bamboo_capability_system_jdk_JDK_1_8=/opt/jdk-8
bamboo_artifactory_override_deployer_password=********
bamboo_capability_system_jdk_JDK_1_9=/opt/jdk-9
WRAPPER_ARCH=x86
bamboo_capability_system_jdk_JDK_1_6=/opt/jdk-6
bamboo_sonatype_password=********
bamboo_capability_system_jdk_JDK_1_7=/opt/jdk-7
bamboo_sonar_ip=10.194.6.9
XDG_RUNTIME_DIR=/run/user/1002
HOME=/home/bamboo
PATH=/bin:/home/bamboo/bin:/usr/local/sbin:/usr/local/bin:/usr/sbin:/usr/bin:/sbin:/bin:/usr/games:/usr/local/games:/snap/bin:/home/bamboo/bin:/usr/local/bin:/bin:/home/bamboo/bin:/usr/local/sbin:/usr/local/bin:/usr/sbin:/usr/bin:/sbin:/bin:/usr/games:/usr/local/games:/snap/bin:/home/bamboo/bin:/usr/local/bin
26-Jul-2019 07:26:10 [INFO] Scanning for projects...
26-Jul-2019 07:26:10 Downloading: https://repo.spring.io/libs-snapshot/org/springframework/boot/spring-boot-starter-parent/2.1.4.RELEASE/spring-boot-starter-parent-2.1.4.RELEASE.pom
26-Jul-2019 07:26:10 1/7 KB   
26-Jul-2019 07:26:10 3/7 KB   
26-Jul-2019 07:26:10 4/7 KB   
26-Jul-2019 07:26:10 5/7 KB   
26-Jul-2019 07:26:10 7/7 KB   
26-Jul-2019 07:26:10 7/7 KB   
26-Jul-2019 07:26:10          
26-Jul-2019 07:26:10 Downloaded: https://repo.spring.io/libs-snapshot/org/springframework/boot/spring-boot-starter-parent/2.1.4.RELEASE/spring-boot-starter-parent-2.1.4.RELEASE.pom (7 KB at 20.6 KB/sec)
26-Jul-2019 07:26:10 [WARNING]
26-Jul-2019 07:26:10 [WARNING] Some problems were encountered while building the effective model for io.spring.dataflow.sample:usage-cost-logger-rabbit:jar:0.0.1-SNAPSHOT
26-Jul-2019 07:26:10 [WARNING] 'dependencyManagement.dependencies.dependency.exclusions.exclusion.artifactId' for com.netflix.eureka:eureka-core:jar with value '*' does not match a valid id pattern. @ org.springframework.cloud:spring-cloud-netflix-dependencies:2.1.1.RELEASE, /home/bamboo/.m2/repository/org/springframework/cloud/spring-cloud-netflix-dependencies/2.1.1.RELEASE/spring-cloud-netflix-dependencies-2.1.1.RELEASE.pom, line 267, column 19
26-Jul-2019 07:26:10 [WARNING]
26-Jul-2019 07:26:10 [WARNING] Some problems were encountered while building the effective model for io.spring.dataflow.sample:usage-cost-processor-rabbit:jar:0.0.1-SNAPSHOT
26-Jul-2019 07:26:10 [WARNING] 'dependencyManagement.dependencies.dependency.exclusions.exclusion.artifactId' for com.netflix.eureka:eureka-core:jar with value '*' does not match a valid id pattern. @ org.springframework.cloud:spring-cloud-netflix-dependencies:2.1.1.RELEASE, /home/bamboo/.m2/repository/org/springframework/cloud/spring-cloud-netflix-dependencies/2.1.1.RELEASE/spring-cloud-netflix-dependencies-2.1.1.RELEASE.pom, line 267, column 19
26-Jul-2019 07:26:10 [WARNING]
26-Jul-2019 07:26:10 [WARNING] Some problems were encountered while building the effective model for io.spring.dataflow.sample:usage-detail-sender-rabbit:jar:0.0.1-SNAPSHOT
26-Jul-2019 07:26:10 [WARNING] 'dependencyManagement.dependencies.dependency.exclusions.exclusion.artifactId' for com.netflix.eureka:eureka-core:jar with value '*' does not match a valid id pattern. @ org.springframework.cloud:spring-cloud-netflix-dependencies:2.1.1.RELEASE, /home/bamboo/.m2/repository/org/springframework/cloud/spring-cloud-netflix-dependencies/2.1.1.RELEASE/spring-cloud-netflix-dependencies-2.1.1.RELEASE.pom, line 267, column 19
26-Jul-2019 07:26:10 [WARNING]
26-Jul-2019 07:26:10 [WARNING] Some problems were encountered while building the effective model for io.spring.dataflow.sample:usage-cost-stream-rabbit:pom:0.0.1-SNAPSHOT
26-Jul-2019 07:26:10 [WARNING] 'dependencyManagement.dependencies.dependency.exclusions.exclusion.artifactId' for com.netflix.eureka:eureka-core:jar with value '*' does not match a valid id pattern. @ org.springframework.cloud:spring-cloud-netflix-dependencies:2.1.1.RELEASE, /home/bamboo/.m2/repository/org/springframework/cloud/spring-cloud-netflix-dependencies/2.1.1.RELEASE/spring-cloud-netflix-dependencies-2.1.1.RELEASE.pom, line 267, column 19
26-Jul-2019 07:26:10 [WARNING]
26-Jul-2019 07:26:10 [WARNING] It is highly recommended to fix these problems because they threaten the stability of your build.
26-Jul-2019 07:26:10 [WARNING]
26-Jul-2019 07:26:10 [WARNING] For this reason, future Maven versions might no longer support building such malformed projects.
26-Jul-2019 07:26:10 [WARNING]
26-Jul-2019 07:26:10 [INFO] Initializing Artifactory Build-Info Recording
26-Jul-2019 07:26:10 [INFO] ------------------------------------------------------------------------
26-Jul-2019 07:26:10 [INFO] Reactor Build Order:
26-Jul-2019 07:26:10 [INFO]
26-Jul-2019 07:26:10 [INFO] usage-cost-stream-rabbit
26-Jul-2019 07:26:10 [INFO] usage-cost-logger
26-Jul-2019 07:26:10 [INFO] usage-cost-processor
26-Jul-2019 07:26:10 [INFO] usage-detail-sender
26-Jul-2019 07:26:10 Downloading: https://repo.spring.io/libs-snapshot-local/org/springframework/boot/spring-boot-maven-plugin/2.1.4.RELEASE/spring-boot-maven-plugin-2.1.4.RELEASE.pom
26-Jul-2019 07:26:10          
26-Jul-2019 07:26:10 Downloading: https://repo.spring.io/libs-milestone-local/org/springframework/boot/spring-boot-maven-plugin/2.1.4.RELEASE/spring-boot-maven-plugin-2.1.4.RELEASE.pom
26-Jul-2019 07:26:10          
26-Jul-2019 07:26:10 Downloading: http://repo.maven.apache.org/maven2/org/springframework/boot/spring-boot-maven-plugin/2.1.4.RELEASE/spring-boot-maven-plugin-2.1.4.RELEASE.pom
26-Jul-2019 07:26:11 Jul 26, 2019 7:26:11 AM org.apache.maven.wagon.providers.http.httpclient.impl.client.DefaultRequestDirector tryExecute
26-Jul-2019 07:26:11 INFO: I/O exception (java.net.SocketException) caught when processing request: Connection reset
26-Jul-2019 07:26:11 Jul 26, 2019 7:26:11 AM org.apache.maven.wagon.providers.http.httpclient.impl.client.DefaultRequestDirector tryExecute
26-Jul-2019 07:26:11 INFO: Retrying request
26-Jul-2019 07:26:11 Jul 26, 2019 7:26:11 AM org.apache.maven.wagon.providers.http.httpclient.impl.client.DefaultRequestDirector tryExecute
26-Jul-2019 07:26:11 INFO: I/O exception (java.net.SocketException) caught when processing request: Connection reset
26-Jul-2019 07:26:11 Jul 26, 2019 7:26:11 AM org.apache.maven.wagon.providers.http.httpclient.impl.client.DefaultRequestDirector tryExecute
26-Jul-2019 07:26:11 INFO: Retrying request
26-Jul-2019 07:26:11 Jul 26, 2019 7:26:11 AM org.apache.maven.wagon.providers.http.httpclient.impl.client.DefaultRequestDirector tryExecute
26-Jul-2019 07:26:11 INFO: I/O exception (java.net.SocketException) caught when processing request: Connection reset
26-Jul-2019 07:26:11 Jul 26, 2019 7:26:11 AM org.apache.maven.wagon.providers.http.httpclient.impl.client.DefaultRequestDirector tryExecute
26-Jul-2019 07:26:11 INFO: Retrying request
26-Jul-2019 07:26:11          
26-Jul-2019 07:26:11 [WARNING] Failed to retrieve plugin descriptor for org.springframework.boot:spring-boot-maven-plugin:2.1.4.RELEASE: Plugin org.springframework.boot:spring-boot-maven-plugin:2.1.4.RELEASE or one of its dependencies could not be resolved: Failed to read artifact descriptor for org.springframework.boot:spring-boot-maven-plugin:jar:2.1.4.RELEASE
26-Jul-2019 07:26:11 Downloading: https://repo.spring.io/libs-snapshot-local/com/google/cloud/tools/jib-maven-plugin/0.10.1/jib-maven-plugin-0.10.1.pom
26-Jul-2019 07:26:11          
26-Jul-2019 07:26:11 Downloading: https://repo.spring.io/libs-milestone-local/com/google/cloud/tools/jib-maven-plugin/0.10.1/jib-maven-plugin-0.10.1.pom
26-Jul-2019 07:26:11          
26-Jul-2019 07:26:11 Downloading: http://repo.maven.apache.org/maven2/com/google/cloud/tools/jib-maven-plugin/0.10.1/jib-maven-plugin-0.10.1.pom
26-Jul-2019 07:26:11 Jul 26, 2019 7:26:11 AM org.apache.maven.wagon.providers.http.httpclient.impl.client.DefaultRequestDirector tryExecute
26-Jul-2019 07:26:11 INFO: I/O exception (java.net.SocketException) caught when processing request: Connection reset
26-Jul-2019 07:26:11 Jul 26, 2019 7:26:11 AM org.apache.maven.wagon.providers.http.httpclient.impl.client.DefaultRequestDirector tryExecute
26-Jul-2019 07:26:11 INFO: Retrying request
26-Jul-2019 07:26:11 Jul 26, 2019 7:26:11 AM org.apache.maven.wagon.providers.http.httpclient.impl.client.DefaultRequestDirector tryExecute
26-Jul-2019 07:26:11 INFO: I/O exception (java.net.SocketException) caught when processing request: Connection reset
26-Jul-2019 07:26:11 Jul 26, 2019 7:26:11 AM org.apache.maven.wagon.providers.http.httpclient.impl.client.DefaultRequestDirector tryExecute
26-Jul-2019 07:26:11 INFO: Retrying request
26-Jul-2019 07:26:11 Jul 26, 2019 7:26:11 AM org.apache.maven.wagon.providers.http.httpclient.impl.client.DefaultRequestDirector tryExecute
26-Jul-2019 07:26:11 INFO: I/O exception (java.net.SocketException) caught when processing request: Connection reset
26-Jul-2019 07:26:11 Jul 26, 2019 7:26:11 AM org.apache.maven.wagon.providers.http.httpclient.impl.client.DefaultRequestDirector tryExecute
26-Jul-2019 07:26:11 INFO: Retrying request
26-Jul-2019 07:26:11          
26-Jul-2019 07:26:11 [WARNING] Failed to retrieve plugin descriptor for com.google.cloud.tools:jib-maven-plugin:0.10.1: Plugin com.google.cloud.tools:jib-maven-plugin:0.10.1 or one of its dependencies could not be resolved: Failed to read artifact descriptor for com.google.cloud.tools:jib-maven-plugin:jar:0.10.1
26-Jul-2019 07:26:11 Downloading: https://repo.spring.io/libs-snapshot-local/org/springframework/boot/spring-boot-maven-plugin/2.1.4.RELEASE/spring-boot-maven-plugin-2.1.4.RELEASE.pom
26-Jul-2019 07:26:11          
26-Jul-2019 07:26:11 Downloading: https://repo.spring.io/libs-milestone-local/org/springframework/boot/spring-boot-maven-plugin/2.1.4.RELEASE/spring-boot-maven-plugin-2.1.4.RELEASE.pom
26-Jul-2019 07:26:11          
26-Jul-2019 07:26:11 Downloading: http://repo.maven.apache.org/maven2/org/springframework/boot/spring-boot-maven-plugin/2.1.4.RELEASE/spring-boot-maven-plugin-2.1.4.RELEASE.pom
26-Jul-2019 07:26:11 Jul 26, 2019 7:26:11 AM org.apache.maven.wagon.providers.http.httpclient.impl.client.DefaultRequestDirector tryExecute
26-Jul-2019 07:26:11 INFO: I/O exception (java.net.SocketException) caught when processing request: Connection reset
26-Jul-2019 07:26:11 Jul 26, 2019 7:26:11 AM org.apache.maven.wagon.providers.http.httpclient.impl.client.DefaultRequestDirector tryExecute
26-Jul-2019 07:26:11 INFO: Retrying request
26-Jul-2019 07:26:11 Jul 26, 2019 7:26:11 AM org.apache.maven.wagon.providers.http.httpclient.impl.client.DefaultRequestDirector tryExecute
26-Jul-2019 07:26:11 INFO: I/O exception (java.net.SocketException) caught when processing request: Connection reset
26-Jul-2019 07:26:11 Jul 26, 2019 7:26:11 AM org.apache.maven.wagon.providers.http.httpclient.impl.client.DefaultRequestDirector tryExecute
26-Jul-2019 07:26:11 INFO: Retrying request
26-Jul-2019 07:26:11 Jul 26, 2019 7:26:11 AM org.apache.maven.wagon.providers.http.httpclient.impl.client.DefaultRequestDirector tryExecute
26-Jul-2019 07:26:11 INFO: I/O exception (java.net.SocketException) caught when processing request: Connection reset
26-Jul-2019 07:26:11 Jul 26, 2019 7:26:11 AM org.apache.maven.wagon.providers.http.httpclient.impl.client.DefaultRequestDirector tryExecute
26-Jul-2019 07:26:11 INFO: Retrying request
26-Jul-2019 07:26:11          
26-Jul-2019 07:26:11 [WARNING] Failed to retrieve plugin descriptor for org.springframework.boot:spring-boot-maven-plugin:2.1.4.RELEASE: Plugin org.springframework.boot:spring-boot-maven-plugin:2.1.4.RELEASE or one of its dependencies could not be resolved: Failed to read artifact descriptor for org.springframework.boot:spring-boot-maven-plugin:jar:2.1.4.RELEASE
26-Jul-2019 07:26:11 Downloading: https://repo.spring.io/libs-snapshot-local/org/apache/maven/plugins/maven-release-plugin/2.0/maven-release-plugin-2.0.pom
26-Jul-2019 07:26:11          
26-Jul-2019 07:26:11 Downloading: https://repo.spring.io/libs-milestone-local/org/apache/maven/plugins/maven-release-plugin/2.0/maven-release-plugin-2.0.pom
26-Jul-2019 07:26:11          
26-Jul-2019 07:26:11 Downloading: http://repo.maven.apache.org/maven2/org/apache/maven/plugins/maven-release-plugin/2.0/maven-release-plugin-2.0.pom
26-Jul-2019 07:26:11 Jul 26, 2019 7:26:11 AM org.apache.maven.wagon.providers.http.httpclient.impl.client.DefaultRequestDirector tryExecute
26-Jul-2019 07:26:11 INFO: I/O exception (java.net.SocketException) caught when processing request: Connection reset
26-Jul-2019 07:26:11 Jul 26, 2019 7:26:11 AM org.apache.maven.wagon.providers.http.httpclient.impl.client.DefaultRequestDirector tryExecute
26-Jul-2019 07:26:11 INFO: Retrying request
26-Jul-2019 07:26:11 Jul 26, 2019 7:26:11 AM org.apache.maven.wagon.providers.http.httpclient.impl.client.DefaultRequestDirector tryExecute
26-Jul-2019 07:26:11 INFO: I/O exception (java.net.SocketException) caught when processing request: Connection reset
26-Jul-2019 07:26:11 Jul 26, 2019 7:26:11 AM org.apache.maven.wagon.providers.http.httpclient.impl.client.DefaultRequestDirector tryExecute
26-Jul-2019 07:26:11 INFO: Retrying request
26-Jul-2019 07:26:12 Jul 26, 2019 7:26:12 AM org.apache.maven.wagon.providers.http.httpclient.impl.client.DefaultRequestDirector tryExecute
26-Jul-2019 07:26:12 INFO: I/O exception (java.net.SocketException) caught when processing request: Connection reset
26-Jul-2019 07:26:12 Jul 26, 2019 7:26:12 AM org.apache.maven.wagon.providers.http.httpclient.impl.client.DefaultRequestDirector tryExecute
26-Jul-2019 07:26:12 INFO: Retrying request
26-Jul-2019 07:26:12          
26-Jul-2019 07:26:12 [WARNING] Failed to retrieve plugin descriptor for org.apache.maven.plugins:maven-release-plugin:2.0: Plugin org.apache.maven.plugins:maven-release-plugin:2.0 or one of its dependencies could not be resolved: Failed to read artifact descriptor for org.apache.maven.plugins:maven-release-plugin:jar:2.0
26-Jul-2019 07:26:12 Downloading: https://repo.spring.io/libs-snapshot-local/org/codehaus/mojo/versions-maven-plugin/2.7/versions-maven-plugin-2.7.pom
26-Jul-2019 07:26:12          
26-Jul-2019 07:26:12 Downloading: https://repo.spring.io/libs-milestone-local/org/codehaus/mojo/versions-maven-plugin/2.7/versions-maven-plugin-2.7.pom
26-Jul-2019 07:26:12          
26-Jul-2019 07:26:12 Downloading: http://repo.maven.apache.org/maven2/org/codehaus/mojo/versions-maven-plugin/2.7/versions-maven-plugin-2.7.pom
26-Jul-2019 07:26:12 Jul 26, 2019 7:26:12 AM org.apache.maven.wagon.providers.http.httpclient.impl.client.DefaultRequestDirector tryExecute
26-Jul-2019 07:26:12 INFO: I/O exception (java.net.SocketException) caught when processing request: Connection reset
26-Jul-2019 07:26:12 Jul 26, 2019 7:26:12 AM org.apache.maven.wagon.providers.http.httpclient.impl.client.DefaultRequestDirector tryExecute
26-Jul-2019 07:26:12 INFO: Retrying request
26-Jul-2019 07:26:12 Jul 26, 2019 7:26:12 AM org.apache.maven.wagon.providers.http.httpclient.impl.client.DefaultRequestDirector tryExecute
26-Jul-2019 07:26:12 INFO: I/O exception (java.net.SocketException) caught when processing request: Connection reset
26-Jul-2019 07:26:12 Jul 26, 2019 7:26:12 AM org.apache.maven.wagon.providers.http.httpclient.impl.client.DefaultRequestDirector tryExecute
26-Jul-2019 07:26:12 INFO: Retrying request
26-Jul-2019 07:26:12 Jul 26, 2019 7:26:12 AM org.apache.maven.wagon.providers.http.httpclient.impl.client.DefaultRequestDirector tryExecute
26-Jul-2019 07:26:12 INFO: I/O exception (java.net.SocketException) caught when processing request: Connection reset
26-Jul-2019 07:26:12 Jul 26, 2019 7:26:12 AM org.apache.maven.wagon.providers.http.httpclient.impl.client.DefaultRequestDirector tryExecute
26-Jul-2019 07:26:12 INFO: Retrying request
26-Jul-2019 07:26:12          
26-Jul-2019 07:26:12 [WARNING] Failed to retrieve plugin descriptor for org.codehaus.mojo:versions-maven-plugin:2.7: Plugin org.codehaus.mojo:versions-maven-plugin:2.7 or one of its dependencies could not be resolved: Failed to read artifact descriptor for org.codehaus.mojo:versions-maven-plugin:jar:2.7
26-Jul-2019 07:26:12 Downloading: https://repo.spring.io/libs-snapshot-local/org/flywaydb/flyway-maven-plugin/5.2.4/flyway-maven-plugin-5.2.4.pom
26-Jul-2019 07:26:12          
26-Jul-2019 07:26:12 Downloading: https://repo.spring.io/libs-milestone-local/org/flywaydb/flyway-maven-plugin/5.2.4/flyway-maven-plugin-5.2.4.pom
26-Jul-2019 07:26:12          
26-Jul-2019 07:26:12 Downloading: http://repo.maven.apache.org/maven2/org/flywaydb/flyway-maven-plugin/5.2.4/flyway-maven-plugin-5.2.4.pom
26-Jul-2019 07:26:12 Jul 26, 2019 7:26:12 AM org.apache.maven.wagon.providers.http.httpclient.impl.client.DefaultRequestDirector tryExecute
26-Jul-2019 07:26:12 INFO: I/O exception (java.net.SocketException) caught when processing request: Connection reset
26-Jul-2019 07:26:12 Jul 26, 2019 7:26:12 AM org.apache.maven.wagon.providers.http.httpclient.impl.client.DefaultRequestDirector tryExecute
26-Jul-2019 07:26:12 INFO: Retrying request
26-Jul-2019 07:26:12 Jul 26, 2019 7:26:12 AM org.apache.maven.wagon.providers.http.httpclient.impl.client.DefaultRequestDirector tryExecute
26-Jul-2019 07:26:12 INFO: I/O exception (java.net.SocketException) caught when processing request: Connection reset
26-Jul-2019 07:26:12 Jul 26, 2019 7:26:12 AM org.apache.maven.wagon.providers.http.httpclient.impl.client.DefaultRequestDirector tryExecute
26-Jul-2019 07:26:12 INFO: Retrying request
26-Jul-2019 07:26:12 Jul 26, 2019 7:26:12 AM org.apache.maven.wagon.providers.http.httpclient.impl.client.DefaultRequestDirector tryExecute
26-Jul-2019 07:26:12 INFO: I/O exception (java.net.SocketException) caught when processing request: Connection reset
26-Jul-2019 07:26:12 Jul 26, 2019 7:26:12 AM org.apache.maven.wagon.providers.http.httpclient.impl.client.DefaultRequestDirector tryExecute
26-Jul-2019 07:26:12 INFO: Retrying request
26-Jul-2019 07:26:12          
26-Jul-2019 07:26:12 [WARNING] Failed to retrieve plugin descriptor for org.flywaydb:flyway-maven-plugin:5.2.4: Plugin org.flywaydb:flyway-maven-plugin:5.2.4 or one of its dependencies could not be resolved: Failed to read artifact descriptor for org.flywaydb:flyway-maven-plugin:jar:5.2.4
26-Jul-2019 07:26:12 Downloading: https://repo.spring.io/libs-snapshot-local/org/infinispan/infinispan-protocol-parser-generator-maven-plugin/9.4.11.Final/infinispan-protocol-parser-generator-maven-plugin-9.4.11.Final.pom
26-Jul-2019 07:26:12          
26-Jul-2019 07:26:12 Downloading: https://repo.spring.io/libs-milestone-local/org/infinispan/infinispan-protocol-parser-generator-maven-plugin/9.4.11.Final/infinispan-protocol-parser-generator-maven-plugin-9.4.11.Final.pom
26-Jul-2019 07:26:12          
26-Jul-2019 07:26:12 Downloading: http://repo.maven.apache.org/maven2/org/infinispan/infinispan-protocol-parser-generator-maven-plugin/9.4.11.Final/infinispan-protocol-parser-generator-maven-plugin-9.4.11.Final.pom
26-Jul-2019 07:26:12 Jul 26, 2019 7:26:12 AM org.apache.maven.wagon.providers.http.httpclient.impl.client.DefaultRequestDirector tryExecute
26-Jul-2019 07:26:12 INFO: I/O exception (java.net.SocketException) caught when processing request: Connection reset
26-Jul-2019 07:26:12 Jul 26, 2019 7:26:12 AM org.apache.maven.wagon.providers.http.httpclient.impl.client.DefaultRequestDirector tryExecute
26-Jul-2019 07:26:12 INFO: Retrying request
26-Jul-2019 07:26:12 Jul 26, 2019 7:26:12 AM org.apache.maven.wagon.providers.http.httpclient.impl.client.DefaultRequestDirector tryExecute
26-Jul-2019 07:26:12 INFO: I/O exception (java.net.SocketException) caught when processing request: Connection reset
26-Jul-2019 07:26:12 Jul 26, 2019 7:26:12 AM org.apache.maven.wagon.providers.http.httpclient.impl.client.DefaultRequestDirector tryExecute
26-Jul-2019 07:26:12 INFO: Retrying request
26-Jul-2019 07:26:12 Jul 26, 2019 7:26:12 AM org.apache.maven.wagon.providers.http.httpclient.impl.client.DefaultRequestDirector tryExecute
26-Jul-2019 07:26:12 INFO: I/O exception (java.net.SocketException) caught when processing request: Connection reset
26-Jul-2019 07:26:12 Jul 26, 2019 7:26:12 AM org.apache.maven.wagon.providers.http.httpclient.impl.client.DefaultRequestDirector tryExecute
26-Jul-2019 07:26:12 INFO: Retrying request
26-Jul-2019 07:26:13          
26-Jul-2019 07:26:13 [WARNING] Failed to retrieve plugin descriptor for org.infinispan:infinispan-protocol-parser-generator-maven-plugin:9.4.11.Final: Plugin org.infinispan:infinispan-protocol-parser-generator-maven-plugin:9.4.11.Final or one of its dependencies could not be resolved: Failed to read artifact descriptor for org.infinispan:infinispan-protocol-parser-generator-maven-plugin:jar:9.4.11.Final
26-Jul-2019 07:26:13 Downloading: https://repo.spring.io/libs-snapshot-local/pl/project13/maven/git-commit-id-plugin/2.2.6/git-commit-id-plugin-2.2.6.pom
26-Jul-2019 07:26:13          
26-Jul-2019 07:26:13 Downloading: https://repo.spring.io/libs-milestone-local/pl/project13/maven/git-commit-id-plugin/2.2.6/git-commit-id-plugin-2.2.6.pom
26-Jul-2019 07:26:13          
26-Jul-2019 07:26:13 Downloading: http://repo.maven.apache.org/maven2/pl/project13/maven/git-commit-id-plugin/2.2.6/git-commit-id-plugin-2.2.6.pom
26-Jul-2019 07:26:13 Jul 26, 2019 7:26:13 AM org.apache.maven.wagon.providers.http.httpclient.impl.client.DefaultRequestDirector tryExecute
26-Jul-2019 07:26:13 INFO: I/O exception (java.net.SocketException) caught when processing request: Connection reset
26-Jul-2019 07:26:13 Jul 26, 2019 7:26:13 AM org.apache.maven.wagon.providers.http.httpclient.impl.client.DefaultRequestDirector tryExecute
26-Jul-2019 07:26:13 INFO: Retrying request
26-Jul-2019 07:26:13 Jul 26, 2019 7:26:13 AM org.apache.maven.wagon.providers.http.httpclient.impl.client.DefaultRequestDirector tryExecute
26-Jul-2019 07:26:13 INFO: I/O exception (java.net.SocketException) caught when processing request: Connection reset
26-Jul-2019 07:26:13 Jul 26, 2019 7:26:13 AM org.apache.maven.wagon.providers.http.httpclient.impl.client.DefaultRequestDirector tryExecute
26-Jul-2019 07:26:13 INFO: Retrying request
26-Jul-2019 07:26:13 Jul 26, 2019 7:26:13 AM org.apache.maven.wagon.providers.http.httpclient.impl.client.DefaultRequestDirector tryExecute
26-Jul-2019 07:26:13 INFO: I/O exception (java.net.SocketException) caught when processing request: Connection reset
26-Jul-2019 07:26:13 Jul 26, 2019 7:26:13 AM org.apache.maven.wagon.providers.http.httpclient.impl.client.DefaultRequestDirector tryExecute
26-Jul-2019 07:26:13 INFO: Retrying request
26-Jul-2019 07:26:13          
26-Jul-2019 07:26:13 [WARNING] Failed to retrieve plugin descriptor for pl.project13.maven:git-commit-id-plugin:2.2.6: Plugin pl.project13.maven:git-commit-id-plugin:2.2.6 or one of its dependencies could not be resolved: Failed to read artifact descriptor for pl.project13.maven:git-commit-id-plugin:jar:2.2.6
26-Jul-2019 07:26:13 Downloading: https://repo.spring.io/libs-snapshot-local/org/eclipse/m2e/lifecycle-mapping/1.0.0/lifecycle-mapping-1.0.0.pom
26-Jul-2019 07:26:13          
26-Jul-2019 07:26:13 Downloading: https://repo.spring.io/libs-milestone-local/org/eclipse/m2e/lifecycle-mapping/1.0.0/lifecycle-mapping-1.0.0.pom
26-Jul-2019 07:26:13          
26-Jul-2019 07:26:13 Downloading: http://repo.maven.apache.org/maven2/org/eclipse/m2e/lifecycle-mapping/1.0.0/lifecycle-mapping-1.0.0.pom
26-Jul-2019 07:26:13 Jul 26, 2019 7:26:13 AM org.apache.maven.wagon.providers.http.httpclient.impl.client.DefaultRequestDirector tryExecute
26-Jul-2019 07:26:13 INFO: I/O exception (java.net.SocketException) caught when processing request: Connection reset
26-Jul-2019 07:26:13 Jul 26, 2019 7:26:13 AM org.apache.maven.wagon.providers.http.httpclient.impl.client.DefaultRequestDirector tryExecute
26-Jul-2019 07:26:13 INFO: Retrying request
26-Jul-2019 07:26:13 Jul 26, 2019 7:26:13 AM org.apache.maven.wagon.providers.http.httpclient.impl.client.DefaultRequestDirector tryExecute
26-Jul-2019 07:26:13 INFO: I/O exception (java.net.SocketException) caught when processing request: Connection reset
26-Jul-2019 07:26:13 Jul 26, 2019 7:26:13 AM org.apache.maven.wagon.providers.http.httpclient.impl.client.DefaultRequestDirector tryExecute
26-Jul-2019 07:26:13 INFO: Retrying request
26-Jul-2019 07:26:13 Jul 26, 2019 7:26:13 AM org.apache.maven.wagon.providers.http.httpclient.impl.client.DefaultRequestDirector tryExecute
26-Jul-2019 07:26:13 INFO: I/O exception (java.net.SocketException) caught when processing request: Connection reset
26-Jul-2019 07:26:13 Jul 26, 2019 7:26:13 AM org.apache.maven.wagon.providers.http.httpclient.impl.client.DefaultRequestDirector tryExecute
26-Jul-2019 07:26:13 INFO: Retrying request
26-Jul-2019 07:26:13          
26-Jul-2019 07:26:13 [WARNING] Failed to retrieve plugin descriptor for org.eclipse.m2e:lifecycle-mapping:1.0.0: Plugin org.eclipse.m2e:lifecycle-mapping:1.0.0 or one of its dependencies could not be resolved: Failed to read artifact descriptor for org.eclipse.m2e:lifecycle-mapping:jar:1.0.0
26-Jul-2019 07:26:13 Downloading: https://repo.spring.io/libs-snapshot-local/org/apache/maven/plugins/maven-metadata.xml
26-Jul-2019 07:26:13 Downloading: http://repo.maven.apache.org/maven2/org/apache/maven/plugins/maven-metadata.xml
26-Jul-2019 07:26:13 Downloading: https://repo.spring.io/libs-snapshot-local/org/codehaus/mojo/maven-metadata.xml
26-Jul-2019 07:26:13 Downloading: https://repo.spring.io/libs-milestone-local/org/apache/maven/plugins/maven-metadata.xml
26-Jul-2019 07:26:13 Jul 26, 2019 7:26:13 AM org.apache.maven.wagon.providers.http.httpclient.impl.client.DefaultRequestDirector tryExecute
26-Jul-2019 07:26:13 INFO: I/O exception (java.net.SocketException) caught when processing request: Connection reset
26-Jul-2019 07:26:13 Jul 26, 2019 7:26:13 AM org.apache.maven.wagon.providers.http.httpclient.impl.client.DefaultRequestDirector tryExecute
26-Jul-2019 07:26:13 INFO: Retrying request
26-Jul-2019 07:26:13 Jul 26, 2019 7:26:13 AM org.apache.maven.wagon.providers.http.httpclient.impl.client.DefaultRequestDirector tryExecute
26-Jul-2019 07:26:13 INFO: I/O exception (java.net.SocketException) caught when processing request: Connection reset
26-Jul-2019 07:26:13 Jul 26, 2019 7:26:13 AM org.apache.maven.wagon.providers.http.httpclient.impl.client.DefaultRequestDirector tryExecute
26-Jul-2019 07:26:13 INFO: Retrying request
26-Jul-2019 07:26:13 Jul 26, 2019 7:26:13 AM org.apache.maven.wagon.providers.http.httpclient.impl.client.DefaultRequestDirector tryExecute
26-Jul-2019 07:26:13 INFO: I/O exception (java.net.SocketException) caught when processing request: Connection reset
26-Jul-2019 07:26:13 Jul 26, 2019 7:26:13 AM org.apache.maven.wagon.providers.http.httpclient.impl.client.DefaultRequestDirector tryExecute
26-Jul-2019 07:26:13 INFO: Retrying request
26-Jul-2019 07:26:13          
26-Jul-2019 07:26:13          
26-Jul-2019 07:26:13 Downloading: https://repo.spring.io/libs-milestone-local/org/codehaus/mojo/maven-metadata.xml
26-Jul-2019 07:26:13          
26-Jul-2019 07:26:13 Downloading: http://repo.maven.apache.org/maven2/org/codehaus/mojo/maven-metadata.xml
26-Jul-2019 07:26:13          
26-Jul-2019 07:26:13 Jul 26, 2019 7:26:13 AM org.apache.maven.wagon.providers.http.httpclient.impl.client.DefaultRequestDirector tryExecute
26-Jul-2019 07:26:13 INFO: I/O exception (java.net.SocketException) caught when processing request: Connection reset
26-Jul-2019 07:26:13 Jul 26, 2019 7:26:13 AM org.apache.maven.wagon.providers.http.httpclient.impl.client.DefaultRequestDirector tryExecute
26-Jul-2019 07:26:13 INFO: Retrying request
26-Jul-2019 07:26:13 Jul 26, 2019 7:26:13 AM org.apache.maven.wagon.providers.http.httpclient.impl.client.DefaultRequestDirector tryExecute
26-Jul-2019 07:26:13 INFO: I/O exception (java.net.SocketException) caught when processing request: Connection reset
26-Jul-2019 07:26:13 Jul 26, 2019 7:26:13 AM org.apache.maven.wagon.providers.http.httpclient.impl.client.DefaultRequestDirector tryExecute
26-Jul-2019 07:26:13 INFO: Retrying request
26-Jul-2019 07:26:13 Jul 26, 2019 7:26:13 AM org.apache.maven.wagon.providers.http.httpclient.impl.client.DefaultRequestDirector tryExecute
26-Jul-2019 07:26:13 INFO: I/O exception (java.net.SocketException) caught when processing request: Connection reset
26-Jul-2019 07:26:13 Jul 26, 2019 7:26:13 AM org.apache.maven.wagon.providers.http.httpclient.impl.client.DefaultRequestDirector tryExecute
26-Jul-2019 07:26:13 INFO: Retrying request
26-Jul-2019 07:26:13          
26-Jul-2019 07:26:13          
26-Jul-2019 07:26:13 [WARNING] Could not transfer metadata org.apache.maven.plugins/maven-metadata.xml from/to central (http://repo.maven.apache.org/maven2): Connection reset
26-Jul-2019 07:26:13 [WARNING] Could not transfer metadata org.codehaus.mojo/maven-metadata.xml from/to central (http://repo.maven.apache.org/maven2): Connection reset
26-Jul-2019 07:26:13 [INFO] ------------------------------------------------------------------------
26-Jul-2019 07:26:13 [INFO] Reactor Summary:
26-Jul-2019 07:26:13 [INFO]
26-Jul-2019 07:26:13 [INFO] usage-cost-stream-rabbit .......................... SKIPPED
26-Jul-2019 07:26:13 [INFO] usage-cost-logger ................................. SKIPPED
26-Jul-2019 07:26:13 [INFO] usage-cost-processor .............................. SKIPPED
26-Jul-2019 07:26:13 [INFO] usage-detail-sender ............................... SKIPPED
26-Jul-2019 07:26:13 [INFO] ------------------------------------------------------------------------
26-Jul-2019 07:26:13 [INFO] BUILD FAILURE
26-Jul-2019 07:26:13 [INFO] ------------------------------------------------------------------------
26-Jul-2019 07:26:13 [INFO] Total time: 3.799s
26-Jul-2019 07:26:13 [INFO] Finished at: Fri Jul 26 07:26:13 UTC 2019
26-Jul-2019 07:26:13 [INFO] Final Memory: 18M/430M
26-Jul-2019 07:26:13 [INFO] ------------------------------------------------------------------------
26-Jul-2019 07:26:13 [ERROR] No plugin found for prefix 'jib' in the current project and in the plugin groups [org.apache.maven.plugins, org.codehaus.mojo] available from the repositories [local (/home/bamboo/.m2/repository), spring-snapshots (https://repo.spring.io/libs-snapshot-local), spring-milestones (https://repo.spring.io/libs-milestone-local), central (http://repo.maven.apache.org/maven2)] -> [Help 1]
26-Jul-2019 07:26:13 [ERROR]
26-Jul-2019 07:26:13 [ERROR] To see the full stack trace of the errors, re-run Maven with the -e switch.
26-Jul-2019 07:26:13 [ERROR] Re-run Maven using the -X switch to enable full debug logging.
26-Jul-2019 07:26:13 [ERROR]
26-Jul-2019 07:26:13 [ERROR] For more information about the errors and possible solutions, please read the following articles:
26-Jul-2019 07:26:13 [ERROR] [Help 1] http://cwiki.apache.org/confluence/display/MAVEN/NoPluginFoundForPrefixException
26-Jul-2019 07:26:13
26-Jul-2019 07:26:13 Failing task since return code of [/opt/jdk-8/bin/java -cp /opt/maven-3.0/boot/plexus-classworlds-2.4.jar -Dclassworlds.conf=/tmp/artifactoryM23423060271617732316conf -DbuildInfoConfig.propertiesFile=/tmp/buildInfo2615710026002427687.properties -Dmaven.home=/opt/maven-3.0 -Dmaven.multiModuleProjectDirectory=/opt/bamboo-home/xml-data/build-dir/SCD-SCDFSAMPLES-JOB1/dataflow-website/stream-developer-guides/streams/standalone-stream-rabbitmq org.codehaus.plexus.classworlds.launcher.Launcher clean install jib:dockerBuild -Dartifactory.publish.password=********] was 1 while expected 0
26-Jul-2019 07:26:13 Finished task 'Build and Publish streams guide RabbitMQ samples' with result: Failed
26-Jul-2019 07:26:13 Running post build plugin 'Docker Container Cleanup'
26-Jul-2019 07:26:13 Running post build plugin 'NCover Results Collector'
26-Jul-2019 07:26:13 Running post build plugin 'Artifactory Release Management Staging'
26-Jul-2019 07:26:13 Running post build plugin 'Artifactory Build Info Copier'
26-Jul-2019 07:26:13 Copying the buildinfo artifacts for build: SCD-SCDFSAMPLES-JOB1-84
26-Jul-2019 07:26:13 Running post build plugin 'Artifactory Gradle Properties Info Copier'
26-Jul-2019 07:26:13 Running post build plugin 'Clover Results Collector'
26-Jul-2019 07:26:13 Running post build plugin 'npm Cache Cleanup'
26-Jul-2019 07:26:13 Running post build plugin 'Artifact Copier'
26-Jul-2019 07:26:13 Publishing an artifact: Test Results
26-Jul-2019 07:26:13 Finished publishing of artifact Non required shared artifact: [Test Results], pattern: [*/target/surefire-reports/**/*.*] in 8.352 ms
26-Jul-2019 07:26:13 Successfully removed working directory at '/opt/bamboo-home/xml-data/build-dir/SCD-SCDFSAMPLES-JOB1'
26-Jul-2019 07:26:13 Finalising the build...
26-Jul-2019 07:26:13 Stopping timer.
26-Jul-2019 07:26:13 Build SCD-SCDFSAMPLES-JOB1-84 completed.
26-Jul-2019 07:26:13 Running on server: post build plugin 'NCover Results Collector'
26-Jul-2019 07:26:13 Running on server: post build plugin 'Build Hanging Detection Configuration'
26-Jul-2019 07:26:13 Running on server: post build plugin 'Bamboo project link creator'
26-Jul-2019 07:26:13 Running on server: post build plugin 'Clover Delta Calculator'
26-Jul-2019 07:26:13 Running on server: post build plugin 'Maven Dependencies Postprocessor'
26-Jul-2019 07:26:13 All post build plugins have finished
26-Jul-2019 07:26:13 Generating build results summary...
26-Jul-2019 07:26:13 Saving build results to disk...
26-Jul-2019 07:26:14 Logging substituted variables...
26-Jul-2019 07:26:14 Indexing build results...
26-Jul-2019 07:26:14 Finished building SCD-SCDFSAMPLES-JOB1-84.