Spring Cloud Data Flow UI 1.7.x

Logs

The following logs have been generated by the jobs in this plan.
  • Expand all
  • Collapse all
Job Logs
Collapse Default Job Default Stage Download or View
26-Mar-2019 01:08:46 [ERROR]       in /opt/bamboo-home/xml-data/build-dir/SCD-U17X-JOB1/ui/src/app/analytics/charts/bubble-chart/bubble-chart.component.scss (line 5, column 11)
26-Mar-2019 01:08:46 [ERROR] npm ERR! code ELIFECYCLE
26-Mar-2019 01:08:46 [ERROR] npm ERR! errno 1
26-Mar-2019 01:08:46 [ERROR] npm ERR! spring-cloud-dataflow-ui@1.7.1 mavenbuild-without-tests: `node ./node_modules/@angular/cli/bin/ng build --prod --output-path ./../target/classes/public/dashboard --base-href /dashboard/`
26-Mar-2019 01:08:46 [ERROR] npm ERR! Exit status 1
26-Mar-2019 01:08:46 [ERROR] npm ERR!
26-Mar-2019 01:08:46 [ERROR] npm ERR! Failed at the spring-cloud-dataflow-ui@1.7.1 mavenbuild-without-tests script.
26-Mar-2019 01:08:46 [ERROR] npm ERR! This is probably not a problem with npm. There is likely additional logging output above.
26-Mar-2019 01:08:46 [ERROR]
26-Mar-2019 01:08:46 [ERROR] npm ERR! A complete log of this run can be found in:
26-Mar-2019 01:08:46 [ERROR] npm ERR!     /home/bamboo/.npm/_logs/2019-03-26T01_08_46_905Z-debug.log
26-Mar-2019 01:08:46 [INFO] ------------------------------------------------------------------------
26-Mar-2019 01:08:46 [INFO] BUILD FAILURE
26-Mar-2019 01:08:46 [INFO] ------------------------------------------------------------------------
26-Mar-2019 01:08:46 [INFO] Total time: 1:20.773s
26-Mar-2019 01:08:46 [INFO] Finished at: Tue Mar 26 01:08:46 UTC 2019
26-Mar-2019 01:08:47 [INFO] Final Memory: 16M/430M
26-Mar-2019 01:08:47 [INFO] ------------------------------------------------------------------------
26-Mar-2019 01:08:47 [ERROR] Failed to execute goal com.github.eirslett:frontend-maven-plugin:1.6:npm (npm build) on project spring-cloud-dataflow-ui: Failed to run task: 'npm run mavenbuild-without-tests' failed. org.apache.commons.exec.ExecuteException: Process exited with an error: 1 (Exit value: 1) -> [Help 1]
26-Mar-2019 01:08:47 [ERROR]
26-Mar-2019 01:08:47 [ERROR] To see the full stack trace of the errors, re-run Maven with the -e switch.
26-Mar-2019 01:08:47 [ERROR] Re-run Maven using the -X switch to enable full debug logging.
26-Mar-2019 01:08:47 [ERROR]
26-Mar-2019 01:08:47 [ERROR] For more information about the errors and possible solutions, please read the following articles:
26-Mar-2019 01:08:47 [ERROR] [Help 1] http://cwiki.apache.org/confluence/display/MAVEN/MojoFailureException