Logs

The following logs have been generated by the jobs in this plan.
  • Expand all
  • Collapse all
Job Logs
Collapse Default Job Default Stage Download or View
18-Mar-2019 14:38:44 [INFO] const v4 = '(?:25[0-5]|2[0-4][0-9]|1[0-9][0-9]|[1-9][0-9]|[0-9])(?:\\.(?:25[0-
18-Mar-2019 14:38:44 [INFO] ^^^^^
18-Mar-2019 14:38:44 [INFO] Use of const in strict mode.
18-Mar-2019 14:38:44 [INFO]
18-Mar-2019 14:38:44 [INFO]
18-Mar-2019 14:38:44 [INFO] Execution Time (2019-03-18 14:38:42 UTC)
18-Mar-2019 14:38:44 [INFO] jshint:all      1.4s  ▇▇▇▇▇▇▇▇▇▇▇▇▇▇▇▇▇▇▇▇▇▇▇▇▇▇▇▇▇▇▇▇▇▇▇▇▇▇▇ 81%
18-Mar-2019 14:38:44 [INFO] jshint:test     65ms  ▇▇ 4%
18-Mar-2019 14:38:44 [INFO] bower:install  265ms  ▇▇▇▇▇▇▇ 15%
18-Mar-2019 14:38:44 [INFO] Total 1.8s
18-Mar-2019 14:38:44 [INFO]
18-Mar-2019 14:38:44 [INFO] ------------------------------------------------------------------------
18-Mar-2019 14:38:44 [INFO] BUILD FAILURE
18-Mar-2019 14:38:44 [INFO] ------------------------------------------------------------------------
18-Mar-2019 14:38:44 [INFO] Total time: 1:15.620s
18-Mar-2019 14:38:44 [INFO] Finished at: Mon Mar 18 14:38:44 UTC 2019
18-Mar-2019 14:38:44 [INFO] Final Memory: 11M/303M
18-Mar-2019 14:38:44 [INFO] ------------------------------------------------------------------------
18-Mar-2019 14:38:44 [ERROR] Failed to execute goal com.github.eirslett:frontend-maven-plugin:0.0.23:grunt (grunt build) on project spring-cloud-dataflow-ui: Failed to run task: 'grunt build --no-color' failed. (error code 1) -> [Help 1]
18-Mar-2019 14:38:44 [ERROR]
18-Mar-2019 14:38:44 [ERROR] To see the full stack trace of the errors, re-run Maven with the -e switch.
18-Mar-2019 14:38:44 [ERROR] Re-run Maven using the -X switch to enable full debug logging.
18-Mar-2019 14:38:44 [ERROR]
18-Mar-2019 14:38:44 [ERROR] For more information about the errors and possible solutions, please read the following articles:
18-Mar-2019 14:38:44 [ERROR] [Help 1] http://cwiki.apache.org/confluence/display/MAVEN/MojoFailureException