Sources: https://github.com/spring-cloud/spring-cloud-dataflow-ui/

Build: #632 failed Changes by Damien Vitrac

Logs

The following logs have been generated by the jobs in this plan.
  • Expand all
  • Collapse all
Job Logs
Collapse Default Job Default Stage Download or View
27-Apr-2020 17:00:15 [ERROR] npm ERR! prepareGitDep npm WARN tar ENOENT: no such file or directory, open 'C:\Windows\system32\config\systemprofile\AppData\Roaming\npm-cache\_cacache\tmp\git-clone-7040d0cf\node_modules\.staging\jointjs-dbb60efc\demo\ts-demo\node_modules\uri-js\tests\test-es5.html'
27-Apr-2020 17:00:15 [ERROR] npm ERR! prepareGitDep npm WARN tar ENOENT: no such file or directory, open 'C:\Windows\system32\config\systemprofile\AppData\Roaming\npm-cache\_cacache\tmp\git-clone-7040d0cf\node_modules\.staging\jointjs-dbb60efc\demo\ts-demo\node_modules\tslib\tslib.es6.html'
27-Apr-2020 17:00:15 [ERROR] npm ERR! prepareGitDep npm WARN tar ENOENT: no such file or directory, open 'C:\Windows\system32\config\systemprofile\AppData\Roaming\npm-cache\_cacache\tmp\git-clone-7040d0cf\node_modules\.staging\jointjs-dbb60efc\demo\ts-demo\node_modules\tslib\tslib.html'
27-Apr-2020 17:00:15 [ERROR] npm ERR! prepareGitDep npm WARN tar ENOENT: no such file or directory, open 'C:\Windows\system32\config\systemprofile\AppData\Roaming\npm-cache\_cacache\tmp\git-clone-7040d0cf\node_modules\.staging\jointjs-dbb60efc\demo\ts-demo\node_modules\http-proxy\coverage\lcov-report\http-proxy\passes\web-incoming.js.html'
27-Apr-2020 17:00:15 [ERROR] npm ERR! prepareGitDep
27-Apr-2020 17:00:15 [ERROR] npm ERR! prepareGitDep npm ERR! A complete log of this run can be found in:
27-Apr-2020 17:00:15 [ERROR] npm ERR! prepareGitDep npm ERR!     C:\Windows\system32\config\systemprofile\AppData\Roaming\npm-cache\_logs\2020-04-27T16_52_48_382Z-debug.log
27-Apr-2020 17:00:15 [ERROR] npm ERR! prepareGitDep
27-Apr-2020 17:00:15 [ERROR] npm ERR! premature close
27-Apr-2020 17:00:15 [ERROR]
27-Apr-2020 17:00:15 [ERROR] npm ERR! A complete log of this run can be found in:
27-Apr-2020 17:00:15 [ERROR] npm ERR!     C:\Windows\system32\config\systemprofile\AppData\Roaming\npm-cache\_logs\2020-04-27T17_00_15_687Z-debug.log
27-Apr-2020 17:00:15 [INFO] ------------------------------------------------------------------------
27-Apr-2020 17:00:15 [INFO] BUILD FAILURE
27-Apr-2020 17:00:15 [INFO] ------------------------------------------------------------------------
27-Apr-2020 17:00:15 [INFO] Total time: 09:36 min
27-Apr-2020 17:00:15 [INFO] Finished at: 2020-04-27T17:00:15Z
27-Apr-2020 17:00:15 [INFO] ------------------------------------------------------------------------
27-Apr-2020 17:00:15 [ERROR] Failed to execute goal com.github.eirslett:frontend-maven-plugin:1.7.6:npm (npm install) on project spring-cloud-dataflow-ui: Failed to run task: 'npm install --scripts-prepend-node-path=auto' failed. org.apache.commons.exec.ExecuteException: Process exited with an error: 1 (Exit value: 1) -> [Help 1]
27-Apr-2020 17:00:15 [ERROR]
27-Apr-2020 17:00:15 [ERROR] To see the full stack trace of the errors, re-run Maven with the -e switch.
27-Apr-2020 17:00:15 [ERROR] Re-run Maven using the -X switch to enable full debug logging.
27-Apr-2020 17:00:15 [ERROR]
27-Apr-2020 17:00:15 [ERROR] For more information about the errors and possible solutions, please read the following articles:
27-Apr-2020 17:00:15 [ERROR] [Help 1] http://cwiki.apache.org/confluence/display/MAVEN/MojoFailureException