Build: #1 failed Rebuilt by Mark Pollack

Stages & jobs

  1. Test Stage - Kafka

  2. Test Stage - Rabbit

Test results

  • 18 tests in total
  • 9 tests failed
  • 9 failures are new
  • 2 tests were quarantined / skipped
  • 9 minutes taken in total.
New test failures 9
Status Test View job Duration
Collapse Failed AnalyticsTests analyticsTest History
Run Data Flow Acceptance Tests for Kafka 1 min
org.springframework.web.client.HttpClientErrorException: 404 null
	at org.springframework.web.client.DefaultResponseErrorHandler.handleError(DefaultResponseErrorHandler.java:91)
	at org.springframework.web.client.RestTemplate.handleResponse(RestTemplate.java:667)
	at org.springframework.web.client.RestTemplate.doExecute(RestTemplate.java:620)
	at org.springframework.web.client.RestTemplate.execute(RestTemplate.java:580)
	at org.springframework.web.client.RestTemplate.exchange(RestTemplate.java:498)
	at org.springframework.cloud.dataflow.acceptance.test.AbstractStreamTests.getLogFileUrl(AbstractStreamTests.java:272)
	at org.springframework.cloud.dataflow.acceptance.test.AbstractStreamTests.getLog(AbstractStreamTests.java:248)
(2 more lines...)
Collapse Failed HttpSourceTests httpSourceTests History
Run Data Flow Acceptance Tests for Kafka 51 secs
org.springframework.web.client.HttpClientErrorException: 404 null
	at org.springframework.web.client.DefaultResponseErrorHandler.handleError(DefaultResponseErrorHandler.java:91)
	at org.springframework.web.client.RestTemplate.handleResponse(RestTemplate.java:667)
	at org.springframework.web.client.RestTemplate.doExecute(RestTemplate.java:620)
	at org.springframework.web.client.RestTemplate.execute(RestTemplate.java:580)
	at org.springframework.web.client.RestTemplate.exchange(RestTemplate.java:498)
	at org.springframework.cloud.dataflow.acceptance.test.AbstractStreamTests.getLogFileUrl(AbstractStreamTests.java:272)
	at org.springframework.cloud.dataflow.acceptance.test.AbstractStreamTests.getLog(AbstractStreamTests.java:248)
(2 more lines...)
Collapse Failed NamedChannelTests testDestination History
Run Data Flow Acceptance Tests for Kafka 45 secs
org.springframework.web.client.HttpClientErrorException: 401 null
	at org.springframework.web.client.DefaultResponseErrorHandler.handleError(DefaultResponseErrorHandler.java:91)
	at org.springframework.web.client.RestTemplate.handleResponse(RestTemplate.java:667)
	at org.springframework.web.client.RestTemplate.doExecute(RestTemplate.java:620)
	at org.springframework.web.client.RestTemplate.execute(RestTemplate.java:580)
	at org.springframework.web.client.RestTemplate.exchange(RestTemplate.java:498)
	at org.springframework.cloud.dataflow.acceptance.test.AbstractStreamTests.getLogFileUrl(AbstractStreamTests.java:272)
	at org.springframework.cloud.dataflow.acceptance.test.AbstractStreamTests.getLog(AbstractStreamTests.java:248)
(4 more lines...)
Collapse Failed NamedChannelTests testTap History
Run Data Flow Acceptance Tests for Kafka 51 secs
org.springframework.web.client.HttpClientErrorException: 404 null
	at org.springframework.web.client.DefaultResponseErrorHandler.handleError(DefaultResponseErrorHandler.java:91)
	at org.springframework.web.client.RestTemplate.handleResponse(RestTemplate.java:667)
	at org.springframework.web.client.RestTemplate.doExecute(RestTemplate.java:620)
	at org.springframework.web.client.RestTemplate.execute(RestTemplate.java:580)
	at org.springframework.web.client.RestTemplate.exchange(RestTemplate.java:498)
	at org.springframework.cloud.dataflow.acceptance.test.AbstractStreamTests.getLogFileUrl(AbstractStreamTests.java:272)
	at org.springframework.cloud.dataflow.acceptance.test.AbstractStreamTests.getLog(AbstractStreamTests.java:248)
(4 more lines...)
Collapse Failed NamedChannelTests manyToOneTest History
Run Data Flow Acceptance Tests for Kafka 46 secs
org.springframework.web.client.HttpClientErrorException: 401 null
	at org.springframework.web.client.DefaultResponseErrorHandler.handleError(DefaultResponseErrorHandler.java:91)
	at org.springframework.web.client.RestTemplate.handleResponse(RestTemplate.java:667)
	at org.springframework.web.client.RestTemplate.doExecute(RestTemplate.java:620)
	at org.springframework.web.client.RestTemplate.execute(RestTemplate.java:580)
	at org.springframework.web.client.RestTemplate.exchange(RestTemplate.java:498)
	at org.springframework.cloud.dataflow.acceptance.test.AbstractStreamTests.getLogFileUrl(AbstractStreamTests.java:272)
	at org.springframework.cloud.dataflow.acceptance.test.AbstractStreamTests.getLog(AbstractStreamTests.java:248)
(4 more lines...)
Collapse Failed NamedChannelTests directedGraphTest History
Run Data Flow Acceptance Tests for Kafka 56 secs
org.springframework.web.client.HttpClientErrorException: 401 null
	at org.springframework.web.client.DefaultResponseErrorHandler.handleError(DefaultResponseErrorHandler.java:91)
	at org.springframework.web.client.RestTemplate.handleResponse(RestTemplate.java:667)
	at org.springframework.web.client.RestTemplate.doExecute(RestTemplate.java:620)
	at org.springframework.web.client.RestTemplate.execute(RestTemplate.java:580)
	at org.springframework.web.client.RestTemplate.exchange(RestTemplate.java:498)
	at org.springframework.cloud.dataflow.acceptance.test.AbstractStreamTests.getLogFileUrl(AbstractStreamTests.java:272)
	at org.springframework.cloud.dataflow.acceptance.test.AbstractStreamTests.getLog(AbstractStreamTests.java:248)
(4 more lines...)
Collapse Failed TickTockTests tickTockTests History
Run Data Flow Acceptance Tests for Kafka 56 secs
org.springframework.web.client.HttpClientErrorException: 401 null
	at org.springframework.web.client.DefaultResponseErrorHandler.handleError(DefaultResponseErrorHandler.java:91)
	at org.springframework.web.client.RestTemplate.handleResponse(RestTemplate.java:667)
	at org.springframework.web.client.RestTemplate.doExecute(RestTemplate.java:620)
	at org.springframework.web.client.RestTemplate.execute(RestTemplate.java:580)
	at org.springframework.web.client.RestTemplate.exchange(RestTemplate.java:498)
	at org.springframework.cloud.dataflow.acceptance.test.AbstractStreamTests.getLogFileUrl(AbstractStreamTests.java:272)
	at org.springframework.cloud.dataflow.acceptance.test.AbstractStreamTests.getLog(AbstractStreamTests.java:248)
(2 more lines...)
Collapse Failed TransformTests transformTests History
Run Data Flow Acceptance Tests for Kafka 1 min
org.springframework.web.client.HttpClientErrorException: 404 null
	at org.springframework.web.client.DefaultResponseErrorHandler.handleError(DefaultResponseErrorHandler.java:91)
	at org.springframework.web.client.RestTemplate.handleResponse(RestTemplate.java:667)
	at org.springframework.web.client.RestTemplate.doExecute(RestTemplate.java:620)
	at org.springframework.web.client.RestTemplate.execute(RestTemplate.java:580)
	at org.springframework.web.client.RestTemplate.exchange(RestTemplate.java:498)
	at org.springframework.cloud.dataflow.acceptance.test.AbstractStreamTests.getLogFileUrl(AbstractStreamTests.java:272)
	at org.springframework.cloud.dataflow.acceptance.test.AbstractStreamTests.getLog(AbstractStreamTests.java:248)
(2 more lines...)
Collapse Failed WoodChuckTests testPartitioning History
Run Data Flow Acceptance Tests for Kafka 1 min
org.springframework.web.client.HttpClientErrorException: 404 null
	at org.springframework.web.client.DefaultResponseErrorHandler.handleError(DefaultResponseErrorHandler.java:91)
	at org.springframework.web.client.RestTemplate.handleResponse(RestTemplate.java:667)
	at org.springframework.web.client.RestTemplate.doExecute(RestTemplate.java:620)
	at org.springframework.web.client.RestTemplate.execute(RestTemplate.java:580)
	at org.springframework.web.client.RestTemplate.exchange(RestTemplate.java:498)
	at org.springframework.cloud.dataflow.acceptance.test.AbstractStreamTests.getLogFileUrl(AbstractStreamTests.java:272)
	at org.springframework.cloud.dataflow.acceptance.test.AbstractStreamTests.getLog(AbstractStreamTests.java:248)
(2 more lines...)
Skipped tests 2
Status Test Failing since View job
Skipped SchedulerTests org.springframework.cloud.dataflow.acceptance.test.SchedulerTests History
Run Data Flow Acceptance Tests for Kafka
Skipped TickTockTests tickTockTestsFromConfigServer History
Run Data Flow Acceptance Tests for Kafka