Build: #200 failed Scheduled with changes by Chris Schaefer

Stages & jobs

  1. Test Stage - Kafka

  2. Test Stage - Rabbit

Build result summary

Details

Completed
Duration
32 minutes
Labels
None
Revision
e6e411ad6d64b04d953dd4fa78ad440defa20e8c e6e411ad6d64b04d953dd4fa78ad440defa20e8c
Total tests
22
Failing since
#193 (Scheduled – )

Responsible

This build has been failing since #193
No one has taken responsibility

Code commits

Author Commit Message Commit date
Chris Schaefer Chris Schaefer e6e411ad6d64b04d953dd4fa78ad440defa20e8c e6e411ad6d64b04d953dd4fa78ad440defa20e8c add var for ability to specify chart version

Tests

New test failures 1
Status Test View job Duration
Collapse Failed WoodChuckTests testPartitioning History
Run Data Flow Acceptance Tests for Kafka 10 mins
java.lang.IllegalStateException: Unable to start stream WOODCHUCK-TEST.  Definition = http | splitter --expression=payload.split(' ') | log
	at org.springframework.cloud.dataflow.acceptance.test.AbstractStreamTests.streamAvailable(AbstractStreamTests.java:284)
	at org.springframework.cloud.dataflow.acceptance.test.AbstractStreamTests.deployStream(AbstractStreamTests.java:183)
	at org.springframework.cloud.dataflow.acceptance.test.WoodChuckTests.testPartitioning(WoodChuckTests.java:43)
Existing test failures 3
Status Test Failing since View job Duration
java.lang.AssertionError: null
	at org.junit.Assert.fail(Assert.java:86)
	at org.junit.Assert.assertTrue(Assert.java:41)
	at org.junit.Assert.assertTrue(Assert.java:52)
	at org.springframework.cloud.dataflow.acceptance.test.ComposedTaskTests.assertTaskExecutions(ComposedTaskTests.java:65)
	at org.springframework.cloud.dataflow.acceptance.test.ComposedTaskTests.ctrMultipleLaunchWithArguments(ComposedTaskTests.java:57)
java.lang.AssertionError: null
	at org.junit.Assert.fail(Assert.java:86)
	at org.junit.Assert.assertTrue(Assert.java:41)
	at org.junit.Assert.assertTrue(Assert.java:52)
	at org.springframework.cloud.dataflow.acceptance.test.ComposedTaskTests.assertTaskExecutions(ComposedTaskTests.java:65)
	at org.springframework.cloud.dataflow.acceptance.test.ComposedTaskTests.ctrMultipleLaunch(ComposedTaskTests.java:47)
java.lang.AssertionError: null
	at org.junit.Assert.fail(Assert.java:86)
	at org.junit.Assert.assertTrue(Assert.java:41)
	at org.junit.Assert.assertTrue(Assert.java:52)
	at org.springframework.cloud.dataflow.acceptance.test.ComposedTaskTests.assertTaskExecutions(ComposedTaskTests.java:65)
	at org.springframework.cloud.dataflow.acceptance.test.ComposedTaskTests.ctrLaunch(ComposedTaskTests.java:41)