Build: #201 failed Scheduled with changes by Janne Valkealahti

Stages & jobs

  1. Test Stage - Kafka

  2. Test Stage - Rabbit

Build result summary

Details

Completed
Duration
23 minutes
Labels
None
Revision
31b1e288f779c0c3050502fe073a1959a4d5d153 31b1e288f779c0c3050502fe073a1959a4d5d153
Total tests
22
Failing since
#193 (Scheduled – )

Responsible

This build has been failing since #193
No one has taken responsibility

Code commits

Author Commit Message Commit date
Janne Valkealahti Janne Valkealahti 31b1e288f779c0c3050502fe073a1959a4d5d153 31b1e288f779c0c3050502fe073a1959a4d5d153 Add new tests for dataflow 24x
Janne Valkealahti Janne Valkealahti 11fdd9f3b6fd01685a3bfb37cabc892632cf6137 11fdd9f3b6fd01685a3bfb37cabc892632cf6137 Add new pipeline build templates

Tests

Existing test failures 3
Status Test Failing since View job Duration
java.lang.AssertionError: null
	at org.junit.Assert.fail(Assert.java:86)
	at org.junit.Assert.assertTrue(Assert.java:41)
	at org.junit.Assert.assertTrue(Assert.java:52)
	at org.springframework.cloud.dataflow.acceptance.test.ComposedTaskTests.assertTaskExecutions(ComposedTaskTests.java:65)
	at org.springframework.cloud.dataflow.acceptance.test.ComposedTaskTests.ctrMultipleLaunchWithArguments(ComposedTaskTests.java:57)
java.lang.AssertionError: null
	at org.junit.Assert.fail(Assert.java:86)
	at org.junit.Assert.assertTrue(Assert.java:41)
	at org.junit.Assert.assertTrue(Assert.java:52)
	at org.springframework.cloud.dataflow.acceptance.test.ComposedTaskTests.assertTaskExecutions(ComposedTaskTests.java:65)
	at org.springframework.cloud.dataflow.acceptance.test.ComposedTaskTests.ctrMultipleLaunch(ComposedTaskTests.java:47)
java.lang.AssertionError: null
	at org.junit.Assert.fail(Assert.java:86)
	at org.junit.Assert.assertTrue(Assert.java:41)
	at org.junit.Assert.assertTrue(Assert.java:52)
	at org.springframework.cloud.dataflow.acceptance.test.ComposedTaskTests.assertTaskExecutions(ComposedTaskTests.java:65)
	at org.springframework.cloud.dataflow.acceptance.test.ComposedTaskTests.ctrLaunch(ComposedTaskTests.java:41)
Fixed tests 1
Status Test Failing since View job Duration
Successful WoodChuckTests testPartitioning History
Failing since build #200 (Scheduled with changes by Chris Schaefer) Run Data Flow Acceptance Tests for Kafka 1 min