Build: #206 failed Scheduled

Stages & jobs

  1. Test Stage - Kafka

  2. Test Stage - Rabbit

Build result summary

Details

Completed
Duration
24 minutes
Labels
None
Revision
31b1e288f779c0c3050502fe073a1959a4d5d153 31b1e288f779c0c3050502fe073a1959a4d5d153
Total tests
22
Failing since
#193 (Scheduled – )

Tests

Responsible

This build has been failing since #193
No one has taken responsibility

Tests

Existing test failures 3
Status Test Failing since View job Duration
java.lang.AssertionError: null
	at org.junit.Assert.fail(Assert.java:86)
	at org.junit.Assert.assertTrue(Assert.java:41)
	at org.junit.Assert.assertTrue(Assert.java:52)
	at org.springframework.cloud.dataflow.acceptance.test.ComposedTaskTests.assertTaskExecutions(ComposedTaskTests.java:65)
	at org.springframework.cloud.dataflow.acceptance.test.ComposedTaskTests.ctrMultipleLaunchWithArguments(ComposedTaskTests.java:57)
java.lang.AssertionError: null
	at org.junit.Assert.fail(Assert.java:86)
	at org.junit.Assert.assertTrue(Assert.java:41)
	at org.junit.Assert.assertTrue(Assert.java:52)
	at org.springframework.cloud.dataflow.acceptance.test.ComposedTaskTests.assertTaskExecutions(ComposedTaskTests.java:65)
	at org.springframework.cloud.dataflow.acceptance.test.ComposedTaskTests.ctrMultipleLaunch(ComposedTaskTests.java:47)
java.lang.AssertionError: null
	at org.junit.Assert.fail(Assert.java:86)
	at org.junit.Assert.assertTrue(Assert.java:41)
	at org.junit.Assert.assertTrue(Assert.java:52)
	at org.springframework.cloud.dataflow.acceptance.test.ComposedTaskTests.assertTaskExecutions(ComposedTaskTests.java:65)
	at org.springframework.cloud.dataflow.acceptance.test.ComposedTaskTests.ctrLaunch(ComposedTaskTests.java:41)