Build: #305 failed Scheduled with changes by Glenn Renfro

Stages & jobs

  1. Test Stage - Kafka

  2. Test Stage - Rabbit

Build result summary

Details

Completed
Duration
26 minutes
Labels
None
Revision
853ffdb5b6c6fde4a2fb2dda14516e626bf816bf 853ffdb5b6c6fde4a2fb2dda14516e626bf816bf
Total tests
22
Failing since
#193 (Scheduled – )

Tests

Responsible

This build has been failing since #193
No one has taken responsibility

Code commits

Author Commit Message Commit date
Glenn Renfro Glenn Renfro 853ffdb5b6c6fde4a2fb2dda14516e626bf816bf 853ffdb5b6c6fde4a2fb2dda14516e626bf816bf Updated the tests so that the suffix for schedule names has been removed

Tests

Existing test failures 3
Status Test Failing since View job Duration
java.lang.AssertionError: null
	at org.junit.Assert.fail(Assert.java:86)
	at org.junit.Assert.assertTrue(Assert.java:41)
	at org.junit.Assert.assertTrue(Assert.java:52)
	at org.springframework.cloud.dataflow.acceptance.test.ComposedTaskTests.assertTaskExecutions(ComposedTaskTests.java:65)
	at org.springframework.cloud.dataflow.acceptance.test.ComposedTaskTests.ctrMultipleLaunchWithArguments(ComposedTaskTests.java:57)
java.lang.AssertionError: null
	at org.junit.Assert.fail(Assert.java:86)
	at org.junit.Assert.assertTrue(Assert.java:41)
	at org.junit.Assert.assertTrue(Assert.java:52)
	at org.springframework.cloud.dataflow.acceptance.test.ComposedTaskTests.assertTaskExecutions(ComposedTaskTests.java:65)
	at org.springframework.cloud.dataflow.acceptance.test.ComposedTaskTests.ctrLaunch(ComposedTaskTests.java:41)
java.lang.AssertionError: null
	at org.junit.Assert.fail(Assert.java:86)
	at org.junit.Assert.assertTrue(Assert.java:41)
	at org.junit.Assert.assertTrue(Assert.java:52)
	at org.springframework.cloud.dataflow.acceptance.test.ComposedTaskTests.assertTaskExecutions(ComposedTaskTests.java:65)
	at org.springframework.cloud.dataflow.acceptance.test.ComposedTaskTests.ctrMultipleLaunch(ComposedTaskTests.java:47)