Build: #306 failed Scheduled with changes by Janne Valkealahti

Stages & jobs

  1. Test Stage - Kafka

  2. Test Stage - Rabbit

Build result summary

Details

Completed
Duration
26 minutes
Labels
None
Revision
72b9768b9660eae4eafb3d7e8be4f50b5492f6cd 72b9768b9660eae4eafb3d7e8be4f50b5492f6cd
Total tests
22
Failing since
#193 (Scheduled – )

Tests

Responsible

This build has been failing since #193
No one has taken responsibility

Code commits

Author Commit Message Commit date
Janne Valkealahti Janne Valkealahti 72b9768b9660eae4eafb3d7e8be4f50b5492f6cd 72b9768b9660eae4eafb3d7e8be4f50b5492f6cd Add migration tests for flyway 6.x
- Basically skipper 2.4 and dataflow 2.5 servers.
- Drop mysql 5.6 migration tests as not supported anymore.
- Relates #300

Tests

Existing test failures 3
Status Test Failing since View job Duration
java.lang.AssertionError: null
	at org.junit.Assert.fail(Assert.java:86)
	at org.junit.Assert.assertTrue(Assert.java:41)
	at org.junit.Assert.assertTrue(Assert.java:52)
	at org.springframework.cloud.dataflow.acceptance.test.ComposedTaskTests.assertTaskExecutions(ComposedTaskTests.java:65)
	at org.springframework.cloud.dataflow.acceptance.test.ComposedTaskTests.ctrMultipleLaunchWithArguments(ComposedTaskTests.java:57)
java.lang.AssertionError: null
	at org.junit.Assert.fail(Assert.java:86)
	at org.junit.Assert.assertTrue(Assert.java:41)
	at org.junit.Assert.assertTrue(Assert.java:52)
	at org.springframework.cloud.dataflow.acceptance.test.ComposedTaskTests.assertTaskExecutions(ComposedTaskTests.java:65)
	at org.springframework.cloud.dataflow.acceptance.test.ComposedTaskTests.ctrMultipleLaunch(ComposedTaskTests.java:47)
java.lang.AssertionError: null
	at org.junit.Assert.fail(Assert.java:86)
	at org.junit.Assert.assertTrue(Assert.java:41)
	at org.junit.Assert.assertTrue(Assert.java:52)
	at org.springframework.cloud.dataflow.acceptance.test.ComposedTaskTests.assertTaskExecutions(ComposedTaskTests.java:65)
	at org.springframework.cloud.dataflow.acceptance.test.ComposedTaskTests.ctrLaunch(ComposedTaskTests.java:41)