Build: #310 failed Scheduled with changes by Chris Schaefer <cschaefer@vmware.com>

Stages & jobs

  1. Test Stage - Kafka

  2. Test Stage - Rabbit

Build result summary

Details

Completed
Duration
22 minutes
Labels
None
Revision
4817cb37ed8517b2bc7630ca6438155e19eb5a63 4817cb37ed8517b2bc7630ca6438155e19eb5a63
Total tests
22
Failing since
#193 (Scheduled – )

Tests

Responsible

This build has been failing since #193
No one has taken responsibility

Code commits

Author Commit Message Commit date
Chris Schaefer <cschaefer@vmware.com> Chris Schaefer <cschaefer@vmware.com> 4817cb37ed8517b2bc7630ca6438155e19eb5a63 4817cb37ed8517b2bc7630ca6438155e19eb5a63 Merge pull request #302 from dturanski/k8s-log-retriever
Implement KubernetesLogRetriever and decrease probe delays
David Turanski <dturanski@pivotal.io> David Turanski <dturanski@pivotal.io> 3ff00f4c6888ff38c65e46bb3c88c7a6482b939f m 3ff00f4c6888ff38c65e46bb3c88c7a6482b939f Implement KubernetesLogretriever and decrease probe delays

Tests

Existing test failures 3
Status Test Failing since View job Duration
java.lang.AssertionError: null
	at org.junit.Assert.fail(Assert.java:86)
	at org.junit.Assert.assertTrue(Assert.java:41)
	at org.junit.Assert.assertTrue(Assert.java:52)
	at org.springframework.cloud.dataflow.acceptance.test.ComposedTaskTests.assertTaskExecutions(ComposedTaskTests.java:65)
	at org.springframework.cloud.dataflow.acceptance.test.ComposedTaskTests.ctrMultipleLaunch(ComposedTaskTests.java:47)
java.lang.AssertionError: null
	at org.junit.Assert.fail(Assert.java:86)
	at org.junit.Assert.assertTrue(Assert.java:41)
	at org.junit.Assert.assertTrue(Assert.java:52)
	at org.springframework.cloud.dataflow.acceptance.test.ComposedTaskTests.assertTaskExecutions(ComposedTaskTests.java:65)
	at org.springframework.cloud.dataflow.acceptance.test.ComposedTaskTests.ctrLaunch(ComposedTaskTests.java:41)
java.lang.AssertionError: null
	at org.junit.Assert.fail(Assert.java:86)
	at org.junit.Assert.assertTrue(Assert.java:41)
	at org.junit.Assert.assertTrue(Assert.java:52)
	at org.springframework.cloud.dataflow.acceptance.test.ComposedTaskTests.assertTaskExecutions(ComposedTaskTests.java:65)
	at org.springframework.cloud.dataflow.acceptance.test.ComposedTaskTests.ctrMultipleLaunchWithArguments(ComposedTaskTests.java:57)