Build: #1 failed

Job: Run Data Flow Acceptance Tests for Kafka failed

Stages & jobs

  1. Test Stage - Kafka

  2. Test Stage - Rabbit

Job result summary

Completed
Duration
14 minutes
Revision
0c83aa4efad4b0e7540794d10f3ecde4f6a5a6d6 0c83aa4efad4b0e7540794d10f3ecde4f6a5a6d6
Total tests
18
Fixed in
#2 (Rebuilt by Mark Pollack)
Number of retries
1

Tests

  • 18 tests in total
  • 9 tests failed
  • 9 failures are new
  • 2 tests were quarantined / skipped
  • 9 minutes taken in total.
New test failures 9
Status Test Duration
Collapse Failed AnalyticsTests analyticsTest History
1 min
org.springframework.web.client.HttpClientErrorException: 404 null
	at org.springframework.web.client.DefaultResponseErrorHandler.handleError(DefaultResponseErrorHandler.java:91)
	at org.springframework.web.client.RestTemplate.handleResponse(RestTemplate.java:667)
	at org.springframework.web.client.RestTemplate.doExecute(RestTemplate.java:620)
	at org.springframework.web.client.RestTemplate.execute(RestTemplate.java:580)
	at org.springframework.web.client.RestTemplate.exchange(RestTemplate.java:498)
	at org.springframework.cloud.dataflow.acceptance.test.AbstractStreamTests.getLogFileUrl(AbstractStreamTests.java:272)
	at org.springframework.cloud.dataflow.acceptance.test.AbstractStreamTests.getLog(AbstractStreamTests.java:248)
(2 more lines...)
Collapse Failed HttpSourceTests httpSourceTests History
51 secs
org.springframework.web.client.HttpClientErrorException: 404 null
	at org.springframework.web.client.DefaultResponseErrorHandler.handleError(DefaultResponseErrorHandler.java:91)
	at org.springframework.web.client.RestTemplate.handleResponse(RestTemplate.java:667)
	at org.springframework.web.client.RestTemplate.doExecute(RestTemplate.java:620)
	at org.springframework.web.client.RestTemplate.execute(RestTemplate.java:580)
	at org.springframework.web.client.RestTemplate.exchange(RestTemplate.java:498)
	at org.springframework.cloud.dataflow.acceptance.test.AbstractStreamTests.getLogFileUrl(AbstractStreamTests.java:272)
	at org.springframework.cloud.dataflow.acceptance.test.AbstractStreamTests.getLog(AbstractStreamTests.java:248)
(2 more lines...)
Collapse Failed NamedChannelTests directedGraphTest History
56 secs
org.springframework.web.client.HttpClientErrorException: 401 null
	at org.springframework.web.client.DefaultResponseErrorHandler.handleError(DefaultResponseErrorHandler.java:91)
	at org.springframework.web.client.RestTemplate.handleResponse(RestTemplate.java:667)
	at org.springframework.web.client.RestTemplate.doExecute(RestTemplate.java:620)
	at org.springframework.web.client.RestTemplate.execute(RestTemplate.java:580)
	at org.springframework.web.client.RestTemplate.exchange(RestTemplate.java:498)
	at org.springframework.cloud.dataflow.acceptance.test.AbstractStreamTests.getLogFileUrl(AbstractStreamTests.java:272)
	at org.springframework.cloud.dataflow.acceptance.test.AbstractStreamTests.getLog(AbstractStreamTests.java:248)
(4 more lines...)
Collapse Failed NamedChannelTests manyToOneTest History
46 secs
org.springframework.web.client.HttpClientErrorException: 401 null
	at org.springframework.web.client.DefaultResponseErrorHandler.handleError(DefaultResponseErrorHandler.java:91)
	at org.springframework.web.client.RestTemplate.handleResponse(RestTemplate.java:667)
	at org.springframework.web.client.RestTemplate.doExecute(RestTemplate.java:620)
	at org.springframework.web.client.RestTemplate.execute(RestTemplate.java:580)
	at org.springframework.web.client.RestTemplate.exchange(RestTemplate.java:498)
	at org.springframework.cloud.dataflow.acceptance.test.AbstractStreamTests.getLogFileUrl(AbstractStreamTests.java:272)
	at org.springframework.cloud.dataflow.acceptance.test.AbstractStreamTests.getLog(AbstractStreamTests.java:248)
(4 more lines...)
Collapse Failed NamedChannelTests testDestination History
45 secs
org.springframework.web.client.HttpClientErrorException: 401 null
	at org.springframework.web.client.DefaultResponseErrorHandler.handleError(DefaultResponseErrorHandler.java:91)
	at org.springframework.web.client.RestTemplate.handleResponse(RestTemplate.java:667)
	at org.springframework.web.client.RestTemplate.doExecute(RestTemplate.java:620)
	at org.springframework.web.client.RestTemplate.execute(RestTemplate.java:580)
	at org.springframework.web.client.RestTemplate.exchange(RestTemplate.java:498)
	at org.springframework.cloud.dataflow.acceptance.test.AbstractStreamTests.getLogFileUrl(AbstractStreamTests.java:272)
	at org.springframework.cloud.dataflow.acceptance.test.AbstractStreamTests.getLog(AbstractStreamTests.java:248)
(4 more lines...)
Collapse Failed NamedChannelTests testTap History
51 secs
org.springframework.web.client.HttpClientErrorException: 404 null
	at org.springframework.web.client.DefaultResponseErrorHandler.handleError(DefaultResponseErrorHandler.java:91)
	at org.springframework.web.client.RestTemplate.handleResponse(RestTemplate.java:667)
	at org.springframework.web.client.RestTemplate.doExecute(RestTemplate.java:620)
	at org.springframework.web.client.RestTemplate.execute(RestTemplate.java:580)
	at org.springframework.web.client.RestTemplate.exchange(RestTemplate.java:498)
	at org.springframework.cloud.dataflow.acceptance.test.AbstractStreamTests.getLogFileUrl(AbstractStreamTests.java:272)
	at org.springframework.cloud.dataflow.acceptance.test.AbstractStreamTests.getLog(AbstractStreamTests.java:248)
(4 more lines...)
Collapse Failed TickTockTests tickTockTests History
56 secs
org.springframework.web.client.HttpClientErrorException: 401 null
	at org.springframework.web.client.DefaultResponseErrorHandler.handleError(DefaultResponseErrorHandler.java:91)
	at org.springframework.web.client.RestTemplate.handleResponse(RestTemplate.java:667)
	at org.springframework.web.client.RestTemplate.doExecute(RestTemplate.java:620)
	at org.springframework.web.client.RestTemplate.execute(RestTemplate.java:580)
	at org.springframework.web.client.RestTemplate.exchange(RestTemplate.java:498)
	at org.springframework.cloud.dataflow.acceptance.test.AbstractStreamTests.getLogFileUrl(AbstractStreamTests.java:272)
	at org.springframework.cloud.dataflow.acceptance.test.AbstractStreamTests.getLog(AbstractStreamTests.java:248)
(2 more lines...)
Collapse Failed TransformTests transformTests History
1 min
org.springframework.web.client.HttpClientErrorException: 404 null
	at org.springframework.web.client.DefaultResponseErrorHandler.handleError(DefaultResponseErrorHandler.java:91)
	at org.springframework.web.client.RestTemplate.handleResponse(RestTemplate.java:667)
	at org.springframework.web.client.RestTemplate.doExecute(RestTemplate.java:620)
	at org.springframework.web.client.RestTemplate.execute(RestTemplate.java:580)
	at org.springframework.web.client.RestTemplate.exchange(RestTemplate.java:498)
	at org.springframework.cloud.dataflow.acceptance.test.AbstractStreamTests.getLogFileUrl(AbstractStreamTests.java:272)
	at org.springframework.cloud.dataflow.acceptance.test.AbstractStreamTests.getLog(AbstractStreamTests.java:248)
(2 more lines...)
Collapse Failed WoodChuckTests testPartitioning History
1 min
org.springframework.web.client.HttpClientErrorException: 404 null
	at org.springframework.web.client.DefaultResponseErrorHandler.handleError(DefaultResponseErrorHandler.java:91)
	at org.springframework.web.client.RestTemplate.handleResponse(RestTemplate.java:667)
	at org.springframework.web.client.RestTemplate.doExecute(RestTemplate.java:620)
	at org.springframework.web.client.RestTemplate.execute(RestTemplate.java:580)
	at org.springframework.web.client.RestTemplate.exchange(RestTemplate.java:498)
	at org.springframework.cloud.dataflow.acceptance.test.AbstractStreamTests.getLogFileUrl(AbstractStreamTests.java:272)
	at org.springframework.cloud.dataflow.acceptance.test.AbstractStreamTests.getLog(AbstractStreamTests.java:248)
(2 more lines...)

Error summary

The build generated some errors. See the full build log for more details.

Stopping mysql_mysql_1 ...

Stopping mysql_mysql_1 ... done
Removing mysql_mysql_1 ...

Removing mysql_mysql_1 ... done
Creating mysql_mysql_1
Creating kafka_zookeeper_1
Creating kafka_kafka_1
2018-11-06 22:45:41 URL:http://repo.spring.io/libs-snapshot/org/springframework/cloud/spring-cloud-skipper-server/2.0.0.BUILD-SNAPSHOT/spring-cloud-skipper-server-2.0.0.BUILD-SNAPSHOT.jar [75441339/75441339] -> "/opt/bamboo-home/xml-data/build-dir/SCDT-LOCAL20XSKIPPER20X-KAFKA/local/skipper-server/skipper-server.jar" [1]
Failed to connect to localhost:7577. Attempt  #1/60... will try again in [5] seconds
Failed to connect to localhost:7577. Attempt  #2/60... will try again in [5] seconds
Failed to connect to localhost:7577. Attempt  #3/60... will try again in [5] seconds
Failed to connect to localhost:7577. Attempt  #4/60... will try again in [5] seconds
2018-11-06 22:47:34 URL:http://repo.spring.io/libs-snapshot/org/springframework/cloud/spring-cloud-dataflow-server-local/2.0.0.BUILD-SNAPSHOT/spring-cloud-dataflow-server-local-2.0.0.BUILD-SNAPSHOT.jar [71982903/71982903] -> "/opt/bamboo-home/xml-data/build-dir/SCDT-LOCAL20XSKIPPER20X-KAFKA/local/server/scdf-server.jar" [1]
Failed to connect to localhost:9393. Attempt  #1/60... will try again in [5] seconds
Failed to connect to localhost:9393. Attempt  #2/60... will try again in [5] seconds
Failed to connect to localhost:9393. Attempt  #3/60... will try again in [5] seconds
Failed to connect to localhost:9393. Attempt  #4/60... will try again in [5] seconds
Failed to connect to localhost:9393. Attempt  #5/60... will try again in [5] seconds
Killing process PID [30385]
Killing process PID [30147]
Stopping mysql_mysql_1 ...

Stopping mysql_mysql_1 ... done
Removing mysql_mysql_1 ...

Removing mysql_mysql_1 ... done
Stopping kafka_kafka_1 ...
Stopping kafka_zookeeper_1 ...

Stopping kafka_kafka_1 ... done

Stopping kafka_zookeeper_1 ... done
Removing kafka_kafka_1 ...
Removing kafka_zookeeper_1 ...

Removing kafka_kafka_1 ... done

Removing kafka_zookeeper_1 ... done