Build: #164 failed

Job: Run Data Flow Acceptance Tests for Kafka was successful

Stages & jobs

  1. Test Stage - Kafka

  2. Test Stage - Rabbit

Build log

The build generated 815 lines of output. Download or view full build log

12-Nov-2019 00:00:18 Build Spring Cloud Data Flow Acceptance Tests - Local + SCDF-2.0.4.BS + Skipper 2.0.4.BS (12 am) - Run Data Flow Acceptance Tests for Kafka #164 (SCDT-LOCAL20XSKIPPER20X-KAFKA-164) started building on agent bamboo-17.af.pivotal.io
12-Nov-2019 00:00:18 Remote agent on host bamboo-17.af.pivotal.io
12-Nov-2019 00:00:18 Build working directory is /opt/bamboo-home/xml-data/build-dir/SCDT-LOCAL20XSKIPPER20X-KAFKA
12-Nov-2019 00:00:18 Executing build Spring Cloud Data Flow Acceptance Tests - Local + SCDF-2.0.4.BS + Skipper 2.0.4.BS (12 am) - Run Data Flow Acceptance Tests for Kafka #164 (SCDT-LOCAL20XSKIPPER20X-KAFKA-164)
12-Nov-2019 00:00:18 Starting task 'Checkout Default Repository' of type 'com.atlassian.bamboo.plugins.vcs:task.vcs.checkout'
12-Nov-2019 00:00:18 Checking out into /opt/bamboo-home/xml-data/build-dir/SCDT-LOCAL20XSKIPPER20X-KAFKA
12-Nov-2019 00:00:18 Updating source code to revision: ccc77f664d11e18a3b7f2fa17f012d09d08432a9
12-Nov-2019 00:00:18 Creating local git repository in '/opt/bamboo-home/xml-data/build-dir/SCDT-LOCAL20XSKIPPER20X-KAFKA/.git'.
12-Nov-2019 00:00:18 Initialized empty Git repository in /opt/bamboo-home/xml-data/build-dir/SCDT-LOCAL20XSKIPPER20X-KAFKA/.git/
12-Nov-2019 00:00:19 Fetching 'refs/heads/master' from 'https://github.com/spring-cloud/spring-cloud-dataflow-acceptance-tests.git'.
12-Nov-2019 00:00:20 From https://github.com/spring-cloud/spring-cloud-dataflow-acceptance-tests
12-Nov-2019 00:00:20 * [new branch]      master     -> master
12-Nov-2019 00:00:20 Checking out revision ccc77f664d11e18a3b7f2fa17f012d09d08432a9.
12-Nov-2019 00:00:20 Already on 'master'
12-Nov-2019 00:00:20 Updated source code to revision: ccc77f664d11e18a3b7f2fa17f012d09d08432a9
12-Nov-2019 00:00:20 Finished task 'Checkout Default Repository' with result: Success
12-Nov-2019 00:00:20 Running pre-build action: Artifactory Release Staging
12-Nov-2019 00:00:20 Running pre-build action: VCS Version Collector
12-Nov-2019 00:00:20 Starting task 'Execute Acceptance Tests' of type 'com.atlassian.bamboo.plugins.scripttask:task.builder.script'
12-Nov-2019 00:00:20
Beginning to execute external process for build 'Spring Cloud Data Flow Acceptance Tests - Local + SCDF-2.0.4.BS + Skipper 2.0.4.BS (12 am) - Run Data Flow Acceptance Tests for Kafka #164 (SCDT-LOCAL20XSKIPPER20X-KAFKA-164)'
... running command line:
/opt/bamboo-home/temp/SCDT-LOCAL20XSKIPPER20X-KAFKA-164-ScriptBuildTask-3108864050079511872.sh
... in: /opt/bamboo-home/xml-data/build-dir/SCDT-LOCAL20XSKIPPER20X-KAFKA
... using extra environment variables:
bamboo_planRepository_1_branch=master
bamboo_********_username_password=********
bamboo_signing_store_password=********
bamboo_capability_system_builder_ant_Ant_1_9=/opt/ant-1.9
bamboo_capability_system_builder_ant_Ant_1_8=/opt/ant-1.8
bamboo_planRepository_1_branchDisplayName=master
bamboo_repository_274694331_git_username=spring-buildmaster
bamboo_artifactory_override_resolve_repo=libs-milestone
bamboo_capability_system_builder_node_Node_js_10_16=/opt/node-10.16/bin/node
bamboo_repository_revision_number=ccc77f664d11e18a3b7f2fa17f012d09d08432a9
bamboo_RIAK_BIN=/usr/sbin/riak
bamboo_buildKey=SCDT-LOCAL20XSKIPPER20X-KAFKA
bamboo_repository_274694331_branch_name=master
bamboo_ge_cache_username=ci
bamboo_bintray_password=********
bamboo_sonar_token_password=********
bamboo_shortJobName=Run Data Flow Acceptance Tests for Kafka
bamboo_artifactory_override_resolver_password=********
bamboo_sonatype_token=RSJChaox
bamboo_capability_system_builder_gradle___gradlew=./gradlew
bamboo_buildResultsUrl=https://build.spring.io/browse/SCDT-LOCAL20XSKIPPER20X-KAFKA-164
bamboo_capability_system_builder_mvn3_Maven_3_3=/opt/maven-3.3
bamboo_capability_system_builder_mvn3_Maven_3_2=/opt/maven-3.2
bamboo_capability_system_builder_mvn3_Maven_3_1=/opt/maven-3.1
bamboo_planRepository_repositoryUrl=https://github.com/spring-cloud/spring-cloud-dataflow-acceptance-tests.git
bamboo_capability_system_builder_mvn3_Maven_3_6=/opt/maven-3.6
bamboo_agentId=286195718
bamboo_capability_system_builder_mvn3_Maven_3_5=/opt/maven-3.5
bamboo_capability_system_builder_mvn3_Maven_3_0=/opt/maven-3.0
bamboo_planRepository_revision=ccc77f664d11e18a3b7f2fa17f012d09d08432a9
bamboo_planRepository_previousRevision=ccc77f664d11e18a3b7f2fa17f012d09d08432a9
bamboo_capability_remote_build=true
bamboo_repository_branch_name=master
bamboo_sonatype_token_password=********
bamboo_sonatype_user=springsource
bamboo_repository_274694331_name=Git
bamboo_scdf_acceptance_tests_password=********
bamboo_APPLE_AC_PASSWORD=********
JAVA_HOME=/opt/jdk-8
bamboo_repository_274694331_git_branch=master
bamboo_planRepository_branch=master
bamboo_capability_system_jdk_JDK_13=/opt/jdk-13
bamboo_planRepository_1_type=gitv2
bamboo_planRepository_branchName=master
bamboo_capability_system_jdk_JDK_12=/opt/jdk-12
bamboo_capability_system_builder_gradlew_gradlew=./
bamboo_capability_system_builder_ant_Ant_1_10=/opt/ant-1.10
bamboo_sonar_password=********
bamboo_hg_cache_directory=/opt/bamboo-home/xml-data/build-dir/_hg-repositories-cache
bamboo_planRepository_1_username=spring-buildmaster
bamboo_repository_274694331_git_repositoryUrl=https://github.com/spring-cloud/spring-cloud-dataflow-acceptance-tests.git
bamboo_planRepository_type=gitv2
bamboo_git_cache_directory=/opt/bamboo-home/xml-data/build-dir/_git-repositories-cache
bamboo_artifactory_username=buildmaster
bamboo_tmp_directory=/opt/bamboo-home/temp
bamboo_planKey=SCDT-LOCAL20XSKIPPER20X
bamboo_planRepository_username=spring-buildmaster
bamboo_JDK8_HOME=/opt/jdk-8
bamboo_repository_274694331_previous_revision_number=ccc77f664d11e18a3b7f2fa17f012d09d08432a9
bamboo_planRepository_1_branchName=master
bamboo_sonar_version=6.7.7
bamboo_sonar_jdbc_password=********
bamboo_bintray_api_key_password=********
bamboo_capability_system_jdk_JDK_1_11=/opt/jdk-11
bamboo_resultsUrl=https://build.spring.io/browse/SCDT-LOCAL20XSKIPPER20X-KAFKA-164
bamboo_APPLE_AC_USERNAME_PASSWORD=********
bamboo_capability_system_jdk_JDK_1_10=/opt/jdk-10
bamboo_build_working_directory=/opt/bamboo-home/xml-data/build-dir/SCDT-LOCAL20XSKIPPER20X-KAFKA
bamboo_planRepository_1_name=Git
bamboo_capability_system_os=ubuntu1804
bamboo_nexusPush_stagingProfile=buildmaster
bamboo_shortPlanName=Local + SCDF-2.0.4.BS + Skipper 2.0.4.BS (12 am)
bamboo_planRepository_name=Git
bamboo_buildNumber=164
bamboo_planName=Spring Cloud Data Flow Acceptance Tests - Local + SCDF-2.0.4.BS + Skipper 2.0.4.BS (12 am)
bamboo_JDK7_HOME=/opt/jdk-7
bamboo_shortPlanKey=LOCAL20XSKIPPER20X
bamboo_shortJobKey=KAFKA
bamboo_artifactory_password=********
bamboo_buildTimeStamp=2019-11-12T00:00:12.051Z
bamboo_repository_previous_revision_number=ccc77f664d11e18a3b7f2fa17f012d09d08432a9
bamboo_sonar_username=buildmaster
bamboo_********_password=********
bamboo_repository_git_branch=master
bamboo_buildResultKey=SCDT-LOCAL20XSKIPPER20X-KAFKA-164
bamboo_nexusPush_close=true
bamboo_artifactory_override_resolver_username=buildmaster
bamboo_buildPlanName=Spring Cloud Data Flow Acceptance Tests - Local + SCDF-2.0.4.BS + Skipper 2.0.4.BS (12 am) - Run Data Flow Acceptance Tests for Kafka
bamboo_repository_274694331_revision_number=ccc77f664d11e18a3b7f2fa17f012d09d08432a9
bamboo_planRepository_1_revision=ccc77f664d11e18a3b7f2fa17f012d09d08432a9
bamboo_repository_name=Git
bamboo_signing_key_password=********
bamboo_capability_system_builder_groovy_Groovy_2_5=/opt/groovy-2.5
bamboo_buildFailed=false
bamboo_capability_system_docker_executable=/usr/bin/docker
bamboo_capability_system_jdk_OpenJDK_7=/opt/jdk-7
bamboo_capability_system_builder_groovy_Groovy_2_4=/opt/groovy-2.4
bamboo_artifactory_override_deployer_username=buildmaster
bamboo_capability_system_builder_command_Bash=/bin/bash
bamboo_agentWorkingDirectory=/opt/bamboo-home/xml-data/build-dir
bamboo_capability_system_git_executable=/usr/bin/git
bamboo_repository_git_username=spring-buildmaster
bamboo_planRepository_1_previousRevision=ccc77f664d11e18a3b7f2fa17f012d09d08432a9
bamboo_capability_os_family=unix
bamboo_planRepository_branchDisplayName=master
bamboo_capability_system_builder_maven_Artifactory_Maven_3_6=/opt/maven-3.6
bamboo_capability_system_builder_maven_Artifactory_Maven_3_5=/opt/maven-3.5
bamboo_capability_system_builder_maven_Artifactory_Maven_3_3=/opt/maven-3.3
bamboo_capability_system_builder_maven_Artifactory_Maven_3_2=/opt/maven-3.2
bamboo_s3_properties=/home/bamboo/tools/s3.properties
bamboo_capability_system_builder_maven_Artifactory_Maven_3_1=/opt/maven-3.1
bamboo_artifactory_override_deploy_repo=libs-snapshot-local
bamboo_capability_system_builder_maven_Artifactory_Maven_3_0=/opt/maven-3.0
bamboo_plan_storageTag=plan-274497908
bamboo_bintray_username_password=********
bamboo_repository_git_repositoryUrl=https://github.com/spring-cloud/spring-cloud-dataflow-acceptance-tests.git
bamboo_working_directory=/opt/bamboo-home/xml-data/build-dir/SCDT-LOCAL20XSKIPPER20X-KAFKA
bamboo_planRepository_1_repositoryUrl=https://github.com/spring-cloud/spring-cloud-dataflow-acceptance-tests.git
bamboo_capability_system_jdk_JDK_1_8=/opt/jdk-8
bamboo_artifactory_override_deployer_password=********
bamboo_capability_system_jdk_JDK_1_9=/opt/jdk-9
bamboo_capability_system_jdk_JDK_1_6=/opt/jdk-6
bamboo_sonatype_password=********
bamboo_capability_system_jdk_JDK_1_7=/opt/jdk-7
bamboo_sonar_ip=10.194.6.9
bamboo_ge_cache_password=********
12-Nov-2019 00:00:20 CLEANING UP RESOURCES BEFORE TESTS
12-Nov-2019 00:00:20 Setting the environment variables
12-Nov-2019 00:00:20 Export the unset env. variables from /opt/bamboo-home/xml-data/build-dir/SCDT-LOCAL20XSKIPPER20X-KAFKA/local/init/env.properties :
12-Nov-2019 00:00:20    SPRING_CLOUD_DATAFLOW_SERVER_DOWNLOAD_URL = https://repo.spring.io/libs-snapshot/org/springframework/cloud/spring-cloud-dataflow-server-local//spring-cloud-dataflow-server-local-.jar
12-Nov-2019 00:00:20    SPRING_CLOUD_SKIPPER_SERVER_DOWNLOAD_URL = https://repo.spring.io/libs-snapshot/org/springframework/cloud/spring-cloud-skipper-server//spring-cloud-skipper-server-.jar
12-Nov-2019 00:00:20    SPRING_DATASOURCE_USERNAME = spring
12-Nov-2019 00:00:20    SPRING_DATASOURCE_PASSWORD = cloud
12-Nov-2019 00:00:20    SPRING_SCHEMA_NAME = dataflow
12-Nov-2019 00:00:20    DOCKER_SERVER = localhost
12-Nov-2019 00:00:20 Setting retries to 60 and WAIT_TIME to 5
12-Nov-2019 00:00:20 Export the unset env. variables from /opt/bamboo-home/xml-data/build-dir/SCDT-LOCAL20XSKIPPER20X-KAFKA/local/binder/rabbit/env.properties :
12-Nov-2019 00:00:20    STREAM_REGISTRATION_RESOURCE = https://dataflow.spring.io/latest-stream-applications-rabbit-maven
12-Nov-2019 00:00:20    TASK_REGISTRATION_RESOURCE = https://dataflow.spring.io/latest-task-applications-maven
12-Nov-2019 00:00:20 SCDF SERVER URI: http://localhost:9393
12-Nov-2019 00:00:20 Clean up, clean up, everybody everywhere; clean up clean up, everybody do your share!
12-Nov-2019 00:00:20 Clean up servers
12-Nov-2019 00:00:21 No stopped containers
12-Nov-2019 00:00:22 No stopped containers
12-Nov-2019 00:00:23 No stopped containers
12-Nov-2019 00:00:23 FINISHED CLEANING UP RESOURCES
12-Nov-2019 00:00:23 Setting the environment variables
12-Nov-2019 00:00:23 Export the unset env. variables from /opt/bamboo-home/xml-data/build-dir/SCDT-LOCAL20XSKIPPER20X-KAFKA/local/init/env.properties :
12-Nov-2019 00:00:23    SPRING_CLOUD_DATAFLOW_SERVER_DOWNLOAD_URL = https://repo.spring.io/libs-snapshot/org/springframework/cloud/spring-cloud-dataflow-server/2.0.4.BUILD-SNAPSHOT/spring-cloud-dataflow-server-2.0.4.BUILD-SNAPSHOT.jar
12-Nov-2019 00:00:23    SPRING_CLOUD_SKIPPER_SERVER_DOWNLOAD_URL = https://repo.spring.io/libs-snapshot/org/springframework/cloud/spring-cloud-skipper-server/2.0.4.BUILD-SNAPSHOT/spring-cloud-skipper-server-2.0.4.BUILD-SNAPSHOT.jar
12-Nov-2019 00:00:23    SPRING_DATASOURCE_USERNAME = spring
12-Nov-2019 00:00:23    SPRING_DATASOURCE_PASSWORD = cloud
12-Nov-2019 00:00:23    SPRING_SCHEMA_NAME = dataflow
12-Nov-2019 00:00:23    DOCKER_SERVER = localhost
12-Nov-2019 00:00:23 Setting retries to 60 and WAIT_TIME to 5
12-Nov-2019 00:00:23 cleaning up any previous mysql docker containers...
12-Nov-2019 00:00:23 done cleaning up.
12-Nov-2019 00:00:23 Could not find a local mysql server, trying docker.
12-Nov-2019 00:00:24 Pulling mysql (mysql:5.7)...
12-Nov-2019 00:00:25 5.7: Pulling from library/mysql
12-Nov-2019 00:00:33 Digest: sha256:44b33224e3c406bf50b5a2ee4286ed0d7f2c5aec1f7fdb70291f7f7c570284dd
12-Nov-2019 00:00:33 Status: Downloaded newer image for mysql:5.7
12-Nov-2019 00:00:33 Creating mysql_mysql_1 ...
12-Nov-2019 00:00:34
12-Nov-2019 00:00:34 Creating mysql_mysql_1 ... done
12-Nov-2019 00:00:34 mysql running on localhost:3306
12-Nov-2019 00:00:34 Service host is localhost
12-Nov-2019 00:00:34 Creating kafka compose file on /opt/bamboo-home/xml-data/build-dir/SCDT-LOCAL20XSKIPPER20X-KAFKA/local/binder/kafka/docker-compose.yml
12-Nov-2019 00:00:34 cleaning up any previous kafka docker containers...
12-Nov-2019 00:00:34 done cleaning up
12-Nov-2019 00:00:34 Could not find a local kafka server, trying docker.
12-Nov-2019 00:00:34 Pulling zookeeper (wurstmeister/zookeeper:)...
12-Nov-2019 00:00:35 latest: Pulling from wurstmeister/zookeeper
12-Nov-2019 00:00:52 Digest: sha256:7a7fd44a72104bfbd24a77844bad5fabc86485b036f988ea927d1780782a6680
12-Nov-2019 00:00:52 Status: Downloaded newer image for wurstmeister/zookeeper:latest
12-Nov-2019 00:00:52 Pulling kafka (wurstmeister/kafka:2.11-0.11.0.3)...
12-Nov-2019 00:00:53 2.11-0.11.0.3: Pulling from wurstmeister/kafka
12-Nov-2019 00:01:07 Digest: sha256:04df57268bb64654df6487b3f345748fd8412a9c01953a4c1d15c2e41d413113
12-Nov-2019 00:01:07 Status: Downloaded newer image for wurstmeister/kafka:2.11-0.11.0.3
12-Nov-2019 00:01:07 Creating kafka_kafka_1 ...
12-Nov-2019 00:01:07 Creating kafka_zookeeper_1 ...
12-Nov-2019 00:01:10
12-Nov-2019 00:01:10 Creating kafka_kafka_1     ... done
12-Nov-2019 00:01:11
12-Nov-2019 00:01:11 Creating kafka_zookeeper_1 ... done
12-Nov-2019 00:01:11 kafka running on localhost:9092
12-Nov-2019 00:01:11 Export the unset env. variables from /opt/bamboo-home/xml-data/build-dir/SCDT-LOCAL20XSKIPPER20X-KAFKA/local/binder/kafka/env.properties :
12-Nov-2019 00:01:11    STREAM_REGISTRATION_RESOURCE = https://dataflow.spring.io/latest-stream-applications-kafka-maven
12-Nov-2019 00:01:11    TASK_REGISTRATION_RESOURCE = https://dataflow.spring.io/latest-task-applications-maven
12-Nov-2019 00:01:11 cleaning up any previous redis docker containers...
12-Nov-2019 00:01:11 done cleaning up.
12-Nov-2019 00:01:12 redis found on localhost
12-Nov-2019 00:01:12 SKIPPER SERVER URI: http://localhost:7577
12-Nov-2019 00:01:12 Downloading server from https://repo.spring.io/libs-snapshot/org/springframework/cloud/spring-cloud-skipper-server/2.0.4.BUILD-SNAPSHOT/spring-cloud-skipper-server-2.0.4.BUILD-SNAPSHOT.jar
12-Nov-2019 00:01:16 2019-11-12 00:01:16 URL:https://repo.spring.io/libs-snapshot/org/springframework/cloud/spring-cloud-skipper-server/2.0.4.BUILD-SNAPSHOT/spring-cloud-skipper-server-2.0.4.BUILD-SNAPSHOT.jar [84387317/84387317] -> "/opt/bamboo-home/xml-data/build-dir/SCDT-LOCAL20XSKIPPER20X-KAFKA/local/skipper-server/skipper-server.jar" [1]
12-Nov-2019 00:01:16 executing [nohup /opt/jdk-8/bin/java  -Dlogging.level.org.springframework.cloud.deployer.spi.local.LocalAppDeployer=DEBUG -Xmx1024m -Xss1024k -jar /opt/bamboo-home/xml-data/build-dir/SCDT-LOCAL20XSKIPPER20X-KAFKA/local/skipper-server/skipper-server.jar  --spring.datasource.driver-class-name=org.mariadb.jdbc.Driver --spring.datasource.url=jdbc:mysql://localhost/dataflow --spring.datasource.username=spring --spring.datasource.password=cloud  --spring.cloud.dataflow.applicationProperties.stream.spring.cloud.stream.kafka.binder.brokers=localhost --spring.cloud.dataflow.applicationProperties.stream.spring.cloud.stream.kafka.binder.zkNodes=localhost  --spring.redis.host=127.0.0.1 --spring.cloud.skipper.server.platform.local.accounts.default.workingDirectoriesRoot=/opt/bamboo-home/xml-data/build-dir/SCDT-LOCAL20XSKIPPER20X-KAFKA/local/skipper-server/app-logs > /opt/bamboo-home/xml-data/build-dir/SCDT-LOCAL20XSKIPPER20X-KAFKA/local/skipper-server/skipper-server.log &]
12-Nov-2019 00:01:16 [/opt/bamboo-home/xml-data/build-dir/SCDT-LOCAL20XSKIPPER20X-KAFKA/local/skipper-server] process pid is [20611]
12-Nov-2019 00:01:16 System props are []
12-Nov-2019 00:01:16 Logs are under [/opt/bamboo-home/xml-data/build-dir/SCDT-LOCAL20XSKIPPER20X-KAFKA/local/skipper-server/skipper-server.log] or from nohup [/opt/bamboo-home/xml-data/build-dir/SCDT-LOCAL20XSKIPPER20X-KAFKA/local/skipper-server/nohup.log]
12-Nov-2019 00:01:16 Failed to connect to localhost:7577. Attempt  #1/60... will try again in [5] seconds
12-Nov-2019 00:01:21 Failed to connect to localhost:7577. Attempt  #2/60... will try again in [5] seconds
12-Nov-2019 00:01:26 Failed to connect to localhost:7577. Attempt  #3/60... will try again in [5] seconds
12-Nov-2019 00:01:31 Failed to connect to localhost:7577. Attempt  #4/60... will try again in [5] seconds
12-Nov-2019 00:01:37 SCDF SERVER URI: http://localhost:9393
12-Nov-2019 00:01:37 Downloading server from https://repo.spring.io/libs-snapshot/org/springframework/cloud/spring-cloud-dataflow-server/2.0.4.BUILD-SNAPSHOT/spring-cloud-dataflow-server-2.0.4.BUILD-SNAPSHOT.jar
12-Nov-2019 00:01:46 2019-11-12 00:01:46 URL:https://repo.spring.io/libs-snapshot/org/springframework/cloud/spring-cloud-dataflow-server/2.0.4.BUILD-SNAPSHOT/spring-cloud-dataflow-server-2.0.4.BUILD-SNAPSHOT.jar [87897631/87897631] -> "/opt/bamboo-home/xml-data/build-dir/SCDT-LOCAL20XSKIPPER20X-KAFKA/local/server/scdf-server.jar" [1]
12-Nov-2019 00:01:46 SPRING_PROFILES_ACTIVE []
12-Nov-2019 00:01:46 executing [nohup /opt/jdk-8/bin/java  -Xmx1024m -Xss1024k -jar /opt/bamboo-home/xml-data/build-dir/SCDT-LOCAL20XSKIPPER20X-KAFKA/local/server/scdf-server.jar  --spring.datasource.driver-class-name=org.mariadb.jdbc.Driver --spring.datasource.url=jdbc:mysql://localhost/dataflow --spring.datasource.username=spring --spring.datasource.password=cloud  --spring.cloud.dataflow.applicationProperties.stream.spring.cloud.stream.kafka.binder.brokers=localhost --spring.cloud.dataflow.applicationProperties.stream.spring.cloud.stream.kafka.binder.zkNodes=localhost  --spring.redis.host=127.0.0.1 --spring.cloud.skipper.server.platform.local.accounts.default.workingDirectoriesRoot=/opt/bamboo-home/xml-data/build-dir/SCDT-LOCAL20XSKIPPER20X-KAFKA/local/skipper-server/app-logs --spring.cloud.dataflow.features.skipper-enabled=true > /opt/bamboo-home/xml-data/build-dir/SCDT-LOCAL20XSKIPPER20X-KAFKA/local/server/scdf-server.log &]
12-Nov-2019 00:01:46 [/opt/bamboo-home/xml-data/build-dir/SCDT-LOCAL20XSKIPPER20X-KAFKA/local/server] process pid is [20721]
12-Nov-2019 00:01:46 System props are []
12-Nov-2019 00:01:46 Logs are under [/opt/bamboo-home/xml-data/build-dir/SCDT-LOCAL20XSKIPPER20X-KAFKA/local/server/scdf-server.log] or from nohup [/opt/bamboo-home/xml-data/build-dir/SCDT-LOCAL20XSKIPPER20X-KAFKA/local/server/nohup.log]
12-Nov-2019 00:01:46 Failed to connect to localhost:9393. Attempt  #1/60... will try again in [5] seconds
12-Nov-2019 00:01:51 Failed to connect to localhost:9393. Attempt  #2/60... will try again in [5] seconds
12-Nov-2019 00:01:56 Failed to connect to localhost:9393. Attempt  #3/60... will try again in [5] seconds
12-Nov-2019 00:02:02 SCDF SERVER ABOUT:
12-Nov-2019 00:02:02 --2019-11-12 00:02:02--  http://localhost:9393/about
12-Nov-2019 00:02:02 Resolving localhost (localhost)... ::1, 127.0.0.1
12-Nov-2019 00:02:02 Connecting to localhost (localhost)|::1|:9393... connected.
12-Nov-2019 00:02:03 HTTP request sent, awaiting response... 200
12-Nov-2019 00:02:03 Length: unspecified [application/hal+json]
12-Nov-2019 00:02:03 Saving to: ‘STDOUT’
12-Nov-2019 00:02:03
12-Nov-2019 00:02:03 {
12-Nov-2019 00:02:03     "_links": {
12-Nov-2019 00:02:03         "self": {
12-Nov-2019 00:02:03             "href": "http://localhost:9393/about"
12-Nov-2019 00:02:03         }
12-Nov-2019 00:02:03     },
12-Nov-2019 00:02:03     "featureInfo": {
12-Nov-2019 00:02:03         "analyticsEnabled": true,
12-Nov-2019 00:02:03         "grafanaEnabled": false,
12-Nov-2019 00:02:03         "schedulesEnabled": false,
12-Nov-2019 00:02:03         "streamsEnabled": true,
12-Nov-2019 00:02:03         "tasksEnabled": true
12-Nov-2019 00:02:03     },
12-Nov-2019 00:02:03     "grafanaInfo": {
12-Nov-2019 00:02:03         "refreshInterval": 15,
12-Nov-2019 00:02:03         "url": ""
12-Nov-2019 00:02:03     },
12-Nov-2019 00:02:03     "runtimeEnvironment": {
12-Nov-2019 00:02:03         "appDeployer": {
12-Nov-2019 00:02:03             "deployerImplementationVersion": "2.0.4.BUILD-SNAPSHOT",
12-Nov-2019 00:02:03             "deployerName": "Spring Cloud Skipper Server",
12-Nov-2019 00:02:03             "deployerSpiVersion": "2.0.3.RELEASE",
12-Nov-2019 00:02:03             "javaVersion": "1.8.0_232",
12-Nov-2019 00:02:03             "platformApiVersion": "",
12-Nov-2019 00:02:03             "platformClientVersion": "",
12-Nov-2019 00:02:03             "platformHostVersion": "",
12-Nov-2019 00:02:03             "platformSpecificInfo": {
12-Nov-2019 00:02:03                 "default": "local"
12-Nov-2019 00:02:03             },
12-Nov-2019 00:02:03             "platformType": "Skipper Managed",
12-Nov-2019 00:02:03             "springBootVersion": "2.1.3.RELEASE",
12-Nov-2019 00:02:03             "springVersion": "5.1.5.RELEASE"
12-Nov-2019 00:02:03         },
12-Nov-2019 00:02:03         "taskLaunchers": [
12-Nov-2019 00:02:03             {
12-Nov-2019 00:02:03                 "deployerImplementationVersion": "2.0.3.RELEASE",
12-Nov-2019 00:02:03                 "deployerName": "LocalTaskLauncher",
12-Nov-2019 00:02:03                 "deployerSpiVersion": "2.0.2.RELEASE",
12-Nov-2019 00:02:03                 "javaVersion": "1.8.0_232",
12-Nov-2019 00:02:03                 "platformApiVersion": "Linux 4.15.0-66-generic",
12-Nov-2019 00:02:03                 "platformClientVersion": "4.15.0-66-generic",
12-Nov-2019 00:02:03                 "platformHostVersion": "4.15.0-66-generic",
12-Nov-2019 00:02:03                 "platformSpecificInfo": {},
12-Nov-2019 00:02:03                 "platformType": "Local",
12-Nov-2019 00:02:03                 "springBootVersion": "2.1.3.RELEASE",
12-Nov-2019 00:02:03                 "springVersion": "5.1.5.RELEASE"
12-Nov-2019 00:02:03             }
12-Nov-2019 00:02:03         ]
12-Nov-2019 00:02:03     },
12-Nov-2019 00:02:03     "securityInfo": {
12-Nov-2019 00:02:03         "authenticated": false,
12-Nov-2019 00:02:03         "authenticationEnabled": false,
12-Nov-2019 00:02:03         "roles": [],
12-Nov-2019 00:02:03         "username": null
12-Nov-2019 00:02:03     },
12-Nov-2019 00:02:03     "versionInfo": {
12-Nov-2019 00:02:03         "core": {
12-Nov-2019 00:02:03             "name": "Spring Cloud Data Flow Core",
12-Nov-2019 00:02:03             "version": "2.0.4.BUILD-SNAPSHOT"
12-Nov-2019 00:02:03         },
12-Nov-2019 00:02:03         "dashboard": {
12-Nov-2019 00:02:03             "name": "Spring Cloud Dataflow UI",
12-Nov-2019 00:02:03             "version": "2.0.3.RELEASE"
12-Nov-2019 00:02:03         },
12-Nov-2019 00:02:03         "implementation": {
12-Nov-2019 00:02:03             "name": "spring-cloud-dataflow-server",
12-Nov-2019 00:02:03             "version": "2.0.4.BUILD-SNAPSHOT"
12-Nov-2019 00:02:03         },
12-Nov-2019 00:02:03         "shell": {
12-Nov-2019 00:02:03             "name": "Spring Cloud Data Flow Shell",
12-Nov-2019 00:02:03             "url": "https://repo.spring.io/libs-snapshot/org/springframework/cloud/spring-cloud-dataflow-shell/2.0.4.BUILD-SNAPSHOT/spring-cloud-dataflow-shell-2.0.4.BUILD-SNAPSHOT.jar",
12-Nov-2019 00:02:03             "version": "2.0.4.BUILD-SNAPSHOT"
12-Nov-2019 00:02:03         }
12-Nov-2019 00:02:03     }
12-Nov-2019 00:02:03 }
12-Nov-2019 00:02:03      0K .                                                       161M=0s
12-Nov-2019 00:02:03
12-Nov-2019 00:02:03 2019-11-12 00:02:03 (161 MB/s) - written to stdout [1681]
12-Nov-2019 00:02:03
12-Nov-2019 00:02:03 SKIPPER SERVER ABOUT:
12-Nov-2019 00:02:03 --2019-11-12 00:02:03--  http://localhost:7577/api/about
12-Nov-2019 00:02:03 Resolving localhost (localhost)... ::1, 127.0.0.1
12-Nov-2019 00:02:03 Connecting to localhost (localhost)|::1|:7577... connected.
12-Nov-2019 00:02:03 HTTP request sent, awaiting response... 200
12-Nov-2019 00:02:03 Length: unspecified [application/hal+json]
12-Nov-2019 00:02:03 Saving to: ‘STDOUT’
12-Nov-2019 00:02:03
12-Nov-2019 00:02:03      0K                                                        49.1M=0s
12-Nov-2019 00:02:03
12-Nov-2019 00:02:03 2019-11-12 00:02:03 (49.1 MB/s) - written to stdout [426]
12-Nov-2019 00:02:03
12-Nov-2019 00:02:03 {
12-Nov-2019 00:02:03     "versionInfo": {
12-Nov-2019 00:02:03         "server": {
12-Nov-2019 00:02:03             "name": "Spring Cloud Skipper Server",
12-Nov-2019 00:02:03             "version": "2.0.4.BUILD-SNAPSHOT"
12-Nov-2019 00:02:03         },
12-Nov-2019 00:02:03         "shell": {
12-Nov-2019 00:02:03             "name": "Spring Cloud Skipper Shell",
12-Nov-2019 00:02:03             "url": "https://repo.spring.io/libs-snapshot/org/springframework/cloud/spring-cloud-skipper-shell/2.0.4.BUILD-SNAPSHOT/spring-cloud-skipper-shell-2.0.4.BUILD-SNAPSHOT.jar",
12-Nov-2019 00:02:03             "version": "2.0.4.BUILD-SNAPSHOT"
12-Nov-2019 00:02:03         }
12-Nov-2019 00:02:03     }
12-Nov-2019 00:02:03 }
12-Nov-2019 00:02:04 [INFO] Scanning for projects...
12-Nov-2019 00:02:05 [INFO] Downloading: https://repo.spring.io/libs-snapshot-local/org/codehaus/mojo/maven-metadata.xml
12-Nov-2019 00:02:05 [INFO] Downloading: https://repo.spring.io/libs-milestone-local/org/apache/maven/plugins/maven-metadata.xml
12-Nov-2019 00:02:05 [INFO] Downloading: https://repo.spring.io/libs-milestone-local/org/codehaus/mojo/maven-metadata.xml
12-Nov-2019 00:02:05 [INFO] Downloading: https://repo.spring.io/libs-snapshot-local/org/apache/maven/plugins/maven-metadata.xml
12-Nov-2019 00:02:06 [INFO] Downloading: https://repo.spring.io/libs-milestone-local/org/apache/maven/plugins/maven-surefire-report-plugin/maven-metadata.xml
12-Nov-2019 00:02:06 [INFO] Downloading: https://repo.spring.io/libs-snapshot-local/org/apache/maven/plugins/maven-surefire-report-plugin/maven-metadata.xml
12-Nov-2019 00:02:06 [INFO]                                                                         
12-Nov-2019 00:02:06 [INFO] ------------------------------------------------------------------------
12-Nov-2019 00:02:06 [INFO] Building Data Flow Acceptance Tests 1.1.0.BUILD-SNAPSHOT
12-Nov-2019 00:02:06 [INFO] ------------------------------------------------------------------------
12-Nov-2019 00:02:06 [INFO] Downloading: https://repo.spring.io/libs-snapshot-local/org/springframework/cloud/spring-cloud-dataflow-rest-client/1.7.0.BUILD-SNAPSHOT/maven-metadata.xml
12-Nov-2019 00:02:06 [INFO] Downloaded: https://repo.spring.io/libs-snapshot-local/org/springframework/cloud/spring-cloud-dataflow-rest-client/1.7.0.BUILD-SNAPSHOT/maven-metadata.xml (2 KB at 5.6 KB/sec)
12-Nov-2019 00:02:06 [INFO] Downloading: https://repo.spring.io/libs-snapshot-local/org/springframework/cloud/spring-cloud-dataflow-parent/1.7.0.BUILD-SNAPSHOT/maven-metadata.xml
12-Nov-2019 00:02:07 [INFO] Downloaded: https://repo.spring.io/libs-snapshot-local/org/springframework/cloud/spring-cloud-dataflow-parent/1.7.0.BUILD-SNAPSHOT/maven-metadata.xml (646 B at 3.4 KB/sec)
12-Nov-2019 00:02:07 [INFO] Downloading: https://repo.spring.io/libs-snapshot-local/org/springframework/cloud/spring-cloud-dataflow-dependencies/1.7.0.BUILD-SNAPSHOT/maven-metadata.xml
12-Nov-2019 00:02:07 [INFO] Downloaded: https://repo.spring.io/libs-snapshot-local/org/springframework/cloud/spring-cloud-dataflow-dependencies/1.7.0.BUILD-SNAPSHOT/maven-metadata.xml (652 B at 3.4 KB/sec)
12-Nov-2019 00:02:07 [INFO] Downloading: https://repo.spring.io/libs-snapshot-local/org/springframework/cloud/spring-cloud-dataflow-rest-resource/1.7.0.BUILD-SNAPSHOT/maven-metadata.xml
12-Nov-2019 00:02:07 [INFO] Downloaded: https://repo.spring.io/libs-snapshot-local/org/springframework/cloud/spring-cloud-dataflow-rest-resource/1.7.0.BUILD-SNAPSHOT/maven-metadata.xml (2 KB at 5.7 KB/sec)
12-Nov-2019 00:02:07 [INFO] Downloading: https://repo.spring.io/libs-snapshot-local/org/springframework/cloud/spring-cloud-dataflow-core/1.7.0.BUILD-SNAPSHOT/maven-metadata.xml
12-Nov-2019 00:02:07 [INFO] Downloaded: https://repo.spring.io/libs-snapshot-local/org/springframework/cloud/spring-cloud-dataflow-core/1.7.0.BUILD-SNAPSHOT/maven-metadata.xml (2 KB at 7.6 KB/sec)
12-Nov-2019 00:02:07 [INFO]
12-Nov-2019 00:02:07 [INFO] --- maven-checkstyle-plugin:2.17:check (checkstyle-validation) @ spring-cloud-dataflow-acceptance-tests ---
12-Nov-2019 00:02:08 [INFO]
12-Nov-2019 00:02:08 [INFO] --- maven-resources-plugin:2.6:resources (default-resources) @ spring-cloud-dataflow-acceptance-tests ---
12-Nov-2019 00:02:08 [INFO] Using 'UTF-8' encoding to copy filtered resources.
12-Nov-2019 00:02:08 [INFO] skip non existing resourceDirectory /opt/bamboo-home/xml-data/build-dir/SCDT-LOCAL20XSKIPPER20X-KAFKA/src/main/resources
12-Nov-2019 00:02:08 [INFO] skip non existing resourceDirectory /opt/bamboo-home/xml-data/build-dir/SCDT-LOCAL20XSKIPPER20X-KAFKA/src/main/resources
12-Nov-2019 00:02:08 [INFO]
12-Nov-2019 00:02:08 [INFO] --- maven-compiler-plugin:3.1:compile (default-compile) @ spring-cloud-dataflow-acceptance-tests ---
12-Nov-2019 00:02:08 [INFO] Changes detected - recompiling the module!
12-Nov-2019 00:02:08 [INFO] Compiling 8 source files to /opt/bamboo-home/xml-data/build-dir/SCDT-LOCAL20XSKIPPER20X-KAFKA/target/classes
12-Nov-2019 00:02:09 [INFO]
12-Nov-2019 00:02:09 [INFO] --- maven-resources-plugin:2.6:testResources (default-testResources) @ spring-cloud-dataflow-acceptance-tests ---
12-Nov-2019 00:02:09 [INFO] Using 'UTF-8' encoding to copy filtered resources.
12-Nov-2019 00:02:09 [INFO] Copying 1 resource
12-Nov-2019 00:02:09 [INFO]
12-Nov-2019 00:02:09 [INFO] --- maven-compiler-plugin:3.1:testCompile (default-testCompile) @ spring-cloud-dataflow-acceptance-tests ---
12-Nov-2019 00:02:09 [INFO] Changes detected - recompiling the module!
12-Nov-2019 00:02:09 [INFO] Compiling 16 source files to /opt/bamboo-home/xml-data/build-dir/SCDT-LOCAL20XSKIPPER20X-KAFKA/target/test-classes
12-Nov-2019 00:02:10 [WARNING] /opt/bamboo-home/xml-data/build-dir/SCDT-LOCAL20XSKIPPER20X-KAFKA/src/test/java/org/springframework/cloud/dataflow/acceptance/test/AbstractTaskTests.java: Some input files use unchecked or unsafe operations.
12-Nov-2019 00:02:10 [WARNING] /opt/bamboo-home/xml-data/build-dir/SCDT-LOCAL20XSKIPPER20X-KAFKA/src/test/java/org/springframework/cloud/dataflow/acceptance/test/AbstractTaskTests.java: Recompile with -Xlint:unchecked for details.
12-Nov-2019 00:02:10 [INFO]
12-Nov-2019 00:02:10 [INFO] --- maven-surefire-plugin:2.18.1:test (default-test) @ spring-cloud-dataflow-acceptance-tests ---
12-Nov-2019 00:02:10 [INFO] Surefire report directory: /opt/bamboo-home/xml-data/build-dir/SCDT-LOCAL20XSKIPPER20X-KAFKA/target/surefire-reports
12-Nov-2019 00:02:10
12-Nov-2019 00:02:10 -------------------------------------------------------
12-Nov-2019 00:02:10 T E S T S
12-Nov-2019 00:02:10 -------------------------------------------------------
12-Nov-2019 00:02:10 2019-11-12 00:02:10.777  INFO   --- [           main] .b.t.c.SpringBootTestContextBootstrapper : Neither @ContextConfiguration nor @ContextHierarchy found for test class [org.springframework.cloud.dataflow.acceptance.test.AnalyticsTests], using SpringBootContextLoader
12-Nov-2019 00:02:10 2019-11-12 00:02:10.829  INFO   --- [           main] .b.t.c.SpringBootTestContextBootstrapper : Loaded default TestExecutionListener class names from location [META-INF/spring.factories]: [org.springframework.boot.test.mock.mockito.MockitoTestExecutionListener, org.springframework.boot.test.mock.mockito.ResetMocksTestExecutionListener, org.springframework.boot.test.autoconfigure.restdocs.RestDocsTestExecutionListener, org.springframework.boot.test.autoconfigure.web.client.MockRestServiceServerResetTestExecutionListener, org.springframework.boot.test.autoconfigure.web.servlet.MockMvcPrintOnlyOnFailureTestExecutionListener, org.springframework.boot.test.autoconfigure.web.servlet.WebDriverTestExecutionListener, org.springframework.test.context.web.ServletTestExecutionListener, org.springframework.test.context.support.DirtiesContextBeforeModesTestExecutionListener, org.springframework.test.context.support.DependencyInjectionTestExecutionListener, org.springframework.test.context.support.DirtiesContextTestExecutionListener, org.springframework.test.context.transaction.TransactionalTestExecutionListener, org.springframework.test.context.jdbc.SqlScriptsTestExecutionListener]
12-Nov-2019 00:02:10 2019-11-12 00:02:10.846  INFO   --- [           main] .b.t.c.SpringBootTestContextBootstrapper : Using TestExecutionListeners: [org.springframework.test.context.web.ServletTestExecutionListener@4b5d6a01, org.springframework.test.context.support.DirtiesContextBeforeModesTestExecutionListener@4a22f9e2, org.springframework.boot.test.autoconfigure.SpringBootDependencyInjectionTestExecutionListener@3c419631, org.springframework.test.context.support.DirtiesContextTestExecutionListener@418e7838, org.springframework.test.context.transaction.TransactionalTestExecutionListener@61230f6a, org.springframework.test.context.jdbc.SqlScriptsTestExecutionListener@3c130745, org.springframework.boot.test.mock.mockito.MockitoTestExecutionListener@cd3fee8, org.springframework.boot.test.autoconfigure.web.servlet.MockMvcPrintOnlyOnFailureTestExecutionListener@3e2e18f2, org.springframework.boot.test.autoconfigure.web.client.MockRestServiceServerResetTestExecutionListener@470f1802, org.springframework.boot.test.mock.mockito.ResetMocksTestExecutionListener@63021689, org.springframework.boot.test.autoconfigure.web.servlet.WebDriverTestExecutionListener@703580bf, org.springframework.boot.test.autoconfigure.restdocs.RestDocsTestExecutionListener@3e92efc3]
12-Nov-2019 00:02:10 2019-11-12 00:02:10.848  INFO   --- [           main] .b.t.c.SpringBootTestContextBootstrapper : Neither @ContextConfiguration nor @ContextHierarchy found for test class [org.springframework.cloud.dataflow.acceptance.test.WoodChuckTests], using SpringBootContextLoader
12-Nov-2019 00:02:10 2019-11-12 00:02:10.860  INFO   --- [           main] .b.t.c.SpringBootTestContextBootstrapper : Loaded default TestExecutionListener class names from location [META-INF/spring.factories]: [org.springframework.boot.test.mock.mockito.MockitoTestExecutionListener, org.springframework.boot.test.mock.mockito.ResetMocksTestExecutionListener, org.springframework.boot.test.autoconfigure.restdocs.RestDocsTestExecutionListener, org.springframework.boot.test.autoconfigure.web.client.MockRestServiceServerResetTestExecutionListener, org.springframework.boot.test.autoconfigure.web.servlet.MockMvcPrintOnlyOnFailureTestExecutionListener, org.springframework.boot.test.autoconfigure.web.servlet.WebDriverTestExecutionListener, org.springframework.test.context.web.ServletTestExecutionListener, org.springframework.test.context.support.DirtiesContextBeforeModesTestExecutionListener, org.springframework.test.context.support.DependencyInjectionTestExecutionListener, org.springframework.test.context.support.DirtiesContextTestExecutionListener, org.springframework.test.context.transaction.TransactionalTestExecutionListener, org.springframework.test.context.jdbc.SqlScriptsTestExecutionListener]
12-Nov-2019 00:02:10 2019-11-12 00:02:10.864  INFO   --- [           main] .b.t.c.SpringBootTestContextBootstrapper : Using TestExecutionListeners: [org.springframework.test.context.web.ServletTestExecutionListener@7ec7ffd3, org.springframework.test.context.support.DirtiesContextBeforeModesTestExecutionListener@5b239d7d, org.springframework.boot.test.autoconfigure.SpringBootDependencyInjectionTestExecutionListener@6572421, org.springframework.test.context.support.DirtiesContextTestExecutionListener@6b81ce95, org.springframework.test.context.transaction.TransactionalTestExecutionListener@2a798d51, org.springframework.test.context.jdbc.SqlScriptsTestExecutionListener@6d763516, org.springframework.boot.test.mock.mockito.MockitoTestExecutionListener@52bf72b5, org.springframework.boot.test.autoconfigure.web.servlet.MockMvcPrintOnlyOnFailureTestExecutionListener@37afeb11, org.springframework.boot.test.autoconfigure.web.client.MockRestServiceServerResetTestExecutionListener@515aebb0, org.springframework.boot.test.mock.mockito.ResetMocksTestExecutionListener@dd8ba08, org.springframework.boot.test.autoconfigure.web.servlet.WebDriverTestExecutionListener@245b4bdc, org.springframework.boot.test.autoconfigure.restdocs.RestDocsTestExecutionListener@6c64cb25]
12-Nov-2019 00:02:10 2019-11-12 00:02:10.865  INFO   --- [           main] .b.t.c.SpringBootTestContextBootstrapper : Neither @ContextConfiguration nor @ContextHierarchy found for test class [org.springframework.cloud.dataflow.acceptance.test.HttpSourceTests], using SpringBootContextLoader
12-Nov-2019 00:02:10 2019-11-12 00:02:10.874  INFO   --- [           main] .b.t.c.SpringBootTestContextBootstrapper : Loaded default TestExecutionListener class names from location [META-INF/spring.factories]: [org.springframework.boot.test.mock.mockito.MockitoTestExecutionListener, org.springframework.boot.test.mock.mockito.ResetMocksTestExecutionListener, org.springframework.boot.test.autoconfigure.restdocs.RestDocsTestExecutionListener, org.springframework.boot.test.autoconfigure.web.client.MockRestServiceServerResetTestExecutionListener, org.springframework.boot.test.autoconfigure.web.servlet.MockMvcPrintOnlyOnFailureTestExecutionListener, org.springframework.boot.test.autoconfigure.web.servlet.WebDriverTestExecutionListener, org.springframework.test.context.web.ServletTestExecutionListener, org.springframework.test.context.support.DirtiesContextBeforeModesTestExecutionListener, org.springframework.test.context.support.DependencyInjectionTestExecutionListener, org.springframework.test.context.support.DirtiesContextTestExecutionListener, org.springframework.test.context.transaction.TransactionalTestExecutionListener, org.springframework.test.context.jdbc.SqlScriptsTestExecutionListener]
12-Nov-2019 00:02:10 2019-11-12 00:02:10.877  INFO   --- [           main] .b.t.c.SpringBootTestContextBootstrapper : Using TestExecutionListeners: [org.springframework.test.context.web.ServletTestExecutionListener@40a4337a, org.springframework.test.context.support.DirtiesContextBeforeModesTestExecutionListener@6025e1b6, org.springframework.boot.test.autoconfigure.SpringBootDependencyInjectionTestExecutionListener@22ff4249, org.springframework.test.context.support.DirtiesContextTestExecutionListener@2d1ef81a, org.springframework.test.context.transaction.TransactionalTestExecutionListener@4c402120, org.springframework.test.context.jdbc.SqlScriptsTestExecutionListener@327514f, org.springframework.boot.test.mock.mockito.MockitoTestExecutionListener@5b12b668, org.springframework.boot.test.autoconfigure.web.servlet.MockMvcPrintOnlyOnFailureTestExecutionListener@1165b38, org.springframework.boot.test.autoconfigure.web.client.MockRestServiceServerResetTestExecutionListener@4c12331b, org.springframework.boot.test.mock.mockito.ResetMocksTestExecutionListener@7586beff, org.springframework.boot.test.autoconfigure.web.servlet.WebDriverTestExecutionListener@3b69e7d1, org.springframework.boot.test.autoconfigure.restdocs.RestDocsTestExecutionListener@815b41f]
12-Nov-2019 00:02:10 2019-11-12 00:02:10.894  INFO   --- [           main] .b.t.c.SpringBootTestContextBootstrapper : Neither @ContextConfiguration nor @ContextHierarchy found for test class [org.springframework.cloud.dataflow.acceptance.test.TickTockTests], using SpringBootContextLoader
12-Nov-2019 00:02:10 2019-11-12 00:02:10.903  INFO   --- [           main] .b.t.c.SpringBootTestContextBootstrapper : Loaded default TestExecutionListener class names from location [META-INF/spring.factories]: [org.springframework.boot.test.mock.mockito.MockitoTestExecutionListener, org.springframework.boot.test.mock.mockito.ResetMocksTestExecutionListener, org.springframework.boot.test.autoconfigure.restdocs.RestDocsTestExecutionListener, org.springframework.boot.test.autoconfigure.web.client.MockRestServiceServerResetTestExecutionListener, org.springframework.boot.test.autoconfigure.web.servlet.MockMvcPrintOnlyOnFailureTestExecutionListener, org.springframework.boot.test.autoconfigure.web.servlet.WebDriverTestExecutionListener, org.springframework.test.context.web.ServletTestExecutionListener, org.springframework.test.context.support.DirtiesContextBeforeModesTestExecutionListener, org.springframework.test.context.support.DependencyInjectionTestExecutionListener, org.springframework.test.context.support.DirtiesContextTestExecutionListener, org.springframework.test.context.transaction.TransactionalTestExecutionListener, org.springframework.test.context.jdbc.SqlScriptsTestExecutionListener]
12-Nov-2019 00:02:10 2019-11-12 00:02:10.906  INFO   --- [           main] .b.t.c.SpringBootTestContextBootstrapper : Using TestExecutionListeners: [org.springframework.test.context.web.ServletTestExecutionListener@55b53d44, org.springframework.test.context.support.DirtiesContextBeforeModesTestExecutionListener@482bce4f, org.springframework.boot.test.autoconfigure.SpringBootDependencyInjectionTestExecutionListener@366647c2, org.springframework.test.context.support.DirtiesContextTestExecutionListener@6a6afff2, org.springframework.test.context.transaction.TransactionalTestExecutionListener@1649b0e6, org.springframework.test.context.jdbc.SqlScriptsTestExecutionListener@865dd6, org.springframework.boot.test.mock.mockito.MockitoTestExecutionListener@4da4253, org.springframework.boot.test.autoconfigure.web.servlet.MockMvcPrintOnlyOnFailureTestExecutionListener@3972a855, org.springframework.boot.test.autoconfigure.web.client.MockRestServiceServerResetTestExecutionListener@62e7f11d, org.springframework.boot.test.mock.mockito.ResetMocksTestExecutionListener@503d687a, org.springframework.boot.test.autoconfigure.web.servlet.WebDriverTestExecutionListener@6a370f4, org.springframework.boot.test.autoconfigure.restdocs.RestDocsTestExecutionListener@2abf4075]
12-Nov-2019 00:02:10 2019-11-12 00:02:10.917  INFO   --- [           main] .b.t.c.SpringBootTestContextBootstrapper : Neither @ContextConfiguration nor @ContextHierarchy found for test class [org.springframework.cloud.dataflow.acceptance.test.TransformTests], using SpringBootContextLoader
12-Nov-2019 00:02:10 2019-11-12 00:02:10.925  INFO   --- [           main] .b.t.c.SpringBootTestContextBootstrapper : Loaded default TestExecutionListener class names from location [META-INF/spring.factories]: [org.springframework.boot.test.mock.mockito.MockitoTestExecutionListener, org.springframework.boot.test.mock.mockito.ResetMocksTestExecutionListener, org.springframework.boot.test.autoconfigure.restdocs.RestDocsTestExecutionListener, org.springframework.boot.test.autoconfigure.web.client.MockRestServiceServerResetTestExecutionListener, org.springframework.boot.test.autoconfigure.web.servlet.MockMvcPrintOnlyOnFailureTestExecutionListener, org.springframework.boot.test.autoconfigure.web.servlet.WebDriverTestExecutionListener, org.springframework.test.context.web.ServletTestExecutionListener, org.springframework.test.context.support.DirtiesContextBeforeModesTestExecutionListener, org.springframework.test.context.support.DependencyInjectionTestExecutionListener, org.springframework.test.context.support.DirtiesContextTestExecutionListener, org.springframework.test.context.transaction.TransactionalTestExecutionListener, org.springframework.test.context.jdbc.SqlScriptsTestExecutionListener]
12-Nov-2019 00:02:10 2019-11-12 00:02:10.928  INFO   --- [           main] .b.t.c.SpringBootTestContextBootstrapper : Using TestExecutionListeners: [org.springframework.test.context.web.ServletTestExecutionListener@51e69659, org.springframework.test.context.support.DirtiesContextBeforeModesTestExecutionListener@47e2e487, org.springframework.boot.test.autoconfigure.SpringBootDependencyInjectionTestExecutionListener@201a4587, org.springframework.test.context.support.DirtiesContextTestExecutionListener@61001b64, org.springframework.test.context.transaction.TransactionalTestExecutionListener@4310d43, org.springframework.test.context.jdbc.SqlScriptsTestExecutionListener@54a7079e, org.springframework.boot.test.mock.mockito.MockitoTestExecutionListener@26e356f0, org.springframework.boot.test.autoconfigure.web.servlet.MockMvcPrintOnlyOnFailureTestExecutionListener@47d9a273, org.springframework.boot.test.autoconfigure.web.client.MockRestServiceServerResetTestExecutionListener@4b8ee4de, org.springframework.boot.test.mock.mockito.ResetMocksTestExecutionListener@27f981c6, org.springframework.boot.test.autoconfigure.web.servlet.WebDriverTestExecutionListener@1b11171f, org.springframework.boot.test.autoconfigure.restdocs.RestDocsTestExecutionListener@1151e434]
12-Nov-2019 00:02:10 2019-11-12 00:02:10.941  INFO   --- [           main] .b.t.c.SpringBootTestContextBootstrapper : Neither @ContextConfiguration nor @ContextHierarchy found for test class [org.springframework.cloud.dataflow.acceptance.test.NamedChannelTests], using SpringBootContextLoader
12-Nov-2019 00:02:10 2019-11-12 00:02:10.949  INFO   --- [           main] .b.t.c.SpringBootTestContextBootstrapper : Loaded default TestExecutionListener class names from location [META-INF/spring.factories]: [org.springframework.boot.test.mock.mockito.MockitoTestExecutionListener, org.springframework.boot.test.mock.mockito.ResetMocksTestExecutionListener, org.springframework.boot.test.autoconfigure.restdocs.RestDocsTestExecutionListener, org.springframework.boot.test.autoconfigure.web.client.MockRestServiceServerResetTestExecutionListener, org.springframework.boot.test.autoconfigure.web.servlet.MockMvcPrintOnlyOnFailureTestExecutionListener, org.springframework.boot.test.autoconfigure.web.servlet.WebDriverTestExecutionListener, org.springframework.test.context.web.ServletTestExecutionListener, org.springframework.test.context.support.DirtiesContextBeforeModesTestExecutionListener, org.springframework.test.context.support.DependencyInjectionTestExecutionListener, org.springframework.test.context.support.DirtiesContextTestExecutionListener, org.springframework.test.context.transaction.TransactionalTestExecutionListener, org.springframework.test.context.jdbc.SqlScriptsTestExecutionListener]
12-Nov-2019 00:02:10 2019-11-12 00:02:10.952  INFO   --- [           main] .b.t.c.SpringBootTestContextBootstrapper : Using TestExecutionListeners: [org.springframework.test.context.web.ServletTestExecutionListener@70cf32e3, org.springframework.test.context.support.DirtiesContextBeforeModesTestExecutionListener@5a59ca5e, org.springframework.boot.test.autoconfigure.SpringBootDependencyInjectionTestExecutionListener@4bdeaabb, org.springframework.test.context.support.DirtiesContextTestExecutionListener@6c4906d3, org.springframework.test.context.transaction.TransactionalTestExecutionListener@65987993, org.springframework.test.context.jdbc.SqlScriptsTestExecutionListener@71075444, org.springframework.boot.test.mock.mockito.MockitoTestExecutionListener@4f32a3ad, org.springframework.boot.test.autoconfigure.web.servlet.MockMvcPrintOnlyOnFailureTestExecutionListener@6b695b06, org.springframework.boot.test.autoconfigure.web.client.MockRestServiceServerResetTestExecutionListener@4d1bf319, org.springframework.boot.test.mock.mockito.ResetMocksTestExecutionListener@6f53b8a, org.springframework.boot.test.autoconfigure.web.servlet.WebDriverTestExecutionListener@5c80cf32, org.springframework.boot.test.autoconfigure.restdocs.RestDocsTestExecutionListener@7d900ecf]
12-Nov-2019 00:02:10 Running org.springframework.cloud.dataflow.acceptance.test.AnalyticsTests
12-Nov-2019 00:02:10 2019-11-12 00:02:10.977  INFO   --- [           main] .b.t.c.SpringBootTestContextBootstrapper : Neither @ContextConfiguration nor @ContextHierarchy found for test class [org.springframework.cloud.dataflow.acceptance.test.AnalyticsTests], using SpringBootContextLoader
12-Nov-2019 00:02:11 2019-11-12 00:02:11.001  INFO   --- [           main] .b.t.c.SpringBootTestContextBootstrapper : Loaded default TestExecutionListener class names from location [META-INF/spring.factories]: [org.springframework.boot.test.mock.mockito.MockitoTestExecutionListener, org.springframework.boot.test.mock.mockito.ResetMocksTestExecutionListener, org.springframework.boot.test.autoconfigure.restdocs.RestDocsTestExecutionListener, org.springframework.boot.test.autoconfigure.web.client.MockRestServiceServerResetTestExecutionListener, org.springframework.boot.test.autoconfigure.web.servlet.MockMvcPrintOnlyOnFailureTestExecutionListener, org.springframework.boot.test.autoconfigure.web.servlet.WebDriverTestExecutionListener, org.springframework.test.context.web.ServletTestExecutionListener, org.springframework.test.context.support.DirtiesContextBeforeModesTestExecutionListener, org.springframework.test.context.support.DependencyInjectionTestExecutionListener, org.springframework.test.context.support.DirtiesContextTestExecutionListener, org.springframework.test.context.transaction.TransactionalTestExecutionListener, org.springframework.test.context.jdbc.SqlScriptsTestExecutionListener]
12-Nov-2019 00:02:11 2019-11-12 00:02:11.004  INFO   --- [           main] .b.t.c.SpringBootTestContextBootstrapper : Using TestExecutionListeners: [org.springframework.test.context.web.ServletTestExecutionListener@77659b30, org.springframework.test.context.support.DirtiesContextBeforeModesTestExecutionListener@456d6c1e, org.springframework.boot.test.autoconfigure.SpringBootDependencyInjectionTestExecutionListener@1e13529a, org.springframework.test.context.support.DirtiesContextTestExecutionListener@1ec9bd38, org.springframework.test.context.transaction.TransactionalTestExecutionListener@452e19ca, org.springframework.test.context.jdbc.SqlScriptsTestExecutionListener@6b0d80ed, org.springframework.boot.test.mock.mockito.MockitoTestExecutionListener@6f8e8894, org.springframework.boot.test.autoconfigure.web.servlet.MockMvcPrintOnlyOnFailureTestExecutionListener@3cfdd820, org.springframework.boot.test.autoconfigure.web.client.MockRestServiceServerResetTestExecutionListener@928763c, org.springframework.boot.test.mock.mockito.ResetMocksTestExecutionListener@e25951c, org.springframework.boot.test.autoconfigure.web.servlet.WebDriverTestExecutionListener@15f47664, org.springframework.boot.test.autoconfigure.restdocs.RestDocsTestExecutionListener@471a9022]
12-Nov-2019 00:02:11 2019-11-12 00:02:11.674  INFO 20842 --- [           main] s.c.a.AnnotationConfigApplicationContext : Refreshing org.springframework.context.annotation.AnnotationConfigApplicationContext@2fa7ae9: startup date [Tue Nov 12 00:02:11 UTC 2019]; root of context hierarchy
12-Nov-2019 00:02:11 2019-11-12 00:02:11.961  INFO 20842 --- [           main] trationDelegate$BeanPostProcessorChecker : Bean 'configurationPropertiesRebinderAutoConfiguration' of type [class org.springframework.cloud.autoconfigure.ConfigurationPropertiesRebinderAutoConfiguration$$EnhancerBySpringCGLIB$$219d8b3d] is not eligible for getting processed by all BeanPostProcessors (for example: not eligible for auto-proxying)
12-Nov-2019 00:02:12
12-Nov-2019 00:02:12   .   ____          _            __ _ _
12-Nov-2019 00:02:12 /\\ / ___'_ __ _ _(_)_ __  __ _ \ \ \ \
12-Nov-2019 00:02:12 ( ( )\___ | '_ | '_| | '_ \/ _` | \ \ \ \
12-Nov-2019 00:02:12 \\/  ___)| |_)| | | | | || (_| |  ) ) ) )
12-Nov-2019 00:02:12   '  |____| .__|_| |_|_| |_\__, | / / / /
12-Nov-2019 00:02:12 =========|_|==============|___/=/_/_/_/
12-Nov-2019 00:02:12 :: Spring Boot ::        (v1.4.1.RELEASE)
12-Nov-2019 00:02:12
12-Nov-2019 00:02:12 2019-11-12 00:02:12.269  INFO 20842 --- [           main] c.c.c.ConfigServicePropertySourceLocator : Fetching config from server at: http://localhost:8888
12-Nov-2019 00:02:12 2019-11-12 00:02:12.345  WARN 20842 --- [           main] c.c.c.ConfigServicePropertySourceLocator : Could not locate PropertySource: I/O error on GET request for "http://localhost:8888//blah": Connection refused (Connection refused); nested exception is java.net.ConnectException: Connection refused (Connection refused)
12-Nov-2019 00:02:12 2019-11-12 00:02:12.352  INFO 20842 --- [           main] o.s.c.d.acceptance.test.AnalyticsTests   : The following profiles are active: blah
12-Nov-2019 00:02:12 2019-11-12 00:02:12.549  INFO 20842 --- [           main] o.s.c.d.acceptance.test.AnalyticsTests   : Started AnalyticsTests in 1.474 seconds (JVM running for 2.223)
12-Nov-2019 00:02:12 2019-11-12 00:02:12.809  INFO 20842 --- [           main] junit.logTestName                        : Starting Test analyticsTest(org.springframework.cloud.dataflow.acceptance.test.AnalyticsTests)
12-Nov-2019 00:02:12 2019-11-12 00:02:12.814  INFO 20842 --- [           main] o.s.c.d.acceptance.test.AnalyticsTests   : Importing stream apps from uri resource: https://dataflow.spring.io/kafka-maven-latest
12-Nov-2019 00:02:15 2019-11-12 00:02:15.021  INFO 20842 --- [           main] junit.logTestName                        : Finished Test analyticsTest(org.springframework.cloud.dataflow.acceptance.test.AnalyticsTests)
12-Nov-2019 00:02:15 2019-11-12 00:02:15.021  INFO 20842 --- [           main] o.s.c.d.acceptance.test.AnalyticsTests   : Destroy all streams
12-Nov-2019 00:02:15 Tests run: 1, Failures: 0, Errors: 0, Skipped: 1, Time elapsed: 4.061 sec - in org.springframework.cloud.dataflow.acceptance.test.AnalyticsTests
12-Nov-2019 00:02:15 Running org.springframework.cloud.dataflow.acceptance.test.WoodChuckTests
12-Nov-2019 00:02:15 2019-11-12 00:02:15.039  INFO 20842 --- [           main] .b.t.c.SpringBootTestContextBootstrapper : Neither @ContextConfiguration nor @ContextHierarchy found for test class [org.springframework.cloud.dataflow.acceptance.test.WoodChuckTests], using SpringBootContextLoader
12-Nov-2019 00:02:15 2019-11-12 00:02:15.046  INFO 20842 --- [           main] .b.t.c.SpringBootTestContextBootstrapper : Loaded default TestExecutionListener class names from location [META-INF/spring.factories]: [org.springframework.boot.test.mock.mockito.MockitoTestExecutionListener, org.springframework.boot.test.mock.mockito.ResetMocksTestExecutionListener, org.springframework.boot.test.autoconfigure.restdocs.RestDocsTestExecutionListener, org.springframework.boot.test.autoconfigure.web.client.MockRestServiceServerResetTestExecutionListener, org.springframework.boot.test.autoconfigure.web.servlet.MockMvcPrintOnlyOnFailureTestExecutionListener, org.springframework.boot.test.autoconfigure.web.servlet.WebDriverTestExecutionListener, org.springframework.test.context.web.ServletTestExecutionListener, org.springframework.test.context.support.DirtiesContextBeforeModesTestExecutionListener, org.springframework.test.context.support.DependencyInjectionTestExecutionListener, org.springframework.test.context.support.DirtiesContextTestExecutionListener, org.springframework.test.context.transaction.TransactionalTestExecutionListener, org.springframework.test.context.jdbc.SqlScriptsTestExecutionListener]
12-Nov-2019 00:02:15 2019-11-12 00:02:15.048  INFO 20842 --- [           main] .b.t.c.SpringBootTestContextBootstrapper : Using TestExecutionListeners: [org.springframework.test.context.web.ServletTestExecutionListener@767a014e, org.springframework.test.context.support.DirtiesContextBeforeModesTestExecutionListener@d109c4f, org.springframework.boot.test.autoconfigure.SpringBootDependencyInjectionTestExecutionListener@3968bc60, org.springframework.test.context.support.DirtiesContextTestExecutionListener@26f46fa6, org.springframework.test.context.transaction.TransactionalTestExecutionListener@227a47, org.springframework.test.context.jdbc.SqlScriptsTestExecutionListener@9596ce8, org.springframework.boot.test.mock.mockito.MockitoTestExecutionListener@75ae4a1f, org.springframework.boot.test.autoconfigure.web.servlet.MockMvcPrintOnlyOnFailureTestExecutionListener@70228253, org.springframework.boot.test.autoconfigure.web.client.MockRestServiceServerResetTestExecutionListener@63c12e52, org.springframework.boot.test.mock.mockito.ResetMocksTestExecutionListener@21bd20ee, org.springframework.boot.test.autoconfigure.web.servlet.WebDriverTestExecutionListener@26c47874, org.springframework.boot.test.autoconfigure.restdocs.RestDocsTestExecutionListener@421056e5]
12-Nov-2019 00:02:15 2019-11-12 00:02:15.122  INFO 20842 --- [           main] junit.logTestName                        : Starting Test testPartitioning(org.springframework.cloud.dataflow.acceptance.test.WoodChuckTests)
12-Nov-2019 00:02:15 2019-11-12 00:02:15.132  INFO 20842 --- [           main] o.s.c.d.acceptance.test.WoodChuckTests   : Creating stream 'WOODCHUCK-TEST'
12-Nov-2019 00:02:15 2019-11-12 00:02:15.263  INFO 20842 --- [           main] o.s.c.d.acceptance.test.WoodChuckTests   : Deploying stream 'WOODCHUCK-TEST' with properties: {app.*.spring.cloud.streamapp.security.enabled=false, app.log.logging.pattern.level=WOODCHUCK-${INSTANCE_INDEX:${CF_INSTANCE_INDEX:${spring.cloud.stream.instanceIndex:0}}} %5p, app.*.logging.file=${PID}-test.log, app.splitter.producer.partitionKeyExpression=payload, app.*.endpoints.logfile.sensitive=false, app.log.spring.cloud.stream.kafka.bindings.input.consumer.autoRebalanceEnabled=false, app.*.management.endpoints.web.exposure.include=*, deployer.log.count=2}
12-Nov-2019 00:02:17 2019-11-12 00:02:17.562  INFO 20842 --- [           main] o.s.c.d.acceptance.test.WoodChuckTests   : Checking: Stream=WOODCHUCK-TEST, status = deploying, status description = The stream is being deployed.
12-Nov-2019 00:02:17 2019-11-12 00:02:17.562  INFO 20842 --- [           main] o.s.c.d.acceptance.test.WoodChuckTests   : Sleeping to check status of Stream=WOODCHUCK-TEST
12-Nov-2019 00:02:27 2019-11-12 00:02:27.654  INFO 20842 --- [           main] o.s.c.d.acceptance.test.WoodChuckTests   : Checking: Stream=WOODCHUCK-TEST, status = deploying, status description = The stream is being deployed.
12-Nov-2019 00:02:27 2019-11-12 00:02:27.654  INFO 20842 --- [           main] o.s.c.d.acceptance.test.WoodChuckTests   : Sleeping to check status of Stream=WOODCHUCK-TEST
12-Nov-2019 00:02:37 2019-11-12 00:02:37.950  INFO 20842 --- [           main] o.s.c.d.acceptance.test.WoodChuckTests   : Checking: Stream=WOODCHUCK-TEST, status = deploying, status description = The stream is being deployed.
12-Nov-2019 00:02:37 2019-11-12 00:02:37.951  INFO 20842 --- [           main] o.s.c.d.acceptance.test.WoodChuckTests   : Sleeping to check status of Stream=WOODCHUCK-TEST
12-Nov-2019 00:02:48 2019-11-12 00:02:48.003  INFO 20842 --- [           main] o.s.c.d.acceptance.test.WoodChuckTests   : Checking: Stream=WOODCHUCK-TEST, status = deployed, status description = The stream has been successfully deployed
12-Nov-2019 00:02:48 2019-11-12 00:02:48.061  INFO 20842 --- [           main] o.s.c.d.acceptance.test.WoodChuckTests   : Sleeping to check status of Stream=WOODCHUCK-TEST
12-Nov-2019 00:02:58 2019-11-12 00:02:58.063  INFO 20842 --- [           main] o.s.c.d.acceptance.test.WoodChuckTests   : Stream 'WOODCHUCK-TEST' started with status: deployed
12-Nov-2019 00:02:58 2019-11-12 00:02:58.064  INFO 20842 --- [           main] o.s.c.d.acceptance.test.WoodChuckTests   : App 'log' has instances: {WOODCHUCK-TEST.log-v1-0=http://10.194.6.127:54266, WOODCHUCK-TEST.log-v1-1=http://10.194.6.127:56841}
12-Nov-2019 00:02:58 2019-11-12 00:02:58.064  INFO 20842 --- [           main] o.s.c.d.acceptance.test.WoodChuckTests   : App 'http' has instances: {WOODCHUCK-TEST.http-v1-0=http://10.194.6.127:58046}
12-Nov-2019 00:02:58 2019-11-12 00:02:58.064  INFO 20842 --- [           main] o.s.c.d.acceptance.test.WoodChuckTests   : App 'splitter' has instances: {WOODCHUCK-TEST.splitter-v1-0=http://10.194.6.127:42843}
12-Nov-2019 00:02:58 2019-11-12 00:02:58.064  INFO 20842 --- [           main] o.s.c.d.acceptance.test.WoodChuckTests   : Looking for 'Started HttpSource' in logfile for http
12-Nov-2019 00:03:08 2019-11-12 00:03:08.065  INFO 20842 --- [           main] o.s.c.d.acceptance.test.WoodChuckTests   : Requesting log for app WOODCHUCK-TEST.http-v1-0
12-Nov-2019 00:03:08 2019-11-12 00:03:08.408  INFO 20842 --- [           main] o.s.c.d.acceptance.test.WoodChuckTests   : Retrieved logfile from 'http://10.194.6.127:58046/actuator/logfile
12-Nov-2019 00:03:08 2019-11-12 00:03:08.412  INFO 20842 --- [           main] o.s.c.d.acceptance.test.WoodChuckTests   : Matched all 'Started HttpSource' in logfile for app http (source WOODCHUCK-TEST.http-v1-0)
12-Nov-2019 00:03:08 2019-11-12 00:03:08.413  INFO 20842 --- [           main] o.s.c.d.acceptance.test.WoodChuckTests   : Looking for 'Started SplitterProcessor' in logfile for splitter
12-Nov-2019 00:03:18 2019-11-12 00:03:18.413  INFO 20842 --- [           main] o.s.c.d.acceptance.test.WoodChuckTests   : Requesting log for app WOODCHUCK-TEST.splitter-v1-0
12-Nov-2019 00:03:18 2019-11-12 00:03:18.592  INFO 20842 --- [           main] o.s.c.d.acceptance.test.WoodChuckTests   : Retrieved logfile from 'http://10.194.6.127:42843/actuator/logfile
12-Nov-2019 00:03:18 2019-11-12 00:03:18.593  INFO 20842 --- [           main] o.s.c.d.acceptance.test.WoodChuckTests   : Matched all 'Started SplitterProcessor' in logfile for app splitter (source WOODCHUCK-TEST.splitter-v1-0)
12-Nov-2019 00:03:18 2019-11-12 00:03:18.593  INFO 20842 --- [           main] o.s.c.d.acceptance.test.WoodChuckTests   : Looking for 'Started LogSink' in logfile for log
12-Nov-2019 00:03:28 2019-11-12 00:03:28.594  INFO 20842 --- [           main] o.s.c.d.acceptance.test.WoodChuckTests   : Requesting log for app WOODCHUCK-TEST.log-v1-0
12-Nov-2019 00:03:28 2019-11-12 00:03:28.911  INFO 20842 --- [           main] o.s.c.d.acceptance.test.WoodChuckTests   : Retrieved logfile from 'http://10.194.6.127:54266/actuator/logfile
12-Nov-2019 00:03:28 2019-11-12 00:03:28.912  INFO 20842 --- [           main] o.s.c.d.acceptance.test.WoodChuckTests   : Requesting log for app WOODCHUCK-TEST.log-v1-1
12-Nov-2019 00:03:29 2019-11-12 00:03:29.191  INFO 20842 --- [           main] o.s.c.d.acceptance.test.WoodChuckTests   : Retrieved logfile from 'http://10.194.6.127:56841/actuator/logfile
12-Nov-2019 00:03:29 2019-11-12 00:03:29.192  INFO 20842 --- [           main] o.s.c.d.acceptance.test.WoodChuckTests   : Matched all 'Started LogSink' in logfile for app log (source WOODCHUCK-TEST.log-v1-0)
12-Nov-2019 00:03:29 2019-11-12 00:03:29.376  INFO 20842 --- [           main] o.s.c.d.acceptance.test.WoodChuckTests   : Looking for 'WOODCHUCK-0,How,chuck' in logfile for log
12-Nov-2019 00:03:39 2019-11-12 00:03:39.377  INFO 20842 --- [           main] o.s.c.d.acceptance.test.WoodChuckTests   : Requesting log for app WOODCHUCK-TEST.log-v1-0
12-Nov-2019 00:03:39 2019-11-12 00:03:39.396  INFO 20842 --- [           main] o.s.c.d.acceptance.test.WoodChuckTests   : Retrieved logfile from 'http://10.194.6.127:54266/actuator/logfile
12-Nov-2019 00:03:39 2019-11-12 00:03:39.396  INFO 20842 --- [           main] o.s.c.d.acceptance.test.WoodChuckTests   : Requesting log for app WOODCHUCK-TEST.log-v1-1
12-Nov-2019 00:03:39 2019-11-12 00:03:39.406  INFO 20842 --- [           main] o.s.c.d.acceptance.test.WoodChuckTests   : Retrieved logfile from 'http://10.194.6.127:56841/actuator/logfile
12-Nov-2019 00:03:39 2019-11-12 00:03:39.407  INFO 20842 --- [           main] o.s.c.d.acceptance.test.WoodChuckTests   : Matched all 'WOODCHUCK-0,How,chuck' in logfile for app log (source WOODCHUCK-TEST.log-v1-0)
12-Nov-2019 00:03:39 2019-11-12 00:03:39.410  INFO 20842 --- [           main] o.s.c.d.acceptance.test.WoodChuckTests   : Looking for 'WOODCHUCK-1,much,wood,would,if,a,woodchuck,could' in logfile for log
12-Nov-2019 00:03:49 2019-11-12 00:03:49.411  INFO 20842 --- [           main] o.s.c.d.acceptance.test.WoodChuckTests   : Requesting log for app WOODCHUCK-TEST.log-v1-0
12-Nov-2019 00:03:49 2019-11-12 00:03:49.430  INFO 20842 --- [           main] o.s.c.d.acceptance.test.WoodChuckTests   : Retrieved logfile from 'http://10.194.6.127:54266/actuator/logfile
12-Nov-2019 00:03:49 2019-11-12 00:03:49.430  INFO 20842 --- [           main] o.s.c.d.acceptance.test.WoodChuckTests   : Requesting log for app WOODCHUCK-TEST.log-v1-1
12-Nov-2019 00:03:49 2019-11-12 00:03:49.442  INFO 20842 --- [           main] o.s.c.d.acceptance.test.WoodChuckTests   : Retrieved logfile from 'http://10.194.6.127:56841/actuator/logfile
12-Nov-2019 00:03:49 2019-11-12 00:03:49.443  INFO 20842 --- [           main] o.s.c.d.acceptance.test.WoodChuckTests   : Matched all 'WOODCHUCK-1,much,wood,would,if,a,woodchuck,could' in logfile for app log (source WOODCHUCK-TEST.log-v1-1)
12-Nov-2019 00:03:49 2019-11-12 00:03:49.444  INFO 20842 --- [           main] junit.logTestName                        : Test testPartitioning(org.springframework.cloud.dataflow.acceptance.test.WoodChuckTests) Succeeded
12-Nov-2019 00:03:49 2019-11-12 00:03:49.444  INFO 20842 --- [           main] junit.logTestName                        : Finished Test testPartitioning(org.springframework.cloud.dataflow.acceptance.test.WoodChuckTests)
12-Nov-2019 00:03:49 2019-11-12 00:03:49.444  INFO 20842 --- [           main] o.s.c.d.acceptance.test.WoodChuckTests   : Destroy all streams
12-Nov-2019 00:03:49 Tests run: 1, Failures: 0, Errors: 0, Skipped: 0, Time elapsed: 94.724 sec - in org.springframework.cloud.dataflow.acceptance.test.WoodChuckTests
12-Nov-2019 00:03:49 Running org.springframework.cloud.dataflow.acceptance.test.HttpSourceTests
12-Nov-2019 00:03:49 2019-11-12 00:03:49.831  INFO 20842 --- [           main] .b.t.c.SpringBootTestContextBootstrapper : Neither @ContextConfiguration nor @ContextHierarchy found for test class [org.springframework.cloud.dataflow.acceptance.test.HttpSourceTests], using SpringBootContextLoader
12-Nov-2019 00:03:49 2019-11-12 00:03:49.848  INFO 20842 --- [           main] .b.t.c.SpringBootTestContextBootstrapper : Loaded default TestExecutionListener class names from location [META-INF/spring.factories]: [org.springframework.boot.test.mock.mockito.MockitoTestExecutionListener, org.springframework.boot.test.mock.mockito.ResetMocksTestExecutionListener, org.springframework.boot.test.autoconfigure.restdocs.RestDocsTestExecutionListener, org.springframework.boot.test.autoconfigure.web.client.MockRestServiceServerResetTestExecutionListener, org.springframework.boot.test.autoconfigure.web.servlet.MockMvcPrintOnlyOnFailureTestExecutionListener, org.springframework.boot.test.autoconfigure.web.servlet.WebDriverTestExecutionListener, org.springframework.test.context.web.ServletTestExecutionListener, org.springframework.test.context.support.DirtiesContextBeforeModesTestExecutionListener, org.springframework.test.context.support.DependencyInjectionTestExecutionListener, org.springframework.test.context.support.DirtiesContextTestExecutionListener, org.springframework.test.context.transaction.TransactionalTestExecutionListener, org.springframework.test.context.jdbc.SqlScriptsTestExecutionListener]
12-Nov-2019 00:03:49 2019-11-12 00:03:49.851  INFO 20842 --- [           main] .b.t.c.SpringBootTestContextBootstrapper : Using TestExecutionListeners: [org.springframework.test.context.web.ServletTestExecutionListener@127a7272, org.springframework.test.context.support.DirtiesContextBeforeModesTestExecutionListener@ff23ae7, org.springframework.boot.test.autoconfigure.SpringBootDependencyInjectionTestExecutionListener@423b2b62, org.springframework.test.context.support.DirtiesContextTestExecutionListener@2b7962a2, org.springframework.test.context.transaction.TransactionalTestExecutionListener@6ad16c5d, org.springframework.test.context.jdbc.SqlScriptsTestExecutionListener@74ea46e2, org.springframework.boot.test.mock.mockito.MockitoTestExecutionListener@6f911326, org.springframework.boot.test.autoconfigure.web.servlet.MockMvcPrintOnlyOnFailureTestExecutionListener@f1d0004, org.springframework.boot.test.autoconfigure.web.client.MockRestServiceServerResetTestExecutionListener@6e4f263e, org.springframework.boot.test.mock.mockito.ResetMocksTestExecutionListener@48b4a043, org.springframework.boot.test.autoconfigure.web.servlet.WebDriverTestExecutionListener@2f5b8250, org.springframework.boot.test.autoconfigure.restdocs.RestDocsTestExecutionListener@4821aa9f]
12-Nov-2019 00:03:49 2019-11-12 00:03:49.946  INFO 20842 --- [           main] junit.logTestName                        : Starting Test httpSourceTests(org.springframework.cloud.dataflow.acceptance.test.HttpSourceTests)
12-Nov-2019 00:03:49 2019-11-12 00:03:49.948  INFO 20842 --- [           main] o.s.c.d.acceptance.test.HttpSourceTests  : Creating stream 'HTTP-TEST'
12-Nov-2019 00:03:49 2019-11-12 00:03:49.978  INFO 20842 --- [           main] o.s.c.d.acceptance.test.HttpSourceTests  : Deploying stream 'HTTP-TEST' with properties: {app.*.spring.cloud.streamapp.security.enabled=false, app.*.logging.file=${PID}-test.log, app.*.endpoints.logfile.sensitive=false, app.*.management.endpoints.web.exposure.include=*}
12-Nov-2019 00:03:50 2019-11-12 00:03:50.690  INFO 20842 --- [           main] o.s.c.d.acceptance.test.HttpSourceTests  : Checking: Stream=HTTP-TEST, status = deploying, status description = The stream is being deployed.
12-Nov-2019 00:03:50 2019-11-12 00:03:50.690  INFO 20842 --- [           main] o.s.c.d.acceptance.test.HttpSourceTests  : Sleeping to check status of Stream=HTTP-TEST
12-Nov-2019 00:04:00 2019-11-12 00:04:00.750  INFO 20842 --- [           main] o.s.c.d.acceptance.test.HttpSourceTests  : Checking: Stream=HTTP-TEST, status = deploying, status description = The stream is being deployed.
12-Nov-2019 00:04:00 2019-11-12 00:04:00.750  INFO 20842 --- [           main] o.s.c.d.acceptance.test.HttpSourceTests  : Sleeping to check status of Stream=HTTP-TEST
12-Nov-2019 00:04:10 2019-11-12 00:04:10.795  INFO 20842 --- [           main] o.s.c.d.acceptance.test.HttpSourceTests  : Checking: Stream=HTTP-TEST, status = deployed, status description = The stream has been successfully deployed
12-Nov-2019 00:04:10 2019-11-12 00:04:10.841  INFO 20842 --- [           main] o.s.c.d.acceptance.test.HttpSourceTests  : Sleeping to check status of Stream=HTTP-TEST
12-Nov-2019 00:04:20 2019-11-12 00:04:20.842  INFO 20842 --- [           main] o.s.c.d.acceptance.test.HttpSourceTests  : Stream 'HTTP-TEST' started with status: deployed
12-Nov-2019 00:04:20 2019-11-12 00:04:20.843  INFO 20842 --- [           main] o.s.c.d.acceptance.test.HttpSourceTests  : App 'log' has instances: {HTTP-TEST.log-v1-0=http://10.194.6.127:58343}
12-Nov-2019 00:04:20 2019-11-12 00:04:20.843  INFO 20842 --- [           main] o.s.c.d.acceptance.test.HttpSourceTests  : App 'http' has instances: {HTTP-TEST.http-v1-0=http://10.194.6.127:37487}
12-Nov-2019 00:04:20 2019-11-12 00:04:20.856  INFO 20842 --- [           main] o.s.c.d.acceptance.test.HttpSourceTests  : Looking for 'Started HttpSource' in logfile for http
12-Nov-2019 00:04:30 2019-11-12 00:04:30.856  INFO 20842 --- [           main] o.s.c.d.acceptance.test.HttpSourceTests  : Requesting log for app HTTP-TEST.http-v1-0
12-Nov-2019 00:04:31 2019-11-12 00:04:31.203  INFO 20842 --- [           main] o.s.c.d.acceptance.test.HttpSourceTests  : Retrieved logfile from 'http://10.194.6.127:37487/actuator/logfile
12-Nov-2019 00:04:31 2019-11-12 00:04:31.203  INFO 20842 --- [           main] o.s.c.d.acceptance.test.HttpSourceTests  : Matched all 'Started HttpSource' in logfile for app http (source HTTP-TEST.http-v1-0)
12-Nov-2019 00:04:31 2019-11-12 00:04:31.203  INFO 20842 --- [           main] o.s.c.d.acceptance.test.HttpSourceTests  : Looking for 'Started LogSink' in logfile for log
12-Nov-2019 00:04:41 2019-11-12 00:04:41.204  INFO 20842 --- [           main] o.s.c.d.acceptance.test.HttpSourceTests  : Requesting log for app HTTP-TEST.log-v1-0
12-Nov-2019 00:04:41 2019-11-12 00:04:41.325  INFO 20842 --- [           main] o.s.c.d.acceptance.test.HttpSourceTests  : Retrieved logfile from 'http://10.194.6.127:58343/actuator/logfile
12-Nov-2019 00:04:41 2019-11-12 00:04:41.325  INFO 20842 --- [           main] o.s.c.d.acceptance.test.HttpSourceTests  : Matched all 'Started LogSink' in logfile for app log (source HTTP-TEST.log-v1-0)
12-Nov-2019 00:04:41 2019-11-12 00:04:41.490  INFO 20842 --- [           main] o.s.c.d.acceptance.test.HttpSourceTests  : Looking for '3cfb7483-a096-4097-9393-aeb39e76fdc3' in logfile for log
12-Nov-2019 00:04:51 2019-11-12 00:04:51.491  INFO 20842 --- [           main] o.s.c.d.acceptance.test.HttpSourceTests  : Requesting log for app HTTP-TEST.log-v1-0
12-Nov-2019 00:04:51 2019-11-12 00:04:51.509  INFO 20842 --- [           main] o.s.c.d.acceptance.test.HttpSourceTests  : Retrieved logfile from 'http://10.194.6.127:58343/actuator/logfile
12-Nov-2019 00:04:51 2019-11-12 00:04:51.509  INFO 20842 --- [           main] o.s.c.d.acceptance.test.HttpSourceTests  : Matched all '3cfb7483-a096-4097-9393-aeb39e76fdc3' in logfile for app log (source HTTP-TEST.log-v1-0)
12-Nov-2019 00:04:51 2019-11-12 00:04:51.511  INFO 20842 --- [           main] junit.logTestName                        : Test httpSourceTests(org.springframework.cloud.dataflow.acceptance.test.HttpSourceTests) Succeeded
12-Nov-2019 00:04:51 2019-11-12 00:04:51.512  INFO 20842 --- [           main] junit.logTestName                        : Finished Test httpSourceTests(org.springframework.cloud.dataflow.acceptance.test.HttpSourceTests)
12-Nov-2019 00:04:51 2019-11-12 00:04:51.512  INFO 20842 --- [           main] o.s.c.d.acceptance.test.HttpSourceTests  : Destroy all streams
12-Nov-2019 00:04:51 Tests run: 1, Failures: 0, Errors: 0, Skipped: 0, Time elapsed: 61.896 sec - in org.springframework.cloud.dataflow.acceptance.test.HttpSourceTests
12-Nov-2019 00:04:51 Running org.springframework.cloud.dataflow.acceptance.test.TimestampTaskTests
12-Nov-2019 00:04:51 2019-11-12 00:04:51.734  INFO 20842 --- [           main] o.s.c.support.GenericApplicationContext  : Refreshing org.springframework.context.support.GenericApplicationContext@2eeb0f9b: startup date [Tue Nov 12 00:04:51 UTC 2019]; root of context hierarchy
12-Nov-2019 00:04:51 2019-11-12 00:04:51.873  INFO 20842 --- [           main] junit.logTestName                        : Starting Test timeStampTests(org.springframework.cloud.dataflow.acceptance.test.TimestampTaskTests)
12-Nov-2019 00:04:51 2019-11-12 00:04:51.874  INFO 20842 --- [           main] o.s.c.d.a.test.AbstractTaskTests         : Importing task apps from uri resource: https://dataflow.spring.io/task-maven-latest
12-Nov-2019 00:04:52 2019-11-12 00:04:52.431  INFO 20842 --- [           main] o.s.c.d.a.test.AbstractTaskTests         : Done importing task apps.
12-Nov-2019 00:05:02 2019-11-12 00:05:02.852  INFO 20842 --- [           main] junit.logTestName                        : Test timeStampTests(org.springframework.cloud.dataflow.acceptance.test.TimestampTaskTests) Succeeded
12-Nov-2019 00:05:02 2019-11-12 00:05:02.852  INFO 20842 --- [           main] junit.logTestName                        : Finished Test timeStampTests(org.springframework.cloud.dataflow.acceptance.test.TimestampTaskTests)
12-Nov-2019 00:05:02 2019-11-12 00:05:02.937  INFO 20842 --- [           main] junit.logTestName                        : Starting Test timeStampTestsMultipleLaunch(org.springframework.cloud.dataflow.acceptance.test.TimestampTaskTests)
12-Nov-2019 00:05:23 2019-11-12 00:05:23.467  INFO 20842 --- [           main] junit.logTestName                        : Test timeStampTestsMultipleLaunch(org.springframework.cloud.dataflow.acceptance.test.TimestampTaskTests) Succeeded
12-Nov-2019 00:05:23 2019-11-12 00:05:23.468  INFO 20842 --- [           main] junit.logTestName                        : Finished Test timeStampTestsMultipleLaunch(org.springframework.cloud.dataflow.acceptance.test.TimestampTaskTests)
12-Nov-2019 00:05:23 Tests run: 2, Failures: 0, Errors: 0, Skipped: 0, Time elapsed: 31.741 sec - in org.springframework.cloud.dataflow.acceptance.test.TimestampTaskTests
12-Nov-2019 00:05:23 Running org.springframework.cloud.dataflow.acceptance.test.TickTockTests
12-Nov-2019 00:05:23 2019-11-12 00:05:23.475  INFO 20842 --- [           main] .b.t.c.SpringBootTestContextBootstrapper : Neither @ContextConfiguration nor @ContextHierarchy found for test class [org.springframework.cloud.dataflow.acceptance.test.TickTockTests], using SpringBootContextLoader
12-Nov-2019 00:05:23 2019-11-12 00:05:23.481  INFO 20842 --- [           main] .b.t.c.SpringBootTestContextBootstrapper : Loaded default TestExecutionListener class names from location [META-INF/spring.factories]: [org.springframework.boot.test.mock.mockito.MockitoTestExecutionListener, org.springframework.boot.test.mock.mockito.ResetMocksTestExecutionListener, org.springframework.boot.test.autoconfigure.restdocs.RestDocsTestExecutionListener, org.springframework.boot.test.autoconfigure.web.client.MockRestServiceServerResetTestExecutionListener, org.springframework.boot.test.autoconfigure.web.servlet.MockMvcPrintOnlyOnFailureTestExecutionListener, org.springframework.boot.test.autoconfigure.web.servlet.WebDriverTestExecutionListener, org.springframework.test.context.web.ServletTestExecutionListener, org.springframework.test.context.support.DirtiesContextBeforeModesTestExecutionListener, org.springframework.test.context.support.DependencyInjectionTestExecutionListener, org.springframework.test.context.support.DirtiesContextTestExecutionListener, org.springframework.test.context.transaction.TransactionalTestExecutionListener, org.springframework.test.context.jdbc.SqlScriptsTestExecutionListener]
12-Nov-2019 00:05:23 2019-11-12 00:05:23.484  INFO 20842 --- [           main] .b.t.c.SpringBootTestContextBootstrapper : Using TestExecutionListeners: [org.springframework.test.context.web.ServletTestExecutionListener@4c5228e7, org.springframework.test.context.support.DirtiesContextBeforeModesTestExecutionListener@38e7ed69, org.springframework.boot.test.autoconfigure.SpringBootDependencyInjectionTestExecutionListener@806996, org.springframework.test.context.support.DirtiesContextTestExecutionListener@78b612c6, org.springframework.test.context.transaction.TransactionalTestExecutionListener@257e0827, org.springframework.test.context.jdbc.SqlScriptsTestExecutionListener@22752544, org.springframework.boot.test.mock.mockito.MockitoTestExecutionListener@21ba2445, org.springframework.boot.test.autoconfigure.web.servlet.MockMvcPrintOnlyOnFailureTestExecutionListener@69d23296, org.springframework.boot.test.autoconfigure.web.client.MockRestServiceServerResetTestExecutionListener@3c3820bb, org.springframework.boot.test.mock.mockito.ResetMocksTestExecutionListener@376c7d7d, org.springframework.boot.test.autoconfigure.web.servlet.WebDriverTestExecutionListener@4784efd9, org.springframework.boot.test.autoconfigure.restdocs.RestDocsTestExecutionListener@3fba233d]
12-Nov-2019 00:05:23 2019-11-12 00:05:23.564  INFO 20842 --- [           main] junit.logTestName                        : Starting Test tickTockUpdateRollbackTests(org.springframework.cloud.dataflow.acceptance.test.TickTockTests)
12-Nov-2019 00:05:23 2019-11-12 00:05:23.587  INFO 20842 --- [           main] o.s.c.d.acceptance.test.TickTockTests    : Creating stream 'TICKTOCK'
12-Nov-2019 00:05:23 2019-11-12 00:05:23.618  INFO 20842 --- [           main] o.s.c.d.acceptance.test.TickTockTests    : Deploying stream 'TICKTOCK' with properties: {app.*.spring.cloud.streamapp.security.enabled=false, app.*.logging.file=${PID}-test.log, app.*.endpoints.logfile.sensitive=false, app.log.log.expression='TICKTOCK - TIMESTAMP: '.concat(payload), app.*.management.endpoints.web.exposure.include=*}
12-Nov-2019 00:05:24 2019-11-12 00:05:24.184  INFO 20842 --- [           main] o.s.c.d.acceptance.test.TickTockTests    : Checking: Stream=TICKTOCK, status = deploying, status description = The stream is being deployed.
12-Nov-2019 00:05:24 2019-11-12 00:05:24.184  INFO 20842 --- [           main] o.s.c.d.acceptance.test.TickTockTests    : Sleeping to check status of Stream=TICKTOCK
12-Nov-2019 00:05:34 2019-11-12 00:05:34.232  INFO 20842 --- [           main] o.s.c.d.acceptance.test.TickTockTests    : Checking: Stream=TICKTOCK, status = deploying, status description = The stream is being deployed.
12-Nov-2019 00:05:34 2019-11-12 00:05:34.232  INFO 20842 --- [           main] o.s.c.d.acceptance.test.TickTockTests    : Sleeping to check status of Stream=TICKTOCK
12-Nov-2019 00:05:44 2019-11-12 00:05:44.284  INFO 20842 --- [           main] o.s.c.d.acceptance.test.TickTockTests    : Checking: Stream=TICKTOCK, status = deployed, status description = The stream has been successfully deployed
12-Nov-2019 00:05:44 2019-11-12 00:05:44.316  INFO 20842 --- [           main] o.s.c.d.acceptance.test.TickTockTests    : Sleeping to check status of Stream=TICKTOCK
12-Nov-2019 00:05:54 2019-11-12 00:05:54.317  INFO 20842 --- [           main] o.s.c.d.acceptance.test.TickTockTests    : Stream 'TICKTOCK' started with status: deployed
12-Nov-2019 00:05:54 2019-11-12 00:05:54.317  INFO 20842 --- [           main] o.s.c.d.acceptance.test.TickTockTests    : App 'log' has instances: {TICKTOCK.log-v1-0=http://10.194.6.127:43740}
12-Nov-2019 00:05:54 2019-11-12 00:05:54.317  INFO 20842 --- [           main] o.s.c.d.acceptance.test.TickTockTests    : App 'time' has instances: {TICKTOCK.time-v1-0=http://10.194.6.127:58581}
12-Nov-2019 00:05:54 2019-11-12 00:05:54.317  INFO 20842 --- [           main] o.s.c.d.acceptance.test.TickTockTests    : Looking for 'Started TimeSource' in logfile for time
12-Nov-2019 00:06:04 2019-11-12 00:06:04.318  INFO 20842 --- [           main] o.s.c.d.acceptance.test.TickTockTests    : Requesting log for app TICKTOCK.time-v1-0
12-Nov-2019 00:06:04 2019-11-12 00:06:04.612  INFO 20842 --- [           main] o.s.c.d.acceptance.test.TickTockTests    : Retrieved logfile from 'http://10.194.6.127:58581/actuator/logfile
12-Nov-2019 00:06:04 2019-11-12 00:06:04.612  INFO 20842 --- [           main] o.s.c.d.acceptance.test.TickTockTests    : Matched all 'Started TimeSource' in logfile for app time (source TICKTOCK.time-v1-0)
12-Nov-2019 00:06:04 2019-11-12 00:06:04.612  INFO 20842 --- [           main] o.s.c.d.acceptance.test.TickTockTests    : Looking for 'Started LogSink' in logfile for log
12-Nov-2019 00:06:14 2019-11-12 00:06:14.612  INFO 20842 --- [           main] o.s.c.d.acceptance.test.TickTockTests    : Requesting log for app TICKTOCK.log-v1-0
12-Nov-2019 00:06:14 2019-11-12 00:06:14.752  INFO 20842 --- [           main] o.s.c.d.acceptance.test.TickTockTests    : Retrieved logfile from 'http://10.194.6.127:43740/actuator/logfile
12-Nov-2019 00:06:14 2019-11-12 00:06:14.752  INFO 20842 --- [           main] o.s.c.d.acceptance.test.TickTockTests    : Matched all 'Started LogSink' in logfile for app log (source TICKTOCK.log-v1-0)
12-Nov-2019 00:06:14 2019-11-12 00:06:14.752  INFO 20842 --- [           main] o.s.c.d.acceptance.test.TickTockTests    : Looking for 'TICKTOCK - TIMESTAMP:' in logfile for log
12-Nov-2019 00:06:24 2019-11-12 00:06:24.752  INFO 20842 --- [           main] o.s.c.d.acceptance.test.TickTockTests    : Requesting log for app TICKTOCK.log-v1-0
12-Nov-2019 00:06:24 2019-11-12 00:06:24.765  INFO 20842 --- [           main] o.s.c.d.acceptance.test.TickTockTests    : Retrieved logfile from 'http://10.194.6.127:43740/actuator/logfile
12-Nov-2019 00:06:24 2019-11-12 00:06:24.766  INFO 20842 --- [           main] o.s.c.d.acceptance.test.TickTockTests    : Matched all 'TICKTOCK - TIMESTAMP:' in logfile for app log (source TICKTOCK.log-v1-0)
12-Nov-2019 00:06:24 2019-11-12 00:06:24.767  INFO 20842 --- [           main] o.s.c.d.acceptance.test.TickTockTests    : Updating stream 'TICKTOCK'
12-Nov-2019 00:06:25 2019-11-12 00:06:25.419  INFO 20842 --- [           main] o.s.c.d.acceptance.test.TickTockTests    : Checking: Stream=TICKTOCK, status = deploying, status description = The stream is being deployed.
12-Nov-2019 00:06:25 2019-11-12 00:06:25.420  INFO 20842 --- [           main] o.s.c.d.acceptance.test.TickTockTests    : Sleeping to check status of Stream=TICKTOCK
12-Nov-2019 00:06:35 2019-11-12 00:06:35.469  INFO 20842 --- [           main] o.s.c.d.acceptance.test.TickTockTests    : Checking: Stream=TICKTOCK, status = deployed, status description = The stream has been successfully deployed
12-Nov-2019 00:06:35 2019-11-12 00:06:35.502  INFO 20842 --- [           main] o.s.c.d.acceptance.test.TickTockTests    : Sleeping to check status of Stream=TICKTOCK
12-Nov-2019 00:06:45 2019-11-12 00:06:45.503  INFO 20842 --- [           main] o.s.c.d.acceptance.test.TickTockTests    : Stream 'TICKTOCK' started with status: deployed
12-Nov-2019 00:06:45 2019-11-12 00:06:45.504  INFO 20842 --- [           main] o.s.c.d.acceptance.test.TickTockTests    : App 'log' has instances: {TICKTOCK.log-v1-0=http://10.194.6.127:43740, TICKTOCK.log-v2-0=http://10.194.6.127:47007}
12-Nov-2019 00:06:45 2019-11-12 00:06:45.504  INFO 20842 --- [           main] o.s.c.d.acceptance.test.TickTockTests    : App 'time' has instances: {TICKTOCK.time-v1-0=http://10.194.6.127:58581}
12-Nov-2019 00:06:45 2019-11-12 00:06:45.504  INFO 20842 --- [           main] o.s.c.d.acceptance.test.TickTockTests    : Looking for 'Started LogSink' in logfile for log
12-Nov-2019 00:06:55 2019-11-12 00:06:55.504  INFO 20842 --- [           main] o.s.c.d.acceptance.test.TickTockTests    : Requesting log for app TICKTOCK.log-v1-0
12-Nov-2019 00:06:55 2019-11-12 00:06:55.507  WARN 20842 --- [           main] o.s.c.d.acceptance.test.TickTockTests    : Error while trying to access logfile from 'http://10.194.6.127:43740/logfile' due to : org.springframework.web.client.ResourceAccessException: I/O error on GET request for "http://10.194.6.127:43740/logfile": Connection refused (Connection refused); nested exception is java.net.ConnectException: Connection refused (Connection refused)
12-Nov-2019 00:06:55 2019-11-12 00:06:55.507  INFO 20842 --- [           main] o.s.c.d.acceptance.test.TickTockTests    : Requesting log for app TICKTOCK.log-v2-0
12-Nov-2019 00:06:55 2019-11-12 00:06:55.654  INFO 20842 --- [           main] o.s.c.d.acceptance.test.TickTockTests    : Retrieved logfile from 'http://10.194.6.127:47007/actuator/logfile
12-Nov-2019 00:06:55 2019-11-12 00:06:55.654  INFO 20842 --- [           main] o.s.c.d.acceptance.test.TickTockTests    : Matched all 'Started LogSink' in logfile for app log (source TICKTOCK.log-v2-0)
12-Nov-2019 00:06:55 2019-11-12 00:06:55.654  INFO 20842 --- [           main] o.s.c.d.acceptance.test.TickTockTests    : Looking for 'TICKTOCK Updated - TIMESTAMP:' in logfile for log
12-Nov-2019 00:07:05 2019-11-12 00:07:05.654  INFO 20842 --- [           main] o.s.c.d.acceptance.test.TickTockTests    : Requesting log for app TICKTOCK.log-v1-0
12-Nov-2019 00:07:05 2019-11-12 00:07:05.656  WARN 20842 --- [           main] o.s.c.d.acceptance.test.TickTockTests    : Error while trying to access logfile from 'http://10.194.6.127:43740/logfile' due to : org.springframework.web.client.ResourceAccessException: I/O error on GET request for "http://10.194.6.127:43740/logfile": Connection refused (Connection refused); nested exception is java.net.ConnectException: Connection refused (Connection refused)
12-Nov-2019 00:07:05 2019-11-12 00:07:05.657  INFO 20842 --- [           main] o.s.c.d.acceptance.test.TickTockTests    : Requesting log for app TICKTOCK.log-v2-0
12-Nov-2019 00:07:05 2019-11-12 00:07:05.673  INFO 20842 --- [           main] o.s.c.d.acceptance.test.TickTockTests    : Retrieved logfile from 'http://10.194.6.127:47007/actuator/logfile
12-Nov-2019 00:07:05 2019-11-12 00:07:05.673  INFO 20842 --- [           main] o.s.c.d.acceptance.test.TickTockTests    : Matched all 'TICKTOCK Updated - TIMESTAMP:' in logfile for app log (source TICKTOCK.log-v2-0)
12-Nov-2019 00:07:05 2019-11-12 00:07:05.674  INFO 20842 --- [           main] o.s.c.d.acceptance.test.TickTockTests    : Rolling back the stream 'TICKTOCK' to the version 0
12-Nov-2019 00:07:06 2019-11-12 00:07:06.102  INFO 20842 --- [           main] o.s.c.d.acceptance.test.TickTockTests    : Checking: Stream=TICKTOCK, status = deploying, status description = The stream is being deployed.
12-Nov-2019 00:07:06 2019-11-12 00:07:06.102  INFO 20842 --- [           main] o.s.c.d.acceptance.test.TickTockTests    : Sleeping to check status of Stream=TICKTOCK
12-Nov-2019 00:07:16 2019-11-12 00:07:16.147  INFO 20842 --- [           main] o.s.c.d.acceptance.test.TickTockTests    : Checking: Stream=TICKTOCK, status = deployed, status description = The stream has been successfully deployed
12-Nov-2019 00:07:16 2019-11-12 00:07:16.172  INFO 20842 --- [           main] o.s.c.d.acceptance.test.TickTockTests    : Sleeping to check status of Stream=TICKTOCK
12-Nov-2019 00:07:26 2019-11-12 00:07:26.173  INFO 20842 --- [           main] o.s.c.d.acceptance.test.TickTockTests    : Stream 'TICKTOCK' started with status: deployed
12-Nov-2019 00:07:26 2019-11-12 00:07:26.174  INFO 20842 --- [           main] o.s.c.d.acceptance.test.TickTockTests    : App 'log' has instances: {TICKTOCK.log-v1-0=http://10.194.6.127:43740, TICKTOCK.log-v3-0=http://10.194.6.127:53570, TICKTOCK.log-v2-0=http://10.194.6.127:47007}
12-Nov-2019 00:07:26 2019-11-12 00:07:26.174  INFO 20842 --- [           main] o.s.c.d.acceptance.test.TickTockTests    : App 'time' has instances: {TICKTOCK.time-v1-0=http://10.194.6.127:58581}
12-Nov-2019 00:07:26 2019-11-12 00:07:26.174  INFO 20842 --- [           main] o.s.c.d.acceptance.test.TickTockTests    : Looking for 'TICKTOCK - TIMESTAMP:' in logfile for log
12-Nov-2019 00:07:36 2019-11-12 00:07:36.174  INFO 20842 --- [           main] o.s.c.d.acceptance.test.TickTockTests    : Requesting log for app TICKTOCK.log-v1-0
12-Nov-2019 00:07:36 2019-11-12 00:07:36.177  WARN 20842 --- [           main] o.s.c.d.acceptance.test.TickTockTests    : Error while trying to access logfile from 'http://10.194.6.127:43740/logfile' due to : org.springframework.web.client.ResourceAccessException: I/O error on GET request for "http://10.194.6.127:43740/logfile": Connection refused (Connection refused); nested exception is java.net.ConnectException: Connection refused (Connection refused)
12-Nov-2019 00:07:36 2019-11-12 00:07:36.177  INFO 20842 --- [           main] o.s.c.d.acceptance.test.TickTockTests    : Requesting log for app TICKTOCK.log-v3-0
12-Nov-2019 00:07:36 2019-11-12 00:07:36.320  INFO 20842 --- [           main] o.s.c.d.acceptance.test.TickTockTests    : Retrieved logfile from 'http://10.194.6.127:53570/actuator/logfile
12-Nov-2019 00:07:36 2019-11-12 00:07:36.321  INFO 20842 --- [           main] o.s.c.d.acceptance.test.TickTockTests    : Requesting log for app TICKTOCK.log-v2-0
12-Nov-2019 00:07:36 2019-11-12 00:07:36.322  WARN 20842 --- [           main] o.s.c.d.acceptance.test.TickTockTests    : Error while trying to access logfile from 'http://10.194.6.127:47007/logfile' due to : org.springframework.web.client.ResourceAccessException: I/O error on GET request for "http://10.194.6.127:47007/logfile": Connection refused (Connection refused); nested exception is java.net.ConnectException: Connection refused (Connection refused)
12-Nov-2019 00:07:36 2019-11-12 00:07:36.322  INFO 20842 --- [           main] o.s.c.d.acceptance.test.TickTockTests    : Matched all 'TICKTOCK - TIMESTAMP:' in logfile for app log (source TICKTOCK.log-v3-0)
12-Nov-2019 00:07:36 2019-11-12 00:07:36.323  INFO 20842 --- [           main] junit.logTestName                        : Test tickTockUpdateRollbackTests(org.springframework.cloud.dataflow.acceptance.test.TickTockTests) Succeeded
12-Nov-2019 00:07:36 2019-11-12 00:07:36.323  INFO 20842 --- [           main] junit.logTestName                        : Finished Test tickTockUpdateRollbackTests(org.springframework.cloud.dataflow.acceptance.test.TickTockTests)
12-Nov-2019 00:07:36 2019-11-12 00:07:36.323  INFO 20842 --- [           main] o.s.c.d.acceptance.test.TickTockTests    : Destroy all streams
12-Nov-2019 00:07:36 2019-11-12 00:07:36.588  INFO 20842 --- [           main] junit.logTestName                        : Starting Test tickTockTests(org.springframework.cloud.dataflow.acceptance.test.TickTockTests)
12-Nov-2019 00:07:36 2019-11-12 00:07:36.590  INFO 20842 --- [           main] o.s.c.d.acceptance.test.TickTockTests    : Creating stream 'TICKTOCK'
12-Nov-2019 00:07:36 2019-11-12 00:07:36.645  INFO 20842 --- [           main] o.s.c.d.acceptance.test.TickTockTests    : Deploying stream 'TICKTOCK' with properties: {app.*.spring.cloud.streamapp.security.enabled=false, app.*.logging.file=${PID}-test.log, app.*.endpoints.logfile.sensitive=false, app.log.log.expression='TICKTOCK - TIMESTAMP: '.concat(payload), app.*.management.endpoints.web.exposure.include=*}
12-Nov-2019 00:07:37 2019-11-12 00:07:37.203  INFO 20842 --- [           main] o.s.c.d.acceptance.test.TickTockTests    : Checking: Stream=TICKTOCK, status = deploying, status description = The stream is being deployed.
12-Nov-2019 00:07:37 2019-11-12 00:07:37.203  INFO 20842 --- [           main] o.s.c.d.acceptance.test.TickTockTests    : Sleeping to check status of Stream=TICKTOCK
12-Nov-2019 00:07:47 2019-11-12 00:07:47.236  INFO 20842 --- [           main] o.s.c.d.acceptance.test.TickTockTests    : Checking: Stream=TICKTOCK, status = deploying, status description = The stream is being deployed.
12-Nov-2019 00:07:47 2019-11-12 00:07:47.236  INFO 20842 --- [           main] o.s.c.d.acceptance.test.TickTockTests    : Sleeping to check status of Stream=TICKTOCK
12-Nov-2019 00:07:57 2019-11-12 00:07:57.281  INFO 20842 --- [           main] o.s.c.d.acceptance.test.TickTockTests    : Checking: Stream=TICKTOCK, status = deployed, status description = The stream has been successfully deployed
12-Nov-2019 00:07:57 2019-11-12 00:07:57.316  INFO 20842 --- [           main] o.s.c.d.acceptance.test.TickTockTests    : Sleeping to check status of Stream=TICKTOCK
12-Nov-2019 00:08:07 2019-11-12 00:08:07.317  INFO 20842 --- [           main] o.s.c.d.acceptance.test.TickTockTests    : Stream 'TICKTOCK' started with status: deployed
12-Nov-2019 00:08:07 2019-11-12 00:08:07.318  INFO 20842 --- [           main] o.s.c.d.acceptance.test.TickTockTests    : App 'log' has instances: {TICKTOCK.log-v4-0=http://10.194.6.127:60840}
12-Nov-2019 00:08:07 2019-11-12 00:08:07.319  INFO 20842 --- [           main] o.s.c.d.acceptance.test.TickTockTests    : App 'time' has instances: {TICKTOCK.time-v4-0=http://10.194.6.127:42309}
12-Nov-2019 00:08:07 2019-11-12 00:08:07.319  INFO 20842 --- [           main] o.s.c.d.acceptance.test.TickTockTests    : Looking for 'Started TimeSource' in logfile for time
12-Nov-2019 00:08:17 2019-11-12 00:08:17.319  INFO 20842 --- [           main] o.s.c.d.acceptance.test.TickTockTests    : Requesting log for app TICKTOCK.time-v4-0
12-Nov-2019 00:08:17 2019-11-12 00:08:17.580  INFO 20842 --- [           main] o.s.c.d.acceptance.test.TickTockTests    : Retrieved logfile from 'http://10.194.6.127:42309/actuator/logfile
12-Nov-2019 00:08:17 2019-11-12 00:08:17.580  INFO 20842 --- [           main] o.s.c.d.acceptance.test.TickTockTests    : Matched all 'Started TimeSource' in logfile for app time (source TICKTOCK.time-v4-0)
12-Nov-2019 00:08:17 2019-11-12 00:08:17.580  INFO 20842 --- [           main] o.s.c.d.acceptance.test.TickTockTests    : Looking for 'Started LogSink' in logfile for log
12-Nov-2019 00:08:27 2019-11-12 00:08:27.581  INFO 20842 --- [           main] o.s.c.d.acceptance.test.TickTockTests    : Requesting log for app TICKTOCK.log-v4-0
12-Nov-2019 00:08:27 2019-11-12 00:08:27.728  INFO 20842 --- [           main] o.s.c.d.acceptance.test.TickTockTests    : Retrieved logfile from 'http://10.194.6.127:60840/actuator/logfile
12-Nov-2019 00:08:27 2019-11-12 00:08:27.729  INFO 20842 --- [           main] o.s.c.d.acceptance.test.TickTockTests    : Matched all 'Started LogSink' in logfile for app log (source TICKTOCK.log-v4-0)
12-Nov-2019 00:08:27 2019-11-12 00:08:27.729  INFO 20842 --- [           main] o.s.c.d.acceptance.test.TickTockTests    : Looking for 'TICKTOCK - TIMESTAMP:' in logfile for log
12-Nov-2019 00:08:37 2019-11-12 00:08:37.729  INFO 20842 --- [           main] o.s.c.d.acceptance.test.TickTockTests    : Requesting log for app TICKTOCK.log-v4-0
12-Nov-2019 00:08:37 2019-11-12 00:08:37.747  INFO 20842 --- [           main] o.s.c.d.acceptance.test.TickTockTests    : Retrieved logfile from 'http://10.194.6.127:60840/actuator/logfile
12-Nov-2019 00:08:37 2019-11-12 00:08:37.747  INFO 20842 --- [           main] o.s.c.d.acceptance.test.TickTockTests    : Matched all 'TICKTOCK - TIMESTAMP:' in logfile for app log (source TICKTOCK.log-v4-0)
12-Nov-2019 00:08:37 2019-11-12 00:08:37.749  INFO 20842 --- [           main] junit.logTestName                        : Test tickTockTests(org.springframework.cloud.dataflow.acceptance.test.TickTockTests) Succeeded
12-Nov-2019 00:08:37 2019-11-12 00:08:37.749  INFO 20842 --- [           main] junit.logTestName                        : Finished Test tickTockTests(org.springframework.cloud.dataflow.acceptance.test.TickTockTests)
12-Nov-2019 00:08:37 2019-11-12 00:08:37.749  INFO 20842 --- [           main] o.s.c.d.acceptance.test.TickTockTests    : Destroy all streams
12-Nov-2019 00:08:37 2019-11-12 00:08:37.988  INFO 20842 --- [           main] junit.logTestName                        : Starting Test tickTockTestsFromConfigServer(org.springframework.cloud.dataflow.acceptance.test.TickTockTests)
12-Nov-2019 00:08:37 2019-11-12 00:08:37.992  INFO 20842 --- [           main] junit.logTestName                        : Finished Test tickTockTestsFromConfigServer(org.springframework.cloud.dataflow.acceptance.test.TickTockTests)
12-Nov-2019 00:08:37 2019-11-12 00:08:37.992  INFO 20842 --- [           main] o.s.c.d.acceptance.test.TickTockTests    : Destroy all streams
12-Nov-2019 00:08:37 Tests run: 3, Failures: 0, Errors: 0, Skipped: 1, Time elapsed: 194.525 sec - in org.springframework.cloud.dataflow.acceptance.test.TickTockTests
12-Nov-2019 00:08:37 Running org.springframework.cloud.dataflow.acceptance.test.ComposedTaskTests
12-Nov-2019 00:08:38 2019-11-12 00:08:38.072  INFO 20842 --- [           main] junit.logTestName                        : Starting Test ctrMultipleLaunchWithArguments(org.springframework.cloud.dataflow.acceptance.test.ComposedTaskTests)
12-Nov-2019 00:09:58 2019-11-12 00:09:58.863  INFO 20842 --- [           main] junit.logTestName                        : Test ctrMultipleLaunchWithArguments(org.springframework.cloud.dataflow.acceptance.test.ComposedTaskTests) Succeeded
12-Nov-2019 00:09:58 2019-11-12 00:09:58.863  INFO 20842 --- [           main] junit.logTestName                        : Finished Test ctrMultipleLaunchWithArguments(org.springframework.cloud.dataflow.acceptance.test.ComposedTaskTests)
12-Nov-2019 00:09:58 2019-11-12 00:09:58.942  INFO 20842 --- [           main] junit.logTestName                        : Starting Test ctrMultipleLaunch(org.springframework.cloud.dataflow.acceptance.test.ComposedTaskTests)
12-Nov-2019 00:10:59 2019-11-12 00:10:59.631  INFO 20842 --- [           main] junit.logTestName                        : Test ctrMultipleLaunch(org.springframework.cloud.dataflow.acceptance.test.ComposedTaskTests) Succeeded
12-Nov-2019 00:10:59 2019-11-12 00:10:59.632  INFO 20842 --- [           main] junit.logTestName                        : Finished Test ctrMultipleLaunch(org.springframework.cloud.dataflow.acceptance.test.ComposedTaskTests)
12-Nov-2019 00:10:59 2019-11-12 00:10:59.707  INFO 20842 --- [           main] junit.logTestName                        : Starting Test ctrLaunch(org.springframework.cloud.dataflow.acceptance.test.ComposedTaskTests)
12-Nov-2019 00:11:50 2019-11-12 00:11:50.161  INFO 20842 --- [           main] junit.logTestName                        : Test ctrLaunch(org.springframework.cloud.dataflow.acceptance.test.ComposedTaskTests) Succeeded
12-Nov-2019 00:11:50 2019-11-12 00:11:50.161  INFO 20842 --- [           main] junit.logTestName                        : Finished Test ctrLaunch(org.springframework.cloud.dataflow.acceptance.test.ComposedTaskTests)
12-Nov-2019 00:11:50 Tests run: 3, Failures: 0, Errors: 0, Skipped: 0, Time elapsed: 192.163 sec - in org.springframework.cloud.dataflow.acceptance.test.ComposedTaskTests
12-Nov-2019 00:11:50 Running org.springframework.cloud.dataflow.acceptance.test.TransformTests
12-Nov-2019 00:11:50 2019-11-12 00:11:50.163  INFO 20842 --- [           main] .b.t.c.SpringBootTestContextBootstrapper : Neither @ContextConfiguration nor @ContextHierarchy found for test class [org.springframework.cloud.dataflow.acceptance.test.TransformTests], using SpringBootContextLoader
12-Nov-2019 00:11:50 2019-11-12 00:11:50.168  INFO 20842 --- [           main] .b.t.c.SpringBootTestContextBootstrapper : Loaded default TestExecutionListener class names from location [META-INF/spring.factories]: [org.springframework.boot.test.mock.mockito.MockitoTestExecutionListener, org.springframework.boot.test.mock.mockito.ResetMocksTestExecutionListener, org.springframework.boot.test.autoconfigure.restdocs.RestDocsTestExecutionListener, org.springframework.boot.test.autoconfigure.web.client.MockRestServiceServerResetTestExecutionListener, org.springframework.boot.test.autoconfigure.web.servlet.MockMvcPrintOnlyOnFailureTestExecutionListener, org.springframework.boot.test.autoconfigure.web.servlet.WebDriverTestExecutionListener, org.springframework.test.context.web.ServletTestExecutionListener, org.springframework.test.context.support.DirtiesContextBeforeModesTestExecutionListener, org.springframework.test.context.support.DependencyInjectionTestExecutionListener, org.springframework.test.context.support.DirtiesContextTestExecutionListener, org.springframework.test.context.transaction.TransactionalTestExecutionListener, org.springframework.test.context.jdbc.SqlScriptsTestExecutionListener]
12-Nov-2019 00:11:50 2019-11-12 00:11:50.171  INFO 20842 --- [           main] .b.t.c.SpringBootTestContextBootstrapper : Using TestExecutionListeners: [org.springframework.test.context.web.ServletTestExecutionListener@ba17be6, org.springframework.test.context.support.DirtiesContextBeforeModesTestExecutionListener@6f798482, org.springframework.boot.test.autoconfigure.SpringBootDependencyInjectionTestExecutionListener@332bcab0, org.springframework.test.context.support.DirtiesContextTestExecutionListener@633cc6b5, org.springframework.test.context.transaction.TransactionalTestExecutionListener@6342ff7f, org.springframework.test.context.jdbc.SqlScriptsTestExecutionListener@403c3a01, org.springframework.boot.test.mock.mockito.MockitoTestExecutionListener@2daf06fc, org.springframework.boot.test.autoconfigure.web.servlet.MockMvcPrintOnlyOnFailureTestExecutionListener@28237492, org.springframework.boot.test.autoconfigure.web.client.MockRestServiceServerResetTestExecutionListener@5ceecfee, org.springframework.boot.test.mock.mockito.ResetMocksTestExecutionListener@7da31a40, org.springframework.boot.test.autoconfigure.web.servlet.WebDriverTestExecutionListener@28ee7bee, org.springframework.boot.test.autoconfigure.restdocs.RestDocsTestExecutionListener@1b5a1d85]
12-Nov-2019 00:11:50 2019-11-12 00:11:50.239  INFO 20842 --- [           main] junit.logTestName                        : Starting Test transformTests(org.springframework.cloud.dataflow.acceptance.test.TransformTests)
12-Nov-2019 00:11:50 2019-11-12 00:11:50.241  INFO 20842 --- [           main] o.s.c.d.acceptance.test.TransformTests   : Creating stream 'TRANSFORM-TEST'
12-Nov-2019 00:11:50 2019-11-12 00:11:50.276  INFO 20842 --- [           main] o.s.c.d.acceptance.test.TransformTests   : Deploying stream 'TRANSFORM-TEST' with properties: {app.*.spring.cloud.streamapp.security.enabled=false, app.*.logging.file=${PID}-test.log, app.*.endpoints.logfile.sensitive=false, app.*.management.endpoints.web.exposure.include=*}
12-Nov-2019 00:11:51 2019-11-12 00:11:51.026  INFO 20842 --- [           main] o.s.c.d.acceptance.test.TransformTests   : Checking: Stream=TRANSFORM-TEST, status = deploying, status description = The stream is being deployed.
12-Nov-2019 00:11:51 2019-11-12 00:11:51.027  INFO 20842 --- [           main] o.s.c.d.acceptance.test.TransformTests   : Sleeping to check status of Stream=TRANSFORM-TEST
12-Nov-2019 00:12:01 2019-11-12 00:12:01.068  INFO 20842 --- [           main] o.s.c.d.acceptance.test.TransformTests   : Checking: Stream=TRANSFORM-TEST, status = deploying, status description = The stream is being deployed.
12-Nov-2019 00:12:01 2019-11-12 00:12:01.068  INFO 20842 --- [           main] o.s.c.d.acceptance.test.TransformTests   : Sleeping to check status of Stream=TRANSFORM-TEST
12-Nov-2019 00:12:11 2019-11-12 00:12:11.103  INFO 20842 --- [           main] o.s.c.d.acceptance.test.TransformTests   : Checking: Stream=TRANSFORM-TEST, status = deployed, status description = The stream has been successfully deployed
12-Nov-2019 00:12:11 2019-11-12 00:12:11.150  INFO 20842 --- [           main] o.s.c.d.acceptance.test.TransformTests   : Sleeping to check status of Stream=TRANSFORM-TEST
12-Nov-2019 00:12:21 2019-11-12 00:12:21.151  INFO 20842 --- [           main] o.s.c.d.acceptance.test.TransformTests   : Stream 'TRANSFORM-TEST' started with status: deployed
12-Nov-2019 00:12:21 2019-11-12 00:12:21.151  INFO 20842 --- [           main] o.s.c.d.acceptance.test.TransformTests   : App 'transform' has instances: {TRANSFORM-TEST.transform-v1-0=http://10.194.6.127:50203}
12-Nov-2019 00:12:21 2019-11-12 00:12:21.151  INFO 20842 --- [           main] o.s.c.d.acceptance.test.TransformTests   : App 'log' has instances: {TRANSFORM-TEST.log-v1-0=http://10.194.6.127:52489}
12-Nov-2019 00:12:21 2019-11-12 00:12:21.151  INFO 20842 --- [           main] o.s.c.d.acceptance.test.TransformTests   : App 'http' has instances: {TRANSFORM-TEST.http-v1-0=http://10.194.6.127:49510}
12-Nov-2019 00:12:21 2019-11-12 00:12:21.151  INFO 20842 --- [           main] o.s.c.d.acceptance.test.TransformTests   : Looking for 'Started HttpSource' in logfile for http
12-Nov-2019 00:12:31 2019-11-12 00:12:31.152  INFO 20842 --- [           main] o.s.c.d.acceptance.test.TransformTests   : Requesting log for app TRANSFORM-TEST.http-v1-0
12-Nov-2019 00:12:31 2019-11-12 00:12:31.447  INFO 20842 --- [           main] o.s.c.d.acceptance.test.TransformTests   : Retrieved logfile from 'http://10.194.6.127:49510/actuator/logfile
12-Nov-2019 00:12:31 2019-11-12 00:12:31.447  INFO 20842 --- [           main] o.s.c.d.acceptance.test.TransformTests   : Matched all 'Started HttpSource' in logfile for app http (source TRANSFORM-TEST.http-v1-0)
12-Nov-2019 00:12:31 2019-11-12 00:12:31.569  INFO 20842 --- [           main] o.s.c.d.acceptance.test.TransformTests   : Looking for 'Started LogSink' in logfile for log
12-Nov-2019 00:12:41 2019-11-12 00:12:41.569  INFO 20842 --- [           main] o.s.c.d.acceptance.test.TransformTests   : Requesting log for app TRANSFORM-TEST.log-v1-0
12-Nov-2019 00:12:41 2019-11-12 00:12:41.696  INFO 20842 --- [           main] o.s.c.d.acceptance.test.TransformTests   : Retrieved logfile from 'http://10.194.6.127:52489/actuator/logfile
12-Nov-2019 00:12:41 2019-11-12 00:12:41.697  INFO 20842 --- [           main] o.s.c.d.acceptance.test.TransformTests   : Matched all 'Started LogSink' in logfile for app log (source TRANSFORM-TEST.log-v1-0)
12-Nov-2019 00:12:41 2019-11-12 00:12:41.697  INFO 20842 --- [           main] o.s.c.d.acceptance.test.TransformTests   : Looking for 'ABCDEFG' in logfile for log
12-Nov-2019 00:12:51 2019-11-12 00:12:51.697  INFO 20842 --- [           main] o.s.c.d.acceptance.test.TransformTests   : Requesting log for app TRANSFORM-TEST.log-v1-0
12-Nov-2019 00:12:51 2019-11-12 00:12:51.713  INFO 20842 --- [           main] o.s.c.d.acceptance.test.TransformTests   : Retrieved logfile from 'http://10.194.6.127:52489/actuator/logfile
12-Nov-2019 00:12:51 2019-11-12 00:12:51.714  INFO 20842 --- [           main] o.s.c.d.acceptance.test.TransformTests   : Matched all 'ABCDEFG' in logfile for app log (source TRANSFORM-TEST.log-v1-0)
12-Nov-2019 00:12:51 2019-11-12 00:12:51.716  INFO 20842 --- [           main] junit.logTestName                        : Test transformTests(org.springframework.cloud.dataflow.acceptance.test.TransformTests) Succeeded
12-Nov-2019 00:12:51 2019-11-12 00:12:51.716  INFO 20842 --- [           main] junit.logTestName                        : Finished Test transformTests(org.springframework.cloud.dataflow.acceptance.test.TransformTests)
12-Nov-2019 00:12:51 2019-11-12 00:12:51.716  INFO 20842 --- [           main] o.s.c.d.acceptance.test.TransformTests   : Destroy all streams
12-Nov-2019 00:12:52 Tests run: 1, Failures: 0, Errors: 0, Skipped: 0, Time elapsed: 61.905 sec - in org.springframework.cloud.dataflow.acceptance.test.TransformTests
12-Nov-2019 00:12:52 Running org.springframework.cloud.dataflow.acceptance.test.SchedulerTests
12-Nov-2019 00:12:52 2019-11-12 00:12:52.193  INFO 20842 --- [           main] s.c.a.AnnotationConfigApplicationContext : Refreshing org.springframework.context.annotation.AnnotationConfigApplicationContext@4130955c: startup date [Tue Nov 12 00:12:52 UTC 2019]; root of context hierarchy
12-Nov-2019 00:12:52 2019-11-12 00:12:52.212  INFO 20842 --- [           main] trationDelegate$BeanPostProcessorChecker : Bean 'configurationPropertiesRebinderAutoConfiguration' of type [class org.springframework.cloud.autoconfigure.ConfigurationPropertiesRebinderAutoConfiguration$$EnhancerBySpringCGLIB$$219d8b3d] is not eligible for getting processed by all BeanPostProcessors (for example: not eligible for auto-proxying)
12-Nov-2019 00:12:52
12-Nov-2019 00:12:52   .   ____          _            __ _ _
12-Nov-2019 00:12:52 /\\ / ___'_ __ _ _(_)_ __  __ _ \ \ \ \
12-Nov-2019 00:12:52 ( ( )\___ | '_ | '_| | '_ \/ _` | \ \ \ \
12-Nov-2019 00:12:52 \\/  ___)| |_)| | | | | || (_| |  ) ) ) )
12-Nov-2019 00:12:52   '  |____| .__|_| |_|_| |_\__, | / / / /
12-Nov-2019 00:12:52 =========|_|==============|___/=/_/_/_/
12-Nov-2019 00:12:52 :: Spring Boot ::        (v1.4.1.RELEASE)
12-Nov-2019 00:12:52
12-Nov-2019 00:12:52 2019-11-12 00:12:52.304  INFO 20842 --- [           main] c.c.c.ConfigServicePropertySourceLocator : Fetching config from server at: http://localhost:8888
12-Nov-2019 00:12:52 2019-11-12 00:12:52.306  WARN 20842 --- [           main] c.c.c.ConfigServicePropertySourceLocator : Could not locate PropertySource: I/O error on GET request for "http://localhost:8888//blah": Connection refused (Connection refused); nested exception is java.net.ConnectException: Connection refused (Connection refused)
12-Nov-2019 00:12:52 2019-11-12 00:12:52.307  INFO 20842 --- [           main] o.a.maven.surefire.booter.ForkedBooter   : The following profiles are active: blah
12-Nov-2019 00:12:52 2019-11-12 00:12:52.308  INFO 20842 --- [           main] s.c.a.AnnotationConfigApplicationContext : Refreshing org.springframework.context.annotation.AnnotationConfigApplicationContext@383c3eb3: startup date [Tue Nov 12 00:12:52 UTC 2019]; parent: org.springframework.context.annotation.AnnotationConfigApplicationContext@4130955c
12-Nov-2019 00:12:52 2019-11-12 00:12:52.385  INFO 20842 --- [           main] o.a.maven.surefire.booter.ForkedBooter   : Started ForkedBooter in 0.296 seconds (JVM running for 642.058)
12-Nov-2019 00:12:52 2019-11-12 00:12:52.389  INFO 20842 --- [           main] s.c.a.AnnotationConfigApplicationContext : Closing org.springframework.context.annotation.AnnotationConfigApplicationContext@383c3eb3: startup date [Tue Nov 12 00:12:52 UTC 2019]; parent: org.springframework.context.annotation.AnnotationConfigApplicationContext@4130955c
12-Nov-2019 00:12:52 2019-11-12 00:12:52.391 ERROR 20842 --- [           main] o.s.c.d.a.test.util.SchedulerRule        : SCHEDULER IS NOT AVAILABLE, SKIPPING TESTS
12-Nov-2019 00:12:52
12-Nov-2019 00:12:52 java.lang.IllegalArgumentException: no SchedulerOperations bean is available.  Skipping test.
12-Nov-2019 00:12:52         at org.springframework.util.Assert.notNull(Assert.java:115)
12-Nov-2019 00:12:52         at org.springframework.cloud.dataflow.acceptance.test.util.SchedulerRule.obtainResource(SchedulerRule.java:57)
12-Nov-2019 00:12:52         at org.springframework.cloud.scheduler.spi.junit.AbstractExternalResourceTestSupport.apply(AbstractExternalResourceTestSupport.java:58)
12-Nov-2019 00:12:52         at org.junit.rules.RunRules.applyAll(RunRules.java:26)
12-Nov-2019 00:12:52         at org.junit.rules.RunRules.<init>(RunRules.java:15)
12-Nov-2019 00:12:52         at org.junit.runners.ParentRunner.withClassRules(ParentRunner.java:245)
12-Nov-2019 00:12:52         at org.junit.runners.ParentRunner.classBlock(ParentRunner.java:194)
12-Nov-2019 00:12:52         at org.junit.runners.ParentRunner.run(ParentRunner.java:362)
12-Nov-2019 00:12:52         at org.springframework.test.context.junit4.SpringJUnit4ClassRunner.run(SpringJUnit4ClassRunner.java:191)
12-Nov-2019 00:12:52         at org.apache.maven.surefire.junit4.JUnit4Provider.execute(JUnit4Provider.java:283)
12-Nov-2019 00:12:52         at org.apache.maven.surefire.junit4.JUnit4Provider.executeWithRerun(JUnit4Provider.java:173)
12-Nov-2019 00:12:52         at org.apache.maven.surefire.junit4.JUnit4Provider.executeTestSet(JUnit4Provider.java:153)
12-Nov-2019 00:12:52         at org.apache.maven.surefire.junit4.JUnit4Provider.invoke(JUnit4Provider.java:128)
12-Nov-2019 00:12:52         at org.apache.maven.surefire.booter.ForkedBooter.invokeProviderInSameClassLoader(ForkedBooter.java:203)
12-Nov-2019 00:12:52         at org.apache.maven.surefire.booter.ForkedBooter.runSuitesInProcess(ForkedBooter.java:155)
12-Nov-2019 00:12:52         at org.apache.maven.surefire.booter.ForkedBooter.main(ForkedBooter.java:103)
12-Nov-2019 00:12:52
12-Nov-2019 00:12:52 Tests run: 1, Failures: 0, Errors: 0, Skipped: 1, Time elapsed: 0.325 sec - in org.springframework.cloud.dataflow.acceptance.test.SchedulerTests
12-Nov-2019 00:12:52 Running org.springframework.cloud.dataflow.acceptance.test.NamedChannelTests
12-Nov-2019 00:12:52 2019-11-12 00:12:52.395  INFO 20842 --- [           main] .b.t.c.SpringBootTestContextBootstrapper : Neither @ContextConfiguration nor @ContextHierarchy found for test class [org.springframework.cloud.dataflow.acceptance.test.NamedChannelTests], using SpringBootContextLoader
12-Nov-2019 00:12:52 2019-11-12 00:12:52.403  INFO 20842 --- [           main] .b.t.c.SpringBootTestContextBootstrapper : Loaded default TestExecutionListener class names from location [META-INF/spring.factories]: [org.springframework.boot.test.mock.mockito.MockitoTestExecutionListener, org.springframework.boot.test.mock.mockito.ResetMocksTestExecutionListener, org.springframework.boot.test.autoconfigure.restdocs.RestDocsTestExecutionListener, org.springframework.boot.test.autoconfigure.web.client.MockRestServiceServerResetTestExecutionListener, org.springframework.boot.test.autoconfigure.web.servlet.MockMvcPrintOnlyOnFailureTestExecutionListener, org.springframework.boot.test.autoconfigure.web.servlet.WebDriverTestExecutionListener, org.springframework.test.context.web.ServletTestExecutionListener, org.springframework.test.context.support.DirtiesContextBeforeModesTestExecutionListener, org.springframework.test.context.support.DependencyInjectionTestExecutionListener, org.springframework.test.context.support.DirtiesContextTestExecutionListener, org.springframework.test.context.transaction.TransactionalTestExecutionListener, org.springframework.test.context.jdbc.SqlScriptsTestExecutionListener]
12-Nov-2019 00:12:52 2019-11-12 00:12:52.407  INFO 20842 --- [           main] .b.t.c.SpringBootTestContextBootstrapper : Using TestExecutionListeners: [org.springframework.test.context.web.ServletTestExecutionListener@662e682a, org.springframework.test.context.support.DirtiesContextBeforeModesTestExecutionListener@2e43c38d, org.springframework.boot.test.autoconfigure.SpringBootDependencyInjectionTestExecutionListener@649f25f3, org.springframework.test.context.support.DirtiesContextTestExecutionListener@2e62ead7, org.springframework.test.context.transaction.TransactionalTestExecutionListener@3b98b809, org.springframework.test.context.jdbc.SqlScriptsTestExecutionListener@bf75b5c, org.springframework.boot.test.mock.mockito.MockitoTestExecutionListener@16da476c, org.springframework.boot.test.autoconfigure.web.servlet.MockMvcPrintOnlyOnFailureTestExecutionListener@2fd72332, org.springframework.boot.test.autoconfigure.web.client.MockRestServiceServerResetTestExecutionListener@51f18e31, org.springframework.boot.test.mock.mockito.ResetMocksTestExecutionListener@60ed12e8, org.springframework.boot.test.autoconfigure.web.servlet.WebDriverTestExecutionListener@24c8d8be, org.springframework.boot.test.autoconfigure.restdocs.RestDocsTestExecutionListener@3290b1a6]
12-Nov-2019 00:12:52 2019-11-12 00:12:52.464  INFO 20842 --- [           main] junit.logTestName                        : Starting Test testDestination(org.springframework.cloud.dataflow.acceptance.test.NamedChannelTests)
12-Nov-2019 00:12:52 2019-11-12 00:12:52.466  INFO 20842 --- [           main] o.s.c.d.a.test.NamedChannelTests         : Creating stream 'LOG-DESTINATION-SINK'
12-Nov-2019 00:12:52 2019-11-12 00:12:52.501  INFO 20842 --- [           main] o.s.c.d.a.test.NamedChannelTests         : Deploying stream 'LOG-DESTINATION-SINK' with properties: {app.*.spring.cloud.streamapp.security.enabled=false, app.*.logging.file=${PID}-test.log, app.*.endpoints.logfile.sensitive=false, app.*.management.endpoints.web.exposure.include=*}
12-Nov-2019 00:12:52 2019-11-12 00:12:52.886  INFO 20842 --- [           main] o.s.c.d.a.test.NamedChannelTests         : Checking: Stream=LOG-DESTINATION-SINK, status = deploying, status description = The stream is being deployed.
12-Nov-2019 00:12:52 2019-11-12 00:12:52.886  INFO 20842 --- [           main] o.s.c.d.a.test.NamedChannelTests         : Sleeping to check status of Stream=LOG-DESTINATION-SINK
12-Nov-2019 00:13:02 2019-11-12 00:13:02.931  INFO 20842 --- [           main] o.s.c.d.a.test.NamedChannelTests         : Checking: Stream=LOG-DESTINATION-SINK, status = deployed, status description = The stream has been successfully deployed
12-Nov-2019 00:13:02 2019-11-12 00:13:02.962  INFO 20842 --- [           main] o.s.c.d.a.test.NamedChannelTests         : Sleeping to check status of Stream=LOG-DESTINATION-SINK
12-Nov-2019 00:13:12 2019-11-12 00:13:12.963  INFO 20842 --- [           main] o.s.c.d.a.test.NamedChannelTests         : Stream 'LOG-DESTINATION-SINK' started with status: deployed
12-Nov-2019 00:13:12 2019-11-12 00:13:12.964  INFO 20842 --- [           main] o.s.c.d.a.test.NamedChannelTests         : App 'log' has instances: {LOG-DESTINATION-SINK.log-v1-0=http://10.194.6.127:26892}
12-Nov-2019 00:13:12 2019-11-12 00:13:12.965  INFO 20842 --- [           main] o.s.c.d.a.test.NamedChannelTests         : Looking for 'Started LogSink' in logfile for log
12-Nov-2019 00:13:22 2019-11-12 00:13:22.965  INFO 20842 --- [           main] o.s.c.d.a.test.NamedChannelTests         : Requesting log for app LOG-DESTINATION-SINK.log-v1-0
12-Nov-2019 00:13:23 2019-11-12 00:13:23.274  INFO 20842 --- [           main] o.s.c.d.a.test.NamedChannelTests         : Retrieved logfile from 'http://10.194.6.127:26892/actuator/logfile
12-Nov-2019 00:13:23 2019-11-12 00:13:23.274  INFO 20842 --- [           main] o.s.c.d.a.test.NamedChannelTests         : Matched all 'Started LogSink' in logfile for app log (source LOG-DESTINATION-SINK.log-v1-0)
12-Nov-2019 00:13:23 2019-11-12 00:13:23.275  INFO 20842 --- [           main] o.s.c.d.a.test.NamedChannelTests         : Creating stream 'HTTP-DESTINATION-SOURCE'
12-Nov-2019 00:13:23 2019-11-12 00:13:23.305  INFO 20842 --- [           main] o.s.c.d.a.test.NamedChannelTests         : Deploying stream 'HTTP-DESTINATION-SOURCE' with properties: {app.*.spring.cloud.streamapp.security.enabled=false, app.*.logging.file=${PID}-test.log, app.*.endpoints.logfile.sensitive=false, app.*.management.endpoints.web.exposure.include=*}
12-Nov-2019 00:13:23 2019-11-12 00:13:23.752  INFO 20842 --- [           main] o.s.c.d.a.test.NamedChannelTests         : Checking: Stream=HTTP-DESTINATION-SOURCE, status = deploying, status description = The stream is being deployed.
12-Nov-2019 00:13:23 2019-11-12 00:13:23.752  INFO 20842 --- [           main] o.s.c.d.a.test.NamedChannelTests         : Sleeping to check status of Stream=HTTP-DESTINATION-SOURCE
12-Nov-2019 00:13:33 2019-11-12 00:13:33.804  INFO 20842 --- [           main] o.s.c.d.a.test.NamedChannelTests         : Checking: Stream=HTTP-DESTINATION-SOURCE, status = deployed, status description = The stream has been successfully deployed
12-Nov-2019 00:13:33 2019-11-12 00:13:33.834  INFO 20842 --- [           main] o.s.c.d.a.test.NamedChannelTests         : Sleeping to check status of Stream=HTTP-DESTINATION-SOURCE
12-Nov-2019 00:13:43 2019-11-12 00:13:43.834  INFO 20842 --- [           main] o.s.c.d.a.test.NamedChannelTests         : Stream 'HTTP-DESTINATION-SOURCE' started with status: deployed
12-Nov-2019 00:13:43 2019-11-12 00:13:43.835  INFO 20842 --- [           main] o.s.c.d.a.test.NamedChannelTests         : App 'http' has instances: {HTTP-DESTINATION-SOURCE.http-v1-0=http://10.194.6.127:47659}
12-Nov-2019 00:13:43 2019-11-12 00:13:43.835  INFO 20842 --- [           main] o.s.c.d.a.test.NamedChannelTests         : Looking for 'Started HttpSource' in logfile for http
12-Nov-2019 00:13:53 2019-11-12 00:13:53.835  INFO 20842 --- [           main] o.s.c.d.a.test.NamedChannelTests         : Requesting log for app HTTP-DESTINATION-SOURCE.http-v1-0
12-Nov-2019 00:13:54 2019-11-12 00:13:54.121  INFO 20842 --- [           main] o.s.c.d.a.test.NamedChannelTests         : Retrieved logfile from 'http://10.194.6.127:47659/actuator/logfile
12-Nov-2019 00:13:54 2019-11-12 00:13:54.122  INFO 20842 --- [           main] o.s.c.d.a.test.NamedChannelTests         : Matched all 'Started HttpSource' in logfile for app http (source HTTP-DESTINATION-SOURCE.http-v1-0)
12-Nov-2019 00:13:54 2019-11-12 00:13:54.260  INFO 20842 --- [           main] o.s.c.d.a.test.NamedChannelTests         : Looking for 'abcdefg' in logfile for log
12-Nov-2019 00:14:04 2019-11-12 00:14:04.260  INFO 20842 --- [           main] o.s.c.d.a.test.NamedChannelTests         : Requesting log for app LOG-DESTINATION-SINK.log-v1-0
12-Nov-2019 00:14:04 2019-11-12 00:14:04.277  INFO 20842 --- [           main] o.s.c.d.a.test.NamedChannelTests         : Retrieved logfile from 'http://10.194.6.127:26892/actuator/logfile
12-Nov-2019 00:14:04 2019-11-12 00:14:04.277  INFO 20842 --- [           main] o.s.c.d.a.test.NamedChannelTests         : Matched all 'abcdefg' in logfile for app log (source LOG-DESTINATION-SINK.log-v1-0)
12-Nov-2019 00:14:04 2019-11-12 00:14:04.279  INFO 20842 --- [           main] junit.logTestName                        : Test testDestination(org.springframework.cloud.dataflow.acceptance.test.NamedChannelTests) Succeeded
12-Nov-2019 00:14:04 2019-11-12 00:14:04.279  INFO 20842 --- [           main] junit.logTestName                        : Finished Test testDestination(org.springframework.cloud.dataflow.acceptance.test.NamedChannelTests)
12-Nov-2019 00:14:04 2019-11-12 00:14:04.279  INFO 20842 --- [           main] o.s.c.d.a.test.NamedChannelTests         : Destroy all streams
12-Nov-2019 00:14:04 2019-11-12 00:14:04.647  INFO 20842 --- [           main] junit.logTestName                        : Starting Test testTap(org.springframework.cloud.dataflow.acceptance.test.NamedChannelTests)
12-Nov-2019 00:14:04 2019-11-12 00:14:04.649  INFO 20842 --- [           main] o.s.c.d.a.test.NamedChannelTests         : Creating stream 'TAPHTTP'
12-Nov-2019 00:14:04 2019-11-12 00:14:04.675  INFO 20842 --- [           main] o.s.c.d.a.test.NamedChannelTests         : Deploying stream 'TAPHTTP' with properties: {app.*.spring.cloud.streamapp.security.enabled=false, app.*.logging.file=${PID}-test.log, app.*.endpoints.logfile.sensitive=false, app.*.management.endpoints.web.exposure.include=*}
12-Nov-2019 00:14:05 2019-11-12 00:14:05.253  INFO 20842 --- [           main] o.s.c.d.a.test.NamedChannelTests         : Checking: Stream=TAPHTTP, status = deploying, status description = The stream is being deployed.
12-Nov-2019 00:14:05 2019-11-12 00:14:05.254  INFO 20842 --- [           main] o.s.c.d.a.test.NamedChannelTests         : Sleeping to check status of Stream=TAPHTTP
12-Nov-2019 00:14:15 2019-11-12 00:14:15.282  INFO 20842 --- [           main] o.s.c.d.a.test.NamedChannelTests         : Checking: Stream=TAPHTTP, status = deploying, status description = The stream is being deployed.
12-Nov-2019 00:14:15 2019-11-12 00:14:15.282  INFO 20842 --- [           main] o.s.c.d.a.test.NamedChannelTests         : Sleeping to check status of Stream=TAPHTTP
12-Nov-2019 00:14:25 2019-11-12 00:14:25.330  INFO 20842 --- [           main] o.s.c.d.a.test.NamedChannelTests         : Checking: Stream=TAPHTTP, status = deployed, status description = The stream has been successfully deployed
12-Nov-2019 00:14:25 2019-11-12 00:14:25.360  INFO 20842 --- [           main] o.s.c.d.a.test.NamedChannelTests         : Sleeping to check status of Stream=TAPHTTP
12-Nov-2019 00:14:35 2019-11-12 00:14:35.361  INFO 20842 --- [           main] o.s.c.d.a.test.NamedChannelTests         : Stream 'TAPHTTP' started with status: deployed
12-Nov-2019 00:14:35 2019-11-12 00:14:35.362  INFO 20842 --- [           main] o.s.c.d.a.test.NamedChannelTests         : App 'log' has instances: {TAPHTTP.log-v1-0=http://10.194.6.127:59660}
12-Nov-2019 00:14:35 2019-11-12 00:14:35.363  INFO 20842 --- [           main] o.s.c.d.a.test.NamedChannelTests         : App 'http' has instances: {TAPHTTP.http-v1-0=http://10.194.6.127:28749}
12-Nov-2019 00:14:35 2019-11-12 00:14:35.363  INFO 20842 --- [           main] o.s.c.d.a.test.NamedChannelTests         : Looking for 'Started HttpSource' in logfile for http
12-Nov-2019 00:14:45 2019-11-12 00:14:45.363  INFO 20842 --- [           main] o.s.c.d.a.test.NamedChannelTests         : Requesting log for app TAPHTTP.http-v1-0
12-Nov-2019 00:14:45 2019-11-12 00:14:45.646  INFO 20842 --- [           main] o.s.c.d.a.test.NamedChannelTests         : Retrieved logfile from 'http://10.194.6.127:28749/actuator/logfile
12-Nov-2019 00:14:45 2019-11-12 00:14:45.647  INFO 20842 --- [           main] o.s.c.d.a.test.NamedChannelTests         : Matched all 'Started HttpSource' in logfile for app http (source TAPHTTP.http-v1-0)
12-Nov-2019 00:14:45 2019-11-12 00:14:45.647  INFO 20842 --- [           main] o.s.c.d.a.test.NamedChannelTests         : Looking for 'Started LogSink' in logfile for log
12-Nov-2019 00:14:55 2019-11-12 00:14:55.647  INFO 20842 --- [           main] o.s.c.d.a.test.NamedChannelTests         : Requesting log for app TAPHTTP.log-v1-0
12-Nov-2019 00:14:55 2019-11-12 00:14:55.783  INFO 20842 --- [           main] o.s.c.d.a.test.NamedChannelTests         : Retrieved logfile from 'http://10.194.6.127:59660/actuator/logfile
12-Nov-2019 00:14:55 2019-11-12 00:14:55.783  INFO 20842 --- [           main] o.s.c.d.a.test.NamedChannelTests         : Matched all 'Started LogSink' in logfile for app log (source TAPHTTP.log-v1-0)
12-Nov-2019 00:14:55 2019-11-12 00:14:55.783  INFO 20842 --- [           main] o.s.c.d.a.test.NamedChannelTests         : Creating stream 'TAPSTREAM'
12-Nov-2019 00:14:55 2019-11-12 00:14:55.813  INFO 20842 --- [           main] o.s.c.d.a.test.NamedChannelTests         : Deploying stream 'TAPSTREAM' with properties: {app.*.spring.cloud.streamapp.security.enabled=false, app.*.logging.file=${PID}-test.log, app.*.endpoints.logfile.sensitive=false, app.*.management.endpoints.web.exposure.include=*}
12-Nov-2019 00:14:56 2019-11-12 00:14:56.236  INFO 20842 --- [           main] o.s.c.d.a.test.NamedChannelTests         : Checking: Stream=TAPSTREAM, status = deploying, status description = The stream is being deployed.
12-Nov-2019 00:14:56 2019-11-12 00:14:56.236  INFO 20842 --- [           main] o.s.c.d.a.test.NamedChannelTests         : Sleeping to check status of Stream=TAPSTREAM
12-Nov-2019 00:15:06 2019-11-12 00:15:06.292  INFO 20842 --- [           main] o.s.c.d.a.test.NamedChannelTests         : Checking: Stream=TAPSTREAM, status = deployed, status description = The stream has been successfully deployed
12-Nov-2019 00:15:06 2019-11-12 00:15:06.337  INFO 20842 --- [           main] o.s.c.d.a.test.NamedChannelTests         : Sleeping to check status of Stream=TAPSTREAM
12-Nov-2019 00:15:16 2019-11-12 00:15:16.338  INFO 20842 --- [           main] o.s.c.d.a.test.NamedChannelTests         : Stream 'TAPSTREAM' started with status: deployed
12-Nov-2019 00:15:16 2019-11-12 00:15:16.338  INFO 20842 --- [           main] o.s.c.d.a.test.NamedChannelTests         : App 'log' has instances: {TAPSTREAM.log-v1-0=http://10.194.6.127:39265}
12-Nov-2019 00:15:16 2019-11-12 00:15:16.339  INFO 20842 --- [           main] o.s.c.d.a.test.NamedChannelTests         : Looking for 'Started LogSink' in logfile for log
12-Nov-2019 00:15:26 2019-11-12 00:15:26.339  INFO 20842 --- [           main] o.s.c.d.a.test.NamedChannelTests         : Requesting log for app TAPSTREAM.log-v1-0
12-Nov-2019 00:15:26 2019-11-12 00:15:26.637  INFO 20842 --- [           main] o.s.c.d.a.test.NamedChannelTests         : Retrieved logfile from 'http://10.194.6.127:39265/actuator/logfile
12-Nov-2019 00:15:26 2019-11-12 00:15:26.637  INFO 20842 --- [           main] o.s.c.d.a.test.NamedChannelTests         : Matched all 'Started LogSink' in logfile for app log (source TAPSTREAM.log-v1-0)
12-Nov-2019 00:15:26 2019-11-12 00:15:26.835  INFO 20842 --- [           main] o.s.c.d.a.test.NamedChannelTests         : Looking for 'abcdefg' in logfile for log
12-Nov-2019 00:15:36 2019-11-12 00:15:36.835  INFO 20842 --- [           main] o.s.c.d.a.test.NamedChannelTests         : Requesting log for app TAPSTREAM.log-v1-0
12-Nov-2019 00:15:36 2019-11-12 00:15:36.851  INFO 20842 --- [           main] o.s.c.d.a.test.NamedChannelTests         : Retrieved logfile from 'http://10.194.6.127:39265/actuator/logfile
12-Nov-2019 00:15:36 2019-11-12 00:15:36.851  INFO 20842 --- [           main] o.s.c.d.a.test.NamedChannelTests         : Matched all 'abcdefg' in logfile for app log (source TAPSTREAM.log-v1-0)
12-Nov-2019 00:15:36 2019-11-12 00:15:36.855  INFO 20842 --- [           main] junit.logTestName                        : Test testTap(org.springframework.cloud.dataflow.acceptance.test.NamedChannelTests) Succeeded
12-Nov-2019 00:15:36 2019-11-12 00:15:36.855  INFO 20842 --- [           main] junit.logTestName                        : Finished Test testTap(org.springframework.cloud.dataflow.acceptance.test.NamedChannelTests)
12-Nov-2019 00:15:36 2019-11-12 00:15:36.855  INFO 20842 --- [           main] o.s.c.d.a.test.NamedChannelTests         : Destroy all streams
12-Nov-2019 00:15:37 2019-11-12 00:15:37.290  INFO 20842 --- [           main] junit.logTestName                        : Starting Test manyToOneTest(org.springframework.cloud.dataflow.acceptance.test.NamedChannelTests)
12-Nov-2019 00:15:37 2019-11-12 00:15:37.292  INFO 20842 --- [           main] o.s.c.d.a.test.NamedChannelTests         : Creating stream 'MANY-TO-ONE'
12-Nov-2019 00:15:37 2019-11-12 00:15:37.330  INFO 20842 --- [           main] o.s.c.d.a.test.NamedChannelTests         : Deploying stream 'MANY-TO-ONE' with properties: {app.*.spring.cloud.streamapp.security.enabled=false, app.*.logging.file=${PID}-test.log, app.*.endpoints.logfile.sensitive=false, app.*.management.endpoints.web.exposure.include=*}
12-Nov-2019 00:15:37 2019-11-12 00:15:37.761  INFO 20842 --- [           main] o.s.c.d.a.test.NamedChannelTests         : Checking: Stream=MANY-TO-ONE, status = deploying, status description = The stream is being deployed.
12-Nov-2019 00:15:37 2019-11-12 00:15:37.761  INFO 20842 --- [           main] o.s.c.d.a.test.NamedChannelTests         : Sleeping to check status of Stream=MANY-TO-ONE
12-Nov-2019 00:15:47 2019-11-12 00:15:47.799  INFO 20842 --- [           main] o.s.c.d.a.test.NamedChannelTests         : Checking: Stream=MANY-TO-ONE, status = deployed, status description = The stream has been successfully deployed
12-Nov-2019 00:15:47 2019-11-12 00:15:47.826  INFO 20842 --- [           main] o.s.c.d.a.test.NamedChannelTests         : Sleeping to check status of Stream=MANY-TO-ONE
12-Nov-2019 00:15:57 2019-11-12 00:15:57.826  INFO 20842 --- [           main] o.s.c.d.a.test.NamedChannelTests         : Stream 'MANY-TO-ONE' started with status: deployed
12-Nov-2019 00:15:57 2019-11-12 00:15:57.827  INFO 20842 --- [           main] o.s.c.d.a.test.NamedChannelTests         : App 'log' has instances: {MANY-TO-ONE.log-v1-0=http://10.194.6.127:53528}
12-Nov-2019 00:15:57 2019-11-12 00:15:57.827  INFO 20842 --- [           main] o.s.c.d.a.test.NamedChannelTests         : Looking for 'Started LogSink' in logfile for log
12-Nov-2019 00:16:07 2019-11-12 00:16:07.827  INFO 20842 --- [           main] o.s.c.d.a.test.NamedChannelTests         : Requesting log for app MANY-TO-ONE.log-v1-0
12-Nov-2019 00:16:08 2019-11-12 00:16:08.128  INFO 20842 --- [           main] o.s.c.d.a.test.NamedChannelTests         : Retrieved logfile from 'http://10.194.6.127:53528/actuator/logfile
12-Nov-2019 00:16:08 2019-11-12 00:16:08.128  INFO 20842 --- [           main] o.s.c.d.a.test.NamedChannelTests         : Matched all 'Started LogSink' in logfile for app log (source MANY-TO-ONE.log-v1-0)
12-Nov-2019 00:16:08 2019-11-12 00:16:08.128  INFO 20842 --- [           main] o.s.c.d.a.test.NamedChannelTests         : Creating stream 'HTTP-SOURCE-1'
12-Nov-2019 00:16:08 2019-11-12 00:16:08.156  INFO 20842 --- [           main] o.s.c.d.a.test.NamedChannelTests         : Deploying stream 'HTTP-SOURCE-1' with properties: {app.*.spring.cloud.streamapp.security.enabled=false, app.*.logging.file=${PID}-test.log, app.*.endpoints.logfile.sensitive=false, app.*.management.endpoints.web.exposure.include=*}
12-Nov-2019 00:16:08 2019-11-12 00:16:08.564  INFO 20842 --- [           main] o.s.c.d.a.test.NamedChannelTests         : Checking: Stream=HTTP-SOURCE-1, status = deploying, status description = The stream is being deployed.
12-Nov-2019 00:16:08 2019-11-12 00:16:08.564  INFO 20842 --- [           main] o.s.c.d.a.test.NamedChannelTests         : Sleeping to check status of Stream=HTTP-SOURCE-1
12-Nov-2019 00:16:18 2019-11-12 00:16:18.622  INFO 20842 --- [           main] o.s.c.d.a.test.NamedChannelTests         : Checking: Stream=HTTP-SOURCE-1, status = deployed, status description = The stream has been successfully deployed
12-Nov-2019 00:16:18 2019-11-12 00:16:18.651  INFO 20842 --- [           main] o.s.c.d.a.test.NamedChannelTests         : Sleeping to check status of Stream=HTTP-SOURCE-1
12-Nov-2019 00:16:28 2019-11-12 00:16:28.651  INFO 20842 --- [           main] o.s.c.d.a.test.NamedChannelTests         : Stream 'HTTP-SOURCE-1' started with status: deployed
12-Nov-2019 00:16:28 2019-11-12 00:16:28.652  INFO 20842 --- [           main] o.s.c.d.a.test.NamedChannelTests         : App 'http' has instances: {HTTP-SOURCE-1.http-v1-0=http://10.194.6.127:51667}
12-Nov-2019 00:16:28 2019-11-12 00:16:28.652  INFO 20842 --- [           main] o.s.c.d.a.test.NamedChannelTests         : Looking for 'Started HttpSource' in logfile for http
12-Nov-2019 00:16:38 2019-11-12 00:16:38.653  INFO 20842 --- [           main] o.s.c.d.a.test.NamedChannelTests         : Requesting log for app HTTP-SOURCE-1.http-v1-0
12-Nov-2019 00:16:38 2019-11-12 00:16:38.949  INFO 20842 --- [           main] o.s.c.d.a.test.NamedChannelTests         : Retrieved logfile from 'http://10.194.6.127:51667/actuator/logfile
12-Nov-2019 00:16:38 2019-11-12 00:16:38.950  INFO 20842 --- [           main] o.s.c.d.a.test.NamedChannelTests         : Matched all 'Started HttpSource' in logfile for app http (source HTTP-SOURCE-1.http-v1-0)
12-Nov-2019 00:16:38 2019-11-12 00:16:38.950  INFO 20842 --- [           main] o.s.c.d.a.test.NamedChannelTests         : Creating stream 'HTTP-SOURCE-2'
12-Nov-2019 00:16:38 2019-11-12 00:16:38.977  INFO 20842 --- [           main] o.s.c.d.a.test.NamedChannelTests         : Deploying stream 'HTTP-SOURCE-2' with properties: {app.*.spring.cloud.streamapp.security.enabled=false, app.*.logging.file=${PID}-test.log, app.*.endpoints.logfile.sensitive=false, app.*.management.endpoints.web.exposure.include=*}
12-Nov-2019 00:16:39 2019-11-12 00:16:39.448  INFO 20842 --- [           main] o.s.c.d.a.test.NamedChannelTests         : Checking: Stream=HTTP-SOURCE-2, status = deploying, status description = The stream is being deployed.
12-Nov-2019 00:16:39 2019-11-12 00:16:39.448  INFO 20842 --- [           main] o.s.c.d.a.test.NamedChannelTests         : Sleeping to check status of Stream=HTTP-SOURCE-2
12-Nov-2019 00:16:49 2019-11-12 00:16:49.529  INFO 20842 --- [           main] o.s.c.d.a.test.NamedChannelTests         : Checking: Stream=HTTP-SOURCE-2, status = deployed, status description = The stream has been successfully deployed
12-Nov-2019 00:16:49 2019-11-12 00:16:49.566  INFO 20842 --- [           main] o.s.c.d.a.test.NamedChannelTests         : Sleeping to check status of Stream=HTTP-SOURCE-2
12-Nov-2019 00:16:59 2019-11-12 00:16:59.567  INFO 20842 --- [           main] o.s.c.d.a.test.NamedChannelTests         : Stream 'HTTP-SOURCE-2' started with status: deployed
12-Nov-2019 00:16:59 2019-11-12 00:16:59.567  INFO 20842 --- [           main] o.s.c.d.a.test.NamedChannelTests         : App 'http' has instances: {HTTP-SOURCE-2.http-v1-0=http://10.194.6.127:28096}
12-Nov-2019 00:16:59 2019-11-12 00:16:59.567  INFO 20842 --- [           main] o.s.c.d.a.test.NamedChannelTests         : Looking for 'Started HttpSource' in logfile for http
12-Nov-2019 00:17:09 2019-11-12 00:17:09.567  INFO 20842 --- [           main] o.s.c.d.a.test.NamedChannelTests         : Requesting log for app HTTP-SOURCE-2.http-v1-0
12-Nov-2019 00:17:09 2019-11-12 00:17:09.860  INFO 20842 --- [           main] o.s.c.d.a.test.NamedChannelTests         : Retrieved logfile from 'http://10.194.6.127:28096/actuator/logfile
12-Nov-2019 00:17:09 2019-11-12 00:17:09.860  INFO 20842 --- [           main] o.s.c.d.a.test.NamedChannelTests         : Matched all 'Started HttpSource' in logfile for app http (source HTTP-SOURCE-2.http-v1-0)
12-Nov-2019 00:17:10 2019-11-12 00:17:10.079  INFO 20842 --- [           main] o.s.c.d.a.test.NamedChannelTests         : Looking for 'abcdefg' in logfile for log
12-Nov-2019 00:17:20 2019-11-12 00:17:20.079  INFO 20842 --- [           main] o.s.c.d.a.test.NamedChannelTests         : Requesting log for app MANY-TO-ONE.log-v1-0
12-Nov-2019 00:17:20 2019-11-12 00:17:20.096  INFO 20842 --- [           main] o.s.c.d.a.test.NamedChannelTests         : Retrieved logfile from 'http://10.194.6.127:53528/actuator/logfile
12-Nov-2019 00:17:20 2019-11-12 00:17:20.096  INFO 20842 --- [           main] o.s.c.d.a.test.NamedChannelTests         : Matched all 'abcdefg' in logfile for app log (source MANY-TO-ONE.log-v1-0)
12-Nov-2019 00:17:20 2019-11-12 00:17:20.255  INFO 20842 --- [           main] o.s.c.d.a.test.NamedChannelTests         : Looking for 'hijklmn' in logfile for log
12-Nov-2019 00:17:30 2019-11-12 00:17:30.255  INFO 20842 --- [           main] o.s.c.d.a.test.NamedChannelTests         : Requesting log for app MANY-TO-ONE.log-v1-0
12-Nov-2019 00:17:30 2019-11-12 00:17:30.267  INFO 20842 --- [           main] o.s.c.d.a.test.NamedChannelTests         : Retrieved logfile from 'http://10.194.6.127:53528/actuator/logfile
12-Nov-2019 00:17:30 2019-11-12 00:17:30.267  INFO 20842 --- [           main] o.s.c.d.a.test.NamedChannelTests         : Matched all 'hijklmn' in logfile for app log (source MANY-TO-ONE.log-v1-0)
12-Nov-2019 00:17:30 2019-11-12 00:17:30.270  INFO 20842 --- [           main] junit.logTestName                        : Test manyToOneTest(org.springframework.cloud.dataflow.acceptance.test.NamedChannelTests) Succeeded
12-Nov-2019 00:17:30 2019-11-12 00:17:30.270  INFO 20842 --- [           main] junit.logTestName                        : Finished Test manyToOneTest(org.springframework.cloud.dataflow.acceptance.test.NamedChannelTests)
12-Nov-2019 00:17:30 2019-11-12 00:17:30.270  INFO 20842 --- [           main] o.s.c.d.a.test.NamedChannelTests         : Destroy all streams
12-Nov-2019 00:17:30 Tests run: 4, Failures: 0, Errors: 0, Skipped: 1, Time elapsed: 278.278 sec - in org.springframework.cloud.dataflow.acceptance.test.NamedChannelTests
12-Nov-2019 00:17:30 Running org.springframework.cloud.dataflow.acceptance.test.util.PlatformHelperTests
12-Nov-2019 00:17:30 Tests run: 3, Failures: 0, Errors: 0, Skipped: 0, Time elapsed: 0.071 sec - in org.springframework.cloud.dataflow.acceptance.test.util.PlatformHelperTests
12-Nov-2019 00:17:30 Running org.springframework.cloud.dataflow.acceptance.test.util.ApplicationTests
12-Nov-2019 00:17:30 Tests run: 2, Failures: 0, Errors: 0, Skipped: 0, Time elapsed: 0 sec - in org.springframework.cloud.dataflow.acceptance.test.util.ApplicationTests
12-Nov-2019 00:17:30 2019-11-12 00:17:30.757  INFO 20842 --- [       Thread-6] o.s.c.support.GenericApplicationContext  : Closing org.springframework.context.support.GenericApplicationContext@2eeb0f9b: startup date [Tue Nov 12 00:04:51 UTC 2019]; root of context hierarchy
12-Nov-2019 00:17:30
12-Nov-2019 00:17:30 Results :
12-Nov-2019 00:17:30
12-Nov-2019 00:17:30 Tests run: 22, Failures: 0, Errors: 0, Skipped: 4
12-Nov-2019 00:17:30
12-Nov-2019 00:17:30 [INFO]
12-Nov-2019 00:17:30 [INFO] >>> maven-surefire-report-plugin:3.0.0-M3:report (default-cli) > [surefire]test @ spring-cloud-dataflow-acceptance-tests >>>
12-Nov-2019 00:17:30 [INFO]
12-Nov-2019 00:17:30 [INFO] --- maven-checkstyle-plugin:2.17:check (checkstyle-validation) @ spring-cloud-dataflow-acceptance-tests ---
12-Nov-2019 00:17:30 [INFO]
12-Nov-2019 00:17:30 [INFO] --- maven-resources-plugin:2.6:resources (default-resources) @ spring-cloud-dataflow-acceptance-tests ---
12-Nov-2019 00:17:30 [INFO] Using 'UTF-8' encoding to copy filtered resources.
12-Nov-2019 00:17:30 [INFO] skip non existing resourceDirectory /opt/bamboo-home/xml-data/build-dir/SCDT-LOCAL20XSKIPPER20X-KAFKA/src/main/resources
12-Nov-2019 00:17:30 [INFO] skip non existing resourceDirectory /opt/bamboo-home/xml-data/build-dir/SCDT-LOCAL20XSKIPPER20X-KAFKA/src/main/resources
12-Nov-2019 00:17:30 [INFO]
12-Nov-2019 00:17:30 [INFO] --- maven-compiler-plugin:3.1:compile (default-compile) @ spring-cloud-dataflow-acceptance-tests ---
12-Nov-2019 00:17:30 [INFO] Nothing to compile - all classes are up to date
12-Nov-2019 00:17:30 [INFO]
12-Nov-2019 00:17:30 [INFO] --- maven-resources-plugin:2.6:testResources (default-testResources) @ spring-cloud-dataflow-acceptance-tests ---
12-Nov-2019 00:17:30 [INFO] Using 'UTF-8' encoding to copy filtered resources.
12-Nov-2019 00:17:30 [INFO] Copying 1 resource
12-Nov-2019 00:17:30 [INFO]
12-Nov-2019 00:17:30 [INFO] --- maven-compiler-plugin:3.1:testCompile (default-testCompile) @ spring-cloud-dataflow-acceptance-tests ---
12-Nov-2019 00:17:30 [INFO] Nothing to compile - all classes are up to date
12-Nov-2019 00:17:30 [INFO]
12-Nov-2019 00:17:30 [INFO] --- maven-surefire-plugin:2.18.1:test (default-test) @ spring-cloud-dataflow-acceptance-tests ---
12-Nov-2019 00:17:30 [INFO] Skipping execution of surefire because it has already been run for this configuration
12-Nov-2019 00:17:30 [INFO]
12-Nov-2019 00:17:30 [INFO] <<< maven-surefire-report-plugin:3.0.0-M3:report (default-cli) < [surefire]test @ spring-cloud-dataflow-acceptance-tests <<<
12-Nov-2019 00:17:30 [INFO]
12-Nov-2019 00:17:30 [INFO] --- maven-surefire-report-plugin:3.0.0-M3:report (default-cli) @ spring-cloud-dataflow-acceptance-tests ---
12-Nov-2019 00:17:31 [WARNING] Unable to locate Test Source XRef to link to - DISABLED
12-Nov-2019 00:17:31 [INFO] ------------------------------------------------------------------------
12-Nov-2019 00:17:31 [INFO] BUILD SUCCESS
12-Nov-2019 00:17:31 [INFO] ------------------------------------------------------------------------
12-Nov-2019 00:17:31 [INFO] Total time: 15:26 min
12-Nov-2019 00:17:31 [INFO] Finished at: 2019-11-12T00:17:31+00:00
12-Nov-2019 00:17:31 [INFO] Final Memory: 59M/485M
12-Nov-2019 00:17:31 [INFO] ------------------------------------------------------------------------
12-Nov-2019 00:17:31 Clean up, clean up, everybody everywhere; clean up clean up, everybody do your share!
12-Nov-2019 00:17:31 Clean up servers
12-Nov-2019 00:17:31 Killing process PID [20721]
12-Nov-2019 00:17:31 Killing process PID [20611]
12-Nov-2019 00:17:32 No stopped containers
12-Nov-2019 00:17:32 Stopping mysql_mysql_1 ...
12-Nov-2019 00:17:34
12-Nov-2019 00:17:34 Stopping mysql_mysql_1 ... done
12-Nov-2019 00:17:35 Removing mysql_mysql_1 ...
12-Nov-2019 00:17:35
12-Nov-2019 00:17:35 Removing mysql_mysql_1 ... done
12-Nov-2019 00:17:35 Going to remove mysql_mysql_1
12-Nov-2019 00:17:35 Stopping kafka_zookeeper_1 ...
12-Nov-2019 00:17:35 Stopping kafka_kafka_1     ...
12-Nov-2019 00:17:39
12-Nov-2019 00:17:39 Stopping kafka_kafka_1     ... done
12-Nov-2019 00:17:46
12-Nov-2019 00:17:46 Stopping kafka_zookeeper_1 ... done
12-Nov-2019 00:17:46 Removing kafka_zookeeper_1 ...
12-Nov-2019 00:17:46 Removing kafka_kafka_1     ...
12-Nov-2019 00:17:46
12-Nov-2019 00:17:46 Removing kafka_kafka_1     ... done
12-Nov-2019 00:17:46
12-Nov-2019 00:17:46 Removing kafka_zookeeper_1 ... done
12-Nov-2019 00:17:46 Going to remove kafka_zookeeper_1, kafka_kafka_1
12-Nov-2019 00:17:46
12-Nov-2019 00:17:46 Finished task 'Execute Acceptance Tests' with result: Success
12-Nov-2019 00:17:46 Starting task 'JUnit Parser' of type 'com.atlassian.bamboo.plugins.testresultparser:task.testresultparser.junit'
12-Nov-2019 00:17:46 Parsing test results under /opt/bamboo-home/xml-data/build-dir/SCDT-LOCAL20XSKIPPER20X-KAFKA...
12-Nov-2019 00:17:46 Finished task 'JUnit Parser' with result: Success
12-Nov-2019 00:17:46 Starting task 'clean up' of type 'com.atlassian.bamboo.plugins.scripttask:task.builder.script'
12-Nov-2019 00:17:46
Beginning to execute external process for build 'Spring Cloud Data Flow Acceptance Tests - Local + SCDF-2.0.4.BS + Skipper 2.0.4.BS (12 am) - Run Data Flow Acceptance Tests for Kafka #164 (SCDT-LOCAL20XSKIPPER20X-KAFKA-164)'
... running command line:
/opt/bamboo-home/temp/SCDT-LOCAL20XSKIPPER20X-KAFKA-164-ScriptBuildTask-2002177334819806042.sh
... in: /opt/bamboo-home/xml-data/build-dir/SCDT-LOCAL20XSKIPPER20X-KAFKA
... using extra environment variables:
bamboo_planRepository_1_branch=master
bamboo_********_username_password=********
bamboo_signing_store_password=********
bamboo_capability_system_builder_ant_Ant_1_9=/opt/ant-1.9
bamboo_capability_system_builder_ant_Ant_1_8=/opt/ant-1.8
bamboo_planRepository_1_branchDisplayName=master
bamboo_repository_274694331_git_username=spring-buildmaster
bamboo_artifactory_override_resolve_repo=libs-milestone
bamboo_capability_system_builder_node_Node_js_10_16=/opt/node-10.16/bin/node
bamboo_repository_revision_number=ccc77f664d11e18a3b7f2fa17f012d09d08432a9
bamboo_RIAK_BIN=/usr/sbin/riak
bamboo_buildKey=SCDT-LOCAL20XSKIPPER20X-KAFKA
bamboo_repository_274694331_branch_name=master
bamboo_ge_cache_username=ci
bamboo_bintray_password=********
bamboo_sonar_token_password=********
bamboo_shortJobName=Run Data Flow Acceptance Tests for Kafka
bamboo_artifactory_override_resolver_password=********
bamboo_sonatype_token=RSJChaox
bamboo_capability_system_builder_gradle___gradlew=./gradlew
bamboo_buildResultsUrl=https://build.spring.io/browse/SCDT-LOCAL20XSKIPPER20X-KAFKA-164
bamboo_capability_system_builder_mvn3_Maven_3_3=/opt/maven-3.3
bamboo_capability_system_builder_mvn3_Maven_3_2=/opt/maven-3.2
bamboo_capability_system_builder_mvn3_Maven_3_1=/opt/maven-3.1
bamboo_planRepository_repositoryUrl=https://github.com/spring-cloud/spring-cloud-dataflow-acceptance-tests.git
bamboo_capability_system_builder_mvn3_Maven_3_6=/opt/maven-3.6
bamboo_agentId=286195718
bamboo_capability_system_builder_mvn3_Maven_3_5=/opt/maven-3.5
bamboo_capability_system_builder_mvn3_Maven_3_0=/opt/maven-3.0
bamboo_planRepository_revision=ccc77f664d11e18a3b7f2fa17f012d09d08432a9
bamboo_planRepository_previousRevision=ccc77f664d11e18a3b7f2fa17f012d09d08432a9
bamboo_capability_remote_build=true
bamboo_repository_branch_name=master
bamboo_sonatype_token_password=********
bamboo_sonatype_user=springsource
bamboo_repository_274694331_name=Git
bamboo_scdf_acceptance_tests_password=********
bamboo_APPLE_AC_PASSWORD=********
bamboo_repository_274694331_git_branch=master
bamboo_planRepository_branch=master
bamboo_capability_system_jdk_JDK_13=/opt/jdk-13
bamboo_planRepository_1_type=gitv2
bamboo_planRepository_branchName=master
bamboo_capability_system_jdk_JDK_12=/opt/jdk-12
bamboo_capability_system_builder_gradlew_gradlew=./
bamboo_capability_system_builder_ant_Ant_1_10=/opt/ant-1.10
bamboo_sonar_password=********
bamboo_hg_cache_directory=/opt/bamboo-home/xml-data/build-dir/_hg-repositories-cache
bamboo_planRepository_1_username=spring-buildmaster
bamboo_repository_274694331_git_repositoryUrl=https://github.com/spring-cloud/spring-cloud-dataflow-acceptance-tests.git
bamboo_planRepository_type=gitv2
bamboo_git_cache_directory=/opt/bamboo-home/xml-data/build-dir/_git-repositories-cache
bamboo_artifactory_username=buildmaster
bamboo_tmp_directory=/opt/bamboo-home/temp
bamboo_planKey=SCDT-LOCAL20XSKIPPER20X
bamboo_planRepository_username=spring-buildmaster
bamboo_JDK8_HOME=/opt/jdk-8
bamboo_repository_274694331_previous_revision_number=ccc77f664d11e18a3b7f2fa17f012d09d08432a9
bamboo_planRepository_1_branchName=master
bamboo_sonar_version=6.7.7
bamboo_sonar_jdbc_password=********
bamboo_bintray_api_key_password=********
bamboo_capability_system_jdk_JDK_1_11=/opt/jdk-11
bamboo_resultsUrl=https://build.spring.io/browse/SCDT-LOCAL20XSKIPPER20X-KAFKA-164
bamboo_APPLE_AC_USERNAME_PASSWORD=********
bamboo_capability_system_jdk_JDK_1_10=/opt/jdk-10
bamboo_build_working_directory=/opt/bamboo-home/xml-data/build-dir/SCDT-LOCAL20XSKIPPER20X-KAFKA
bamboo_planRepository_1_name=Git
bamboo_capability_system_os=ubuntu1804
bamboo_nexusPush_stagingProfile=buildmaster
bamboo_shortPlanName=Local + SCDF-2.0.4.BS + Skipper 2.0.4.BS (12 am)
bamboo_planRepository_name=Git
bamboo_buildNumber=164
bamboo_planName=Spring Cloud Data Flow Acceptance Tests - Local + SCDF-2.0.4.BS + Skipper 2.0.4.BS (12 am)
bamboo_JDK7_HOME=/opt/jdk-7
bamboo_build_commandline_com_atlassian_bamboo_plugins_scripttask_task_builder_script_7=/opt/bamboo-home/temp/SCDT-LOCAL20XSKIPPER20X-KAFKA-164-ScriptBuildTask-3108864050079511872.sh
bamboo_shortPlanKey=LOCAL20XSKIPPER20X
bamboo_shortJobKey=KAFKA
bamboo_artifactory_password=********
bamboo_buildTimeStamp=2019-11-12T00:00:12.051Z
bamboo_repository_previous_revision_number=ccc77f664d11e18a3b7f2fa17f012d09d08432a9
bamboo_sonar_username=buildmaster
bamboo_********_password=********
bamboo_repository_git_branch=master
bamboo_buildResultKey=SCDT-LOCAL20XSKIPPER20X-KAFKA-164
bamboo_nexusPush_close=true
bamboo_artifactory_override_resolver_username=buildmaster
bamboo_buildPlanName=Spring Cloud Data Flow Acceptance Tests - Local + SCDF-2.0.4.BS + Skipper 2.0.4.BS (12 am) - Run Data Flow Acceptance Tests for Kafka
bamboo_repository_274694331_revision_number=ccc77f664d11e18a3b7f2fa17f012d09d08432a9
bamboo_planRepository_1_revision=ccc77f664d11e18a3b7f2fa17f012d09d08432a9
bamboo_repository_name=Git
bamboo_signing_key_password=********
bamboo_capability_system_builder_groovy_Groovy_2_5=/opt/groovy-2.5
bamboo_buildFailed=false
bamboo_capability_system_docker_executable=/usr/bin/docker
bamboo_capability_system_jdk_OpenJDK_7=/opt/jdk-7
bamboo_capability_system_builder_groovy_Groovy_2_4=/opt/groovy-2.4
bamboo_artifactory_override_deployer_username=buildmaster
bamboo_capability_system_builder_command_Bash=/bin/bash
bamboo_jobFailed=false
bamboo_agentWorkingDirectory=/opt/bamboo-home/xml-data/build-dir
bamboo_capability_system_git_executable=/usr/bin/git
bamboo_repository_git_username=spring-buildmaster
bamboo_planRepository_1_previousRevision=ccc77f664d11e18a3b7f2fa17f012d09d08432a9
bamboo_capability_os_family=unix
bamboo_planRepository_branchDisplayName=master
bamboo_capability_system_builder_maven_Artifactory_Maven_3_6=/opt/maven-3.6
bamboo_capability_system_builder_maven_Artifactory_Maven_3_5=/opt/maven-3.5
bamboo_capability_system_builder_maven_Artifactory_Maven_3_3=/opt/maven-3.3
bamboo_capability_system_builder_maven_Artifactory_Maven_3_2=/opt/maven-3.2
bamboo_s3_properties=/home/bamboo/tools/s3.properties
bamboo_capability_system_builder_maven_Artifactory_Maven_3_1=/opt/maven-3.1
bamboo_artifactory_override_deploy_repo=libs-snapshot-local
bamboo_capability_system_builder_maven_Artifactory_Maven_3_0=/opt/maven-3.0
bamboo_plan_storageTag=plan-274497908
bamboo_bintray_username_password=********
bamboo_repository_git_repositoryUrl=https://github.com/spring-cloud/spring-cloud-dataflow-acceptance-tests.git
bamboo_working_directory=/opt/bamboo-home/xml-data/build-dir/SCDT-LOCAL20XSKIPPER20X-KAFKA
bamboo_planRepository_1_repositoryUrl=https://github.com/spring-cloud/spring-cloud-dataflow-acceptance-tests.git
bamboo_capability_system_jdk_JDK_1_8=/opt/jdk-8
bamboo_artifactory_override_deployer_password=********
bamboo_capability_system_jdk_JDK_1_9=/opt/jdk-9
bamboo_capability_system_jdk_JDK_1_6=/opt/jdk-6
bamboo_sonatype_password=********
bamboo_capability_system_jdk_JDK_1_7=/opt/jdk-7
bamboo_sonar_ip=10.194.6.9
bamboo_ge_cache_password=********
12-Nov-2019 00:17:46 CLEANING UP RESOURCES AFTER RUNNING TESTS
12-Nov-2019 00:17:46 Environment variable JAVA_HOME must be set
12-Nov-2019 00:17:46 FINISHED CLEANING UP RESOURCES
12-Nov-2019 00:17:46 Finished task 'clean up' with result: Success
12-Nov-2019 00:17:46 Running post build plugin 'Docker Container Cleanup'
12-Nov-2019 00:17:46 Running post build plugin 'NCover Results Collector'
12-Nov-2019 00:17:46 Running post build plugin 'Artifactory Release Management Staging'
12-Nov-2019 00:17:46 Running post build plugin 'Artifactory Build Info Copier'
12-Nov-2019 00:17:46 Running post build plugin 'Artifactory Gradle Properties Info Copier'
12-Nov-2019 00:17:46 Running post build plugin 'Clover Results Collector'
12-Nov-2019 00:17:46 Running post build plugin 'npm Cache Cleanup'
12-Nov-2019 00:17:46 Running post build plugin 'Artifact Copier'
12-Nov-2019 00:17:46 Publishing an artifact: App and Server Logs
12-Nov-2019 00:17:46 Finished publishing of artifact Non required job artifact: [App and Server Logs], pattern: [**/*.log] anchored at: [local] in 48.33 ms
12-Nov-2019 00:17:46 Publishing an artifact: Test Results
12-Nov-2019 00:17:46 Finished publishing of artifact Non required job artifact: [Test Results], pattern: [**/target/surefire-reports/**/*.*] in 39.87 ms
12-Nov-2019 00:17:46 Successfully removed working directory at '/opt/bamboo-home/xml-data/build-dir/SCDT-LOCAL20XSKIPPER20X-KAFKA'
12-Nov-2019 00:17:46 Finalising the build...
12-Nov-2019 00:17:46 Stopping timer.
12-Nov-2019 00:17:46 Build SCDT-LOCAL20XSKIPPER20X-KAFKA-164 completed.
12-Nov-2019 00:17:46 Running on server: post build plugin 'NCover Results Collector'
12-Nov-2019 00:17:46 Running on server: post build plugin 'Build Hanging Detection Configuration'
12-Nov-2019 00:17:46 Running on server: post build plugin 'Bamboo project link creator'
12-Nov-2019 00:17:46 Running on server: post build plugin 'Clover Delta Calculator'
12-Nov-2019 00:17:46 Running on server: post build plugin 'Maven Dependencies Postprocessor'
12-Nov-2019 00:17:46 All post build plugins have finished
12-Nov-2019 00:17:46 Generating build results summary...
12-Nov-2019 00:17:46 Saving build results to disk...
12-Nov-2019 00:17:46 Logging substituted variables...
12-Nov-2019 00:17:47 Indexing build results...
12-Nov-2019 00:17:47 Finished building SCDT-LOCAL20XSKIPPER20X-KAFKA-164.