Build: #193 failed

Job: Run Data Flow Acceptance Tests for Kafka was successful

Stages & jobs

  1. Test Stage - Kafka

  2. Test Stage - Rabbit

Build log

The build generated 815 lines of output. Download or view full build log

11-Dec-2019 00:03:40 Build Spring Cloud Data Flow Acceptance Tests - Local + SCDF-2.0.4.BS + Skipper 2.0.4.BS (12 am) - Run Data Flow Acceptance Tests for Kafka #193 (SCDT-LOCAL20XSKIPPER20X-KAFKA-193) started building on agent bamboo-23.af.pivotal.io
11-Dec-2019 00:03:40 Remote agent on host bamboo-23.af.pivotal.io
11-Dec-2019 00:03:40 Build working directory is /opt/bamboo-home/xml-data/build-dir/SCDT-LOCAL20XSKIPPER20X-KAFKA
11-Dec-2019 00:03:40 Executing build Spring Cloud Data Flow Acceptance Tests - Local + SCDF-2.0.4.BS + Skipper 2.0.4.BS (12 am) - Run Data Flow Acceptance Tests for Kafka #193 (SCDT-LOCAL20XSKIPPER20X-KAFKA-193)
11-Dec-2019 00:03:40 Starting task 'Checkout Default Repository' of type 'com.atlassian.bamboo.plugins.vcs:task.vcs.checkout'
11-Dec-2019 00:03:40 Checking out into /opt/bamboo-home/xml-data/build-dir/SCDT-LOCAL20XSKIPPER20X-KAFKA
11-Dec-2019 00:03:40 Updating source code to revision: ccc77f664d11e18a3b7f2fa17f012d09d08432a9
11-Dec-2019 00:03:40 Creating local git repository in '/opt/bamboo-home/xml-data/build-dir/SCDT-LOCAL20XSKIPPER20X-KAFKA/.git'.
11-Dec-2019 00:03:40 Initialized empty Git repository in /opt/bamboo-home/xml-data/build-dir/SCDT-LOCAL20XSKIPPER20X-KAFKA/.git/
11-Dec-2019 00:03:40 Fetching 'refs/heads/master' from 'https://github.com/spring-cloud/spring-cloud-dataflow-acceptance-tests.git'.
11-Dec-2019 00:03:43 From https://github.com/spring-cloud/spring-cloud-dataflow-acceptance-tests
11-Dec-2019 00:03:43 * [new branch]      master     -> master
11-Dec-2019 00:03:43 Checking out revision ccc77f664d11e18a3b7f2fa17f012d09d08432a9.
11-Dec-2019 00:03:43 Already on 'master'
11-Dec-2019 00:03:43 Updated source code to revision: ccc77f664d11e18a3b7f2fa17f012d09d08432a9
11-Dec-2019 00:03:43 Finished task 'Checkout Default Repository' with result: Success
11-Dec-2019 00:03:43 Running pre-build action: Artifactory Release Staging
11-Dec-2019 00:03:43 Running pre-build action: VCS Version Collector
11-Dec-2019 00:03:43 Starting task 'Execute Acceptance Tests' of type 'com.atlassian.bamboo.plugins.scripttask:task.builder.script'
11-Dec-2019 00:03:43
Beginning to execute external process for build 'Spring Cloud Data Flow Acceptance Tests - Local + SCDF-2.0.4.BS + Skipper 2.0.4.BS (12 am) - Run Data Flow Acceptance Tests for Kafka #193 (SCDT-LOCAL20XSKIPPER20X-KAFKA-193)'
... running command line:
/opt/bamboo-home/temp/SCDT-LOCAL20XSKIPPER20X-KAFKA-193-ScriptBuildTask-3314422636666466517.sh
... in: /opt/bamboo-home/xml-data/build-dir/SCDT-LOCAL20XSKIPPER20X-KAFKA
... using extra environment variables:
bamboo_planRepository_1_branch=master
bamboo_********_username_password=********
bamboo_signing_store_password=********
bamboo_capability_system_builder_ant_Ant_1_9=/opt/ant-1.9
bamboo_capability_system_builder_ant_Ant_1_8=/opt/ant-1.8
bamboo_planRepository_1_branchDisplayName=master
bamboo_repository_274694331_git_username=spring-buildmaster
bamboo_artifactory_override_resolve_repo=libs-milestone
bamboo_capability_system_builder_node_Node_js_10_16=/opt/node-10.16/bin/node
bamboo_repository_revision_number=ccc77f664d11e18a3b7f2fa17f012d09d08432a9
bamboo_RIAK_BIN=/usr/sbin/riak
bamboo_buildKey=SCDT-LOCAL20XSKIPPER20X-KAFKA
bamboo_repository_274694331_branch_name=master
bamboo_ge_cache_username=ci
bamboo_bintray_password=********
bamboo_sonar_token_password=********
bamboo_shortJobName=Run Data Flow Acceptance Tests for Kafka
bamboo_artifactory_override_resolver_password=********
bamboo_sonatype_token=RSJChaox
bamboo_capability_system_builder_gradle___gradlew=./gradlew
bamboo_buildResultsUrl=https://build.spring.io/browse/SCDT-LOCAL20XSKIPPER20X-KAFKA-193
bamboo_capability_system_builder_mvn3_Maven_3_3=/opt/maven-3.3
bamboo_capability_system_builder_mvn3_Maven_3_2=/opt/maven-3.2
bamboo_capability_system_builder_mvn3_Maven_3_1=/opt/maven-3.1
bamboo_planRepository_repositoryUrl=https://github.com/spring-cloud/spring-cloud-dataflow-acceptance-tests.git
bamboo_capability_system_builder_mvn3_Maven_3_6=/opt/maven-3.6
bamboo_agentId=286195717
bamboo_capability_system_builder_mvn3_Maven_3_5=/opt/maven-3.5
bamboo_capability_system_builder_mvn3_Maven_3_0=/opt/maven-3.0
bamboo_planRepository_revision=ccc77f664d11e18a3b7f2fa17f012d09d08432a9
bamboo_planRepository_previousRevision=ccc77f664d11e18a3b7f2fa17f012d09d08432a9
bamboo_capability_remote_build=true
bamboo_repository_branch_name=master
bamboo_sonatype_token_password=********
bamboo_sonatype_user=springsource
bamboo_repository_274694331_name=Git
bamboo_scdf_acceptance_tests_password=********
bamboo_APPLE_AC_PASSWORD=********
JAVA_HOME=/opt/jdk-8
bamboo_repository_274694331_git_branch=master
bamboo_planRepository_branch=master
bamboo_capability_system_jdk_JDK_13=/opt/jdk-13
bamboo_planRepository_1_type=gitv2
bamboo_planRepository_branchName=master
bamboo_capability_system_jdk_JDK_12=/opt/jdk-12
bamboo_capability_system_builder_gradlew_gradlew=./
bamboo_capability_system_builder_ant_Ant_1_10=/opt/ant-1.10
bamboo_sonar_password=********
bamboo_hg_cache_directory=/opt/bamboo-home/xml-data/build-dir/_hg-repositories-cache
bamboo_planRepository_1_username=spring-buildmaster
bamboo_repository_274694331_git_repositoryUrl=https://github.com/spring-cloud/spring-cloud-dataflow-acceptance-tests.git
bamboo_planRepository_type=gitv2
bamboo_git_cache_directory=/opt/bamboo-home/xml-data/build-dir/_git-repositories-cache
bamboo_artifactory_username=buildmaster
bamboo_tmp_directory=/opt/bamboo-home/temp
bamboo_planKey=SCDT-LOCAL20XSKIPPER20X
bamboo_planRepository_username=spring-buildmaster
bamboo_JDK8_HOME=/opt/jdk-8
bamboo_repository_274694331_previous_revision_number=ccc77f664d11e18a3b7f2fa17f012d09d08432a9
bamboo_planRepository_1_branchName=master
bamboo_sonar_version=6.7.7
bamboo_sonar_jdbc_password=********
bamboo_bintray_api_key_password=********
bamboo_capability_system_jdk_JDK_1_11=/opt/jdk-11
bamboo_resultsUrl=https://build.spring.io/browse/SCDT-LOCAL20XSKIPPER20X-KAFKA-193
bamboo_APPLE_AC_USERNAME_PASSWORD=********
bamboo_capability_system_jdk_JDK_1_10=/opt/jdk-10
bamboo_build_working_directory=/opt/bamboo-home/xml-data/build-dir/SCDT-LOCAL20XSKIPPER20X-KAFKA
bamboo_planRepository_1_name=Git
bamboo_capability_system_os=ubuntu1804
bamboo_nexusPush_stagingProfile=buildmaster
bamboo_shortPlanName=Local + SCDF-2.0.4.BS + Skipper 2.0.4.BS (12 am)
bamboo_planRepository_name=Git
bamboo_buildNumber=193
bamboo_planName=Spring Cloud Data Flow Acceptance Tests - Local + SCDF-2.0.4.BS + Skipper 2.0.4.BS (12 am)
bamboo_JDK7_HOME=/opt/jdk-7
bamboo_shortPlanKey=LOCAL20XSKIPPER20X
bamboo_shortJobKey=KAFKA
bamboo_artifactory_password=********
bamboo_buildTimeStamp=2019-12-11T00:00:05.528Z
bamboo_repository_previous_revision_number=ccc77f664d11e18a3b7f2fa17f012d09d08432a9
bamboo_sonar_username=buildmaster
bamboo_********_password=********
bamboo_repository_git_branch=master
bamboo_buildResultKey=SCDT-LOCAL20XSKIPPER20X-KAFKA-193
bamboo_nexusPush_close=true
bamboo_artifactory_override_resolver_username=buildmaster
bamboo_buildPlanName=Spring Cloud Data Flow Acceptance Tests - Local + SCDF-2.0.4.BS + Skipper 2.0.4.BS (12 am) - Run Data Flow Acceptance Tests for Kafka
bamboo_repository_274694331_revision_number=ccc77f664d11e18a3b7f2fa17f012d09d08432a9
bamboo_planRepository_1_revision=ccc77f664d11e18a3b7f2fa17f012d09d08432a9
bamboo_repository_name=Git
bamboo_signing_key_password=********
bamboo_capability_system_builder_groovy_Groovy_2_5=/opt/groovy-2.5
bamboo_buildFailed=false
bamboo_capability_system_docker_executable=/usr/bin/docker
bamboo_capability_system_jdk_OpenJDK_7=/opt/jdk-7
bamboo_capability_system_builder_groovy_Groovy_2_4=/opt/groovy-2.4
bamboo_artifactory_override_deployer_username=buildmaster
bamboo_capability_system_builder_command_Bash=/bin/bash
bamboo_agentWorkingDirectory=/opt/bamboo-home/xml-data/build-dir
bamboo_capability_system_git_executable=/usr/bin/git
bamboo_repository_git_username=spring-buildmaster
bamboo_planRepository_1_previousRevision=ccc77f664d11e18a3b7f2fa17f012d09d08432a9
bamboo_capability_os_family=unix
bamboo_planRepository_branchDisplayName=master
bamboo_capability_system_builder_maven_Artifactory_Maven_3_6=/opt/maven-3.6
bamboo_capability_system_builder_maven_Artifactory_Maven_3_5=/opt/maven-3.5
bamboo_capability_system_builder_maven_Artifactory_Maven_3_3=/opt/maven-3.3
bamboo_capability_system_builder_maven_Artifactory_Maven_3_2=/opt/maven-3.2
bamboo_s3_properties=/home/bamboo/tools/s3.properties
bamboo_capability_system_builder_maven_Artifactory_Maven_3_1=/opt/maven-3.1
bamboo_artifactory_override_deploy_repo=libs-snapshot-local
bamboo_capability_system_builder_maven_Artifactory_Maven_3_0=/opt/maven-3.0
bamboo_plan_storageTag=plan-274497908
bamboo_bintray_username_password=********
bamboo_repository_git_repositoryUrl=https://github.com/spring-cloud/spring-cloud-dataflow-acceptance-tests.git
bamboo_working_directory=/opt/bamboo-home/xml-data/build-dir/SCDT-LOCAL20XSKIPPER20X-KAFKA
bamboo_planRepository_1_repositoryUrl=https://github.com/spring-cloud/spring-cloud-dataflow-acceptance-tests.git
bamboo_capability_system_jdk_JDK_1_8=/opt/jdk-8
bamboo_artifactory_override_deployer_password=********
bamboo_capability_system_jdk_JDK_1_9=/opt/jdk-9
bamboo_capability_system_jdk_JDK_1_6=/opt/jdk-6
bamboo_sonatype_password=********
bamboo_capability_system_jdk_JDK_1_7=/opt/jdk-7
bamboo_sonar_ip=10.194.6.9
bamboo_ge_cache_password=********
11-Dec-2019 00:03:43 CLEANING UP RESOURCES BEFORE TESTS
11-Dec-2019 00:03:43 Setting the environment variables
11-Dec-2019 00:03:43 Export the unset env. variables from /opt/bamboo-home/xml-data/build-dir/SCDT-LOCAL20XSKIPPER20X-KAFKA/local/init/env.properties :
11-Dec-2019 00:03:43    SPRING_CLOUD_DATAFLOW_SERVER_DOWNLOAD_URL = https://repo.spring.io/libs-snapshot/org/springframework/cloud/spring-cloud-dataflow-server-local//spring-cloud-dataflow-server-local-.jar
11-Dec-2019 00:03:43    SPRING_CLOUD_SKIPPER_SERVER_DOWNLOAD_URL = https://repo.spring.io/libs-snapshot/org/springframework/cloud/spring-cloud-skipper-server//spring-cloud-skipper-server-.jar
11-Dec-2019 00:03:43    SPRING_DATASOURCE_USERNAME = spring
11-Dec-2019 00:03:43    SPRING_DATASOURCE_PASSWORD = cloud
11-Dec-2019 00:03:43    SPRING_SCHEMA_NAME = dataflow
11-Dec-2019 00:03:43    DOCKER_SERVER = localhost
11-Dec-2019 00:03:43 Setting retries to 60 and WAIT_TIME to 5
11-Dec-2019 00:03:43 Export the unset env. variables from /opt/bamboo-home/xml-data/build-dir/SCDT-LOCAL20XSKIPPER20X-KAFKA/local/binder/rabbit/env.properties :
11-Dec-2019 00:03:43    STREAM_REGISTRATION_RESOURCE = https://dataflow.spring.io/latest-stream-applications-rabbit-maven
11-Dec-2019 00:03:43    TASK_REGISTRATION_RESOURCE = https://dataflow.spring.io/latest-task-applications-maven
11-Dec-2019 00:03:43 SCDF SERVER URI: http://localhost:9393
11-Dec-2019 00:03:43 Clean up, clean up, everybody everywhere; clean up clean up, everybody do your share!
11-Dec-2019 00:03:43 Clean up servers
11-Dec-2019 00:03:44 No stopped containers
11-Dec-2019 00:03:45 No stopped containers
11-Dec-2019 00:03:46 No stopped containers
11-Dec-2019 00:03:46 FINISHED CLEANING UP RESOURCES
11-Dec-2019 00:03:46 Setting the environment variables
11-Dec-2019 00:03:46 Export the unset env. variables from /opt/bamboo-home/xml-data/build-dir/SCDT-LOCAL20XSKIPPER20X-KAFKA/local/init/env.properties :
11-Dec-2019 00:03:46    SPRING_CLOUD_DATAFLOW_SERVER_DOWNLOAD_URL = https://repo.spring.io/libs-snapshot/org/springframework/cloud/spring-cloud-dataflow-server/2.0.4.BUILD-SNAPSHOT/spring-cloud-dataflow-server-2.0.4.BUILD-SNAPSHOT.jar
11-Dec-2019 00:03:46    SPRING_CLOUD_SKIPPER_SERVER_DOWNLOAD_URL = https://repo.spring.io/libs-snapshot/org/springframework/cloud/spring-cloud-skipper-server/2.0.4.BUILD-SNAPSHOT/spring-cloud-skipper-server-2.0.4.BUILD-SNAPSHOT.jar
11-Dec-2019 00:03:46    SPRING_DATASOURCE_USERNAME = spring
11-Dec-2019 00:03:46    SPRING_DATASOURCE_PASSWORD = cloud
11-Dec-2019 00:03:46    SPRING_SCHEMA_NAME = dataflow
11-Dec-2019 00:03:46    DOCKER_SERVER = localhost
11-Dec-2019 00:03:46 Setting retries to 60 and WAIT_TIME to 5
11-Dec-2019 00:03:46 cleaning up any previous mysql docker containers...
11-Dec-2019 00:03:46 done cleaning up.
11-Dec-2019 00:03:46 Could not find a local mysql server, trying docker.
11-Dec-2019 00:03:46 Pulling mysql (mysql:5.7)...
11-Dec-2019 00:03:47 5.7: Pulling from library/mysql
11-Dec-2019 00:04:01 Digest: sha256:5779c71a4730da36f013a23a437b5831198e68e634575f487d37a0639470e3a8
11-Dec-2019 00:04:01 Status: Downloaded newer image for mysql:5.7
11-Dec-2019 00:04:01 Creating mysql_mysql_1 ...
11-Dec-2019 00:04:02
11-Dec-2019 00:04:02 Creating mysql_mysql_1 ... done
11-Dec-2019 00:04:02 mysql running on localhost:3306
11-Dec-2019 00:04:02 Service host is localhost
11-Dec-2019 00:04:02 Creating kafka compose file on /opt/bamboo-home/xml-data/build-dir/SCDT-LOCAL20XSKIPPER20X-KAFKA/local/binder/kafka/docker-compose.yml
11-Dec-2019 00:04:02 cleaning up any previous kafka docker containers...
11-Dec-2019 00:04:02 done cleaning up
11-Dec-2019 00:04:02 Could not find a local kafka server, trying docker.
11-Dec-2019 00:04:02 Pulling zookeeper (wurstmeister/zookeeper:)...
11-Dec-2019 00:04:03 latest: Pulling from wurstmeister/zookeeper
11-Dec-2019 00:04:15 Digest: sha256:7a7fd44a72104bfbd24a77844bad5fabc86485b036f988ea927d1780782a6680
11-Dec-2019 00:04:16 Status: Downloaded newer image for wurstmeister/zookeeper:latest
11-Dec-2019 00:04:16 Pulling kafka (wurstmeister/kafka:2.11-0.11.0.3)...
11-Dec-2019 00:04:16 2.11-0.11.0.3: Pulling from wurstmeister/kafka
11-Dec-2019 00:04:26 Digest: sha256:04df57268bb64654df6487b3f345748fd8412a9c01953a4c1d15c2e41d413113
11-Dec-2019 00:04:26 Status: Downloaded newer image for wurstmeister/kafka:2.11-0.11.0.3
11-Dec-2019 00:04:26 Creating kafka_zookeeper_1 ...
11-Dec-2019 00:04:26 Creating kafka_kafka_1     ...
11-Dec-2019 00:04:28
11-Dec-2019 00:04:28 Creating kafka_kafka_1     ... done
11-Dec-2019 00:04:29
11-Dec-2019 00:04:29 Creating kafka_zookeeper_1 ... done
11-Dec-2019 00:04:29 kafka running on localhost:9092
11-Dec-2019 00:04:29 Export the unset env. variables from /opt/bamboo-home/xml-data/build-dir/SCDT-LOCAL20XSKIPPER20X-KAFKA/local/binder/kafka/env.properties :
11-Dec-2019 00:04:29    STREAM_REGISTRATION_RESOURCE = https://dataflow.spring.io/latest-stream-applications-kafka-maven
11-Dec-2019 00:04:29    TASK_REGISTRATION_RESOURCE = https://dataflow.spring.io/latest-task-applications-maven
11-Dec-2019 00:04:29 cleaning up any previous redis docker containers...
11-Dec-2019 00:04:29 done cleaning up.
11-Dec-2019 00:04:30 redis found on localhost
11-Dec-2019 00:04:30 SKIPPER SERVER URI: http://localhost:7577
11-Dec-2019 00:04:30 Downloading server from https://repo.spring.io/libs-snapshot/org/springframework/cloud/spring-cloud-skipper-server/2.0.4.BUILD-SNAPSHOT/spring-cloud-skipper-server-2.0.4.BUILD-SNAPSHOT.jar
11-Dec-2019 00:04:35 2019-12-11 00:04:35 URL:https://repo.spring.io/libs-snapshot/org/springframework/cloud/spring-cloud-skipper-server/2.0.4.BUILD-SNAPSHOT/spring-cloud-skipper-server-2.0.4.BUILD-SNAPSHOT.jar [84387317/84387317] -> "/opt/bamboo-home/xml-data/build-dir/SCDT-LOCAL20XSKIPPER20X-KAFKA/local/skipper-server/skipper-server.jar" [1]
11-Dec-2019 00:04:35 executing [nohup /opt/jdk-8/bin/java  -Dlogging.level.org.springframework.cloud.deployer.spi.local.LocalAppDeployer=DEBUG -Xmx1024m -Xss1024k -jar /opt/bamboo-home/xml-data/build-dir/SCDT-LOCAL20XSKIPPER20X-KAFKA/local/skipper-server/skipper-server.jar  --spring.datasource.driver-class-name=org.mariadb.jdbc.Driver --spring.datasource.url=jdbc:mysql://localhost/dataflow --spring.datasource.username=spring --spring.datasource.password=cloud  --spring.cloud.dataflow.applicationProperties.stream.spring.cloud.stream.kafka.binder.brokers=localhost --spring.cloud.dataflow.applicationProperties.stream.spring.cloud.stream.kafka.binder.zkNodes=localhost  --spring.redis.host=127.0.0.1 --spring.cloud.skipper.server.platform.local.accounts.default.workingDirectoriesRoot=/opt/bamboo-home/xml-data/build-dir/SCDT-LOCAL20XSKIPPER20X-KAFKA/local/skipper-server/app-logs > /opt/bamboo-home/xml-data/build-dir/SCDT-LOCAL20XSKIPPER20X-KAFKA/local/skipper-server/skipper-server.log &]
11-Dec-2019 00:04:35 [/opt/bamboo-home/xml-data/build-dir/SCDT-LOCAL20XSKIPPER20X-KAFKA/local/skipper-server] process pid is [9133]
11-Dec-2019 00:04:35 System props are []
11-Dec-2019 00:04:35 Logs are under [/opt/bamboo-home/xml-data/build-dir/SCDT-LOCAL20XSKIPPER20X-KAFKA/local/skipper-server/skipper-server.log] or from nohup [/opt/bamboo-home/xml-data/build-dir/SCDT-LOCAL20XSKIPPER20X-KAFKA/local/skipper-server/nohup.log]
11-Dec-2019 00:04:35 Failed to connect to localhost:7577. Attempt  #1/60... will try again in [5] seconds
11-Dec-2019 00:04:40 Failed to connect to localhost:7577. Attempt  #2/60... will try again in [5] seconds
11-Dec-2019 00:04:45 Failed to connect to localhost:7577. Attempt  #3/60... will try again in [5] seconds
11-Dec-2019 00:04:50 Failed to connect to localhost:7577. Attempt  #4/60... will try again in [5] seconds
11-Dec-2019 00:04:56 SCDF SERVER URI: http://localhost:9393
11-Dec-2019 00:04:56 Downloading server from https://repo.spring.io/libs-snapshot/org/springframework/cloud/spring-cloud-dataflow-server/2.0.4.BUILD-SNAPSHOT/spring-cloud-dataflow-server-2.0.4.BUILD-SNAPSHOT.jar
11-Dec-2019 00:05:00 2019-12-11 00:05:00 URL:https://repo.spring.io/libs-snapshot/org/springframework/cloud/spring-cloud-dataflow-server/2.0.4.BUILD-SNAPSHOT/spring-cloud-dataflow-server-2.0.4.BUILD-SNAPSHOT.jar [87897631/87897631] -> "/opt/bamboo-home/xml-data/build-dir/SCDT-LOCAL20XSKIPPER20X-KAFKA/local/server/scdf-server.jar" [1]
11-Dec-2019 00:05:00 SPRING_PROFILES_ACTIVE []
11-Dec-2019 00:05:00 executing [nohup /opt/jdk-8/bin/java  -Xmx1024m -Xss1024k -jar /opt/bamboo-home/xml-data/build-dir/SCDT-LOCAL20XSKIPPER20X-KAFKA/local/server/scdf-server.jar  --spring.datasource.driver-class-name=org.mariadb.jdbc.Driver --spring.datasource.url=jdbc:mysql://localhost/dataflow --spring.datasource.username=spring --spring.datasource.password=cloud  --spring.cloud.dataflow.applicationProperties.stream.spring.cloud.stream.kafka.binder.brokers=localhost --spring.cloud.dataflow.applicationProperties.stream.spring.cloud.stream.kafka.binder.zkNodes=localhost  --spring.redis.host=127.0.0.1 --spring.cloud.skipper.server.platform.local.accounts.default.workingDirectoriesRoot=/opt/bamboo-home/xml-data/build-dir/SCDT-LOCAL20XSKIPPER20X-KAFKA/local/skipper-server/app-logs --spring.cloud.dataflow.features.skipper-enabled=true > /opt/bamboo-home/xml-data/build-dir/SCDT-LOCAL20XSKIPPER20X-KAFKA/local/server/scdf-server.log &]
11-Dec-2019 00:05:00 [/opt/bamboo-home/xml-data/build-dir/SCDT-LOCAL20XSKIPPER20X-KAFKA/local/server] process pid is [9209]
11-Dec-2019 00:05:00 System props are []
11-Dec-2019 00:05:00 Logs are under [/opt/bamboo-home/xml-data/build-dir/SCDT-LOCAL20XSKIPPER20X-KAFKA/local/server/scdf-server.log] or from nohup [/opt/bamboo-home/xml-data/build-dir/SCDT-LOCAL20XSKIPPER20X-KAFKA/local/server/nohup.log]
11-Dec-2019 00:05:00 Failed to connect to localhost:9393. Attempt  #1/60... will try again in [5] seconds
11-Dec-2019 00:05:05 Failed to connect to localhost:9393. Attempt  #2/60... will try again in [5] seconds
11-Dec-2019 00:05:10 Failed to connect to localhost:9393. Attempt  #3/60... will try again in [5] seconds
11-Dec-2019 00:05:16 SCDF SERVER ABOUT:
11-Dec-2019 00:05:16 --2019-12-11 00:05:16--  http://localhost:9393/about
11-Dec-2019 00:05:16 Resolving localhost (localhost)... ::1, 127.0.0.1
11-Dec-2019 00:05:16 Connecting to localhost (localhost)|::1|:9393... connected.
11-Dec-2019 00:05:16 HTTP request sent, awaiting response... 200
11-Dec-2019 00:05:16 Length: unspecified [application/hal+json]
11-Dec-2019 00:05:16 Saving to: ‘STDOUT’
11-Dec-2019 00:05:16
11-Dec-2019 00:05:16      0K .                                                       204M=0s
11-Dec-2019 00:05:16
11-Dec-2019 00:05:16 2019-12-11 00:05:16 (204 MB/s) - written to stdout [1681]
11-Dec-2019 00:05:16
11-Dec-2019 00:05:16 {
11-Dec-2019 00:05:16     "_links": {
11-Dec-2019 00:05:16         "self": {
11-Dec-2019 00:05:16             "href": "http://localhost:9393/about"
11-Dec-2019 00:05:16         }
11-Dec-2019 00:05:16     },
11-Dec-2019 00:05:16     "featureInfo": {
11-Dec-2019 00:05:16         "analyticsEnabled": true,
11-Dec-2019 00:05:16         "grafanaEnabled": false,
11-Dec-2019 00:05:16         "schedulesEnabled": false,
11-Dec-2019 00:05:16         "streamsEnabled": true,
11-Dec-2019 00:05:16         "tasksEnabled": true
11-Dec-2019 00:05:16     },
11-Dec-2019 00:05:16     "grafanaInfo": {
11-Dec-2019 00:05:16         "refreshInterval": 15,
11-Dec-2019 00:05:16         "url": ""
11-Dec-2019 00:05:16     },
11-Dec-2019 00:05:16     "runtimeEnvironment": {
11-Dec-2019 00:05:16         "appDeployer": {
11-Dec-2019 00:05:16             "deployerImplementationVersion": "2.0.4.BUILD-SNAPSHOT",
11-Dec-2019 00:05:16             "deployerName": "Spring Cloud Skipper Server",
11-Dec-2019 00:05:16             "deployerSpiVersion": "2.0.3.RELEASE",
11-Dec-2019 00:05:16             "javaVersion": "1.8.0_232",
11-Dec-2019 00:05:16             "platformApiVersion": "",
11-Dec-2019 00:05:16             "platformClientVersion": "",
11-Dec-2019 00:05:16             "platformHostVersion": "",
11-Dec-2019 00:05:16             "platformSpecificInfo": {
11-Dec-2019 00:05:16                 "default": "local"
11-Dec-2019 00:05:16             },
11-Dec-2019 00:05:16             "platformType": "Skipper Managed",
11-Dec-2019 00:05:16             "springBootVersion": "2.1.3.RELEASE",
11-Dec-2019 00:05:16             "springVersion": "5.1.5.RELEASE"
11-Dec-2019 00:05:16         },
11-Dec-2019 00:05:16         "taskLaunchers": [
11-Dec-2019 00:05:16             {
11-Dec-2019 00:05:16                 "deployerImplementationVersion": "2.0.3.RELEASE",
11-Dec-2019 00:05:16                 "deployerName": "LocalTaskLauncher",
11-Dec-2019 00:05:16                 "deployerSpiVersion": "2.0.2.RELEASE",
11-Dec-2019 00:05:16                 "javaVersion": "1.8.0_232",
11-Dec-2019 00:05:16                 "platformApiVersion": "Linux 4.15.0-66-generic",
11-Dec-2019 00:05:16                 "platformClientVersion": "4.15.0-66-generic",
11-Dec-2019 00:05:16                 "platformHostVersion": "4.15.0-66-generic",
11-Dec-2019 00:05:16                 "platformSpecificInfo": {},
11-Dec-2019 00:05:16                 "platformType": "Local",
11-Dec-2019 00:05:16                 "springBootVersion": "2.1.3.RELEASE",
11-Dec-2019 00:05:16                 "springVersion": "5.1.5.RELEASE"
11-Dec-2019 00:05:16             }
11-Dec-2019 00:05:16         ]
11-Dec-2019 00:05:16     },
11-Dec-2019 00:05:16     "securityInfo": {
11-Dec-2019 00:05:16         "authenticated": false,
11-Dec-2019 00:05:16         "authenticationEnabled": false,
11-Dec-2019 00:05:16         "roles": [],
11-Dec-2019 00:05:16         "username": null
11-Dec-2019 00:05:16     },
11-Dec-2019 00:05:16     "versionInfo": {
11-Dec-2019 00:05:16         "core": {
11-Dec-2019 00:05:16             "name": "Spring Cloud Data Flow Core",
11-Dec-2019 00:05:16             "version": "2.0.4.BUILD-SNAPSHOT"
11-Dec-2019 00:05:16         },
11-Dec-2019 00:05:16         "dashboard": {
11-Dec-2019 00:05:16             "name": "Spring Cloud Dataflow UI",
11-Dec-2019 00:05:16             "version": "2.0.3.RELEASE"
11-Dec-2019 00:05:16         },
11-Dec-2019 00:05:16         "implementation": {
11-Dec-2019 00:05:16             "name": "spring-cloud-dataflow-server",
11-Dec-2019 00:05:16             "version": "2.0.4.BUILD-SNAPSHOT"
11-Dec-2019 00:05:16         },
11-Dec-2019 00:05:16         "shell": {
11-Dec-2019 00:05:16             "name": "Spring Cloud Data Flow Shell",
11-Dec-2019 00:05:16             "url": "https://repo.spring.io/libs-snapshot/org/springframework/cloud/spring-cloud-dataflow-shell/2.0.4.BUILD-SNAPSHOT/spring-cloud-dataflow-shell-2.0.4.BUILD-SNAPSHOT.jar",
11-Dec-2019 00:05:16             "version": "2.0.4.BUILD-SNAPSHOT"
11-Dec-2019 00:05:16         }
11-Dec-2019 00:05:16     }
11-Dec-2019 00:05:16 }
11-Dec-2019 00:05:16 SKIPPER SERVER ABOUT:
11-Dec-2019 00:05:16 --2019-12-11 00:05:16--  http://localhost:7577/api/about
11-Dec-2019 00:05:16 Resolving localhost (localhost)... ::1, 127.0.0.1
11-Dec-2019 00:05:16 Connecting to localhost (localhost)|::1|:7577... connected.
11-Dec-2019 00:05:16 HTTP request sent, awaiting response... 200
11-Dec-2019 00:05:16 Length: unspecified [application/hal+json]
11-Dec-2019 00:05:16 Saving to: ‘STDOUT’
11-Dec-2019 00:05:16
11-Dec-2019 00:05:16      0K                                                        67.5M=0s
11-Dec-2019 00:05:16
11-Dec-2019 00:05:16 2019-12-11 00:05:16 (67.5 MB/s) - written to stdout [426]
11-Dec-2019 00:05:16
11-Dec-2019 00:05:16 {
11-Dec-2019 00:05:16     "versionInfo": {
11-Dec-2019 00:05:16         "server": {
11-Dec-2019 00:05:16             "name": "Spring Cloud Skipper Server",
11-Dec-2019 00:05:16             "version": "2.0.4.BUILD-SNAPSHOT"
11-Dec-2019 00:05:16         },
11-Dec-2019 00:05:16         "shell": {
11-Dec-2019 00:05:16             "name": "Spring Cloud Skipper Shell",
11-Dec-2019 00:05:16             "url": "https://repo.spring.io/libs-snapshot/org/springframework/cloud/spring-cloud-skipper-shell/2.0.4.BUILD-SNAPSHOT/spring-cloud-skipper-shell-2.0.4.BUILD-SNAPSHOT.jar",
11-Dec-2019 00:05:16             "version": "2.0.4.BUILD-SNAPSHOT"
11-Dec-2019 00:05:16         }
11-Dec-2019 00:05:16     }
11-Dec-2019 00:05:16 }
11-Dec-2019 00:05:17 [INFO] Scanning for projects...
11-Dec-2019 00:05:18 [INFO] Downloading: https://repo.spring.io/libs-milestone-local/org/apache/maven/plugins/maven-metadata.xml
11-Dec-2019 00:05:18 [INFO] Downloading: https://repo.spring.io/libs-milestone-local/org/codehaus/mojo/maven-metadata.xml
11-Dec-2019 00:05:18 [INFO] Downloading: https://repo.spring.io/libs-snapshot-local/org/codehaus/mojo/maven-metadata.xml
11-Dec-2019 00:05:18 [INFO] Downloading: https://repo.spring.io/libs-snapshot-local/org/apache/maven/plugins/maven-metadata.xml
11-Dec-2019 00:05:18 [INFO] Downloading: https://repo.spring.io/libs-milestone-local/org/apache/maven/plugins/maven-surefire-report-plugin/maven-metadata.xml
11-Dec-2019 00:05:18 [INFO] Downloading: https://repo.spring.io/libs-snapshot-local/org/apache/maven/plugins/maven-surefire-report-plugin/maven-metadata.xml
11-Dec-2019 00:05:18 [INFO]                                                                         
11-Dec-2019 00:05:18 [INFO] ------------------------------------------------------------------------
11-Dec-2019 00:05:18 [INFO] Building Data Flow Acceptance Tests 1.1.0.BUILD-SNAPSHOT
11-Dec-2019 00:05:18 [INFO] ------------------------------------------------------------------------
11-Dec-2019 00:05:19 [INFO] Downloading: https://repo.spring.io/libs-snapshot-local/org/springframework/cloud/spring-cloud-dataflow-rest-client/1.7.0.BUILD-SNAPSHOT/maven-metadata.xml
11-Dec-2019 00:05:19 [INFO] Downloaded: https://repo.spring.io/libs-snapshot-local/org/springframework/cloud/spring-cloud-dataflow-rest-client/1.7.0.BUILD-SNAPSHOT/maven-metadata.xml (2 KB at 6.9 KB/sec)
11-Dec-2019 00:05:19 [INFO] Downloading: https://repo.spring.io/libs-snapshot-local/org/springframework/cloud/spring-cloud-dataflow-parent/1.7.0.BUILD-SNAPSHOT/maven-metadata.xml
11-Dec-2019 00:05:19 [INFO] Downloaded: https://repo.spring.io/libs-snapshot-local/org/springframework/cloud/spring-cloud-dataflow-parent/1.7.0.BUILD-SNAPSHOT/maven-metadata.xml (646 B at 3.9 KB/sec)
11-Dec-2019 00:05:19 [INFO] Downloading: https://repo.spring.io/libs-snapshot-local/org/springframework/cloud/spring-cloud-dataflow-dependencies/1.7.0.BUILD-SNAPSHOT/maven-metadata.xml
11-Dec-2019 00:05:19 [INFO] Downloaded: https://repo.spring.io/libs-snapshot-local/org/springframework/cloud/spring-cloud-dataflow-dependencies/1.7.0.BUILD-SNAPSHOT/maven-metadata.xml (652 B at 4.0 KB/sec)
11-Dec-2019 00:05:19 [INFO] Downloading: https://repo.spring.io/libs-snapshot-local/org/springframework/cloud/spring-cloud-dataflow-rest-resource/1.7.0.BUILD-SNAPSHOT/maven-metadata.xml
11-Dec-2019 00:05:19 [INFO] Downloaded: https://repo.spring.io/libs-snapshot-local/org/springframework/cloud/spring-cloud-dataflow-rest-resource/1.7.0.BUILD-SNAPSHOT/maven-metadata.xml (2 KB at 7.8 KB/sec)
11-Dec-2019 00:05:19 [INFO] Downloading: https://repo.spring.io/libs-snapshot-local/org/springframework/cloud/spring-cloud-dataflow-core/1.7.0.BUILD-SNAPSHOT/maven-metadata.xml
11-Dec-2019 00:05:20 [INFO] Downloaded: https://repo.spring.io/libs-snapshot-local/org/springframework/cloud/spring-cloud-dataflow-core/1.7.0.BUILD-SNAPSHOT/maven-metadata.xml (2 KB at 7.4 KB/sec)
11-Dec-2019 00:05:20 [INFO]
11-Dec-2019 00:05:20 [INFO] --- maven-checkstyle-plugin:2.17:check (checkstyle-validation) @ spring-cloud-dataflow-acceptance-tests ---
11-Dec-2019 00:05:20 [INFO]
11-Dec-2019 00:05:20 [INFO] --- maven-resources-plugin:2.6:resources (default-resources) @ spring-cloud-dataflow-acceptance-tests ---
11-Dec-2019 00:05:20 [INFO] Using 'UTF-8' encoding to copy filtered resources.
11-Dec-2019 00:05:20 [INFO] skip non existing resourceDirectory /opt/bamboo-home/xml-data/build-dir/SCDT-LOCAL20XSKIPPER20X-KAFKA/src/main/resources
11-Dec-2019 00:05:20 [INFO] skip non existing resourceDirectory /opt/bamboo-home/xml-data/build-dir/SCDT-LOCAL20XSKIPPER20X-KAFKA/src/main/resources
11-Dec-2019 00:05:20 [INFO]
11-Dec-2019 00:05:20 [INFO] --- maven-compiler-plugin:3.1:compile (default-compile) @ spring-cloud-dataflow-acceptance-tests ---
11-Dec-2019 00:05:21 [INFO] Changes detected - recompiling the module!
11-Dec-2019 00:05:21 [INFO] Compiling 8 source files to /opt/bamboo-home/xml-data/build-dir/SCDT-LOCAL20XSKIPPER20X-KAFKA/target/classes
11-Dec-2019 00:05:21 [INFO]
11-Dec-2019 00:05:21 [INFO] --- maven-resources-plugin:2.6:testResources (default-testResources) @ spring-cloud-dataflow-acceptance-tests ---
11-Dec-2019 00:05:21 [INFO] Using 'UTF-8' encoding to copy filtered resources.
11-Dec-2019 00:05:21 [INFO] Copying 1 resource
11-Dec-2019 00:05:21 [INFO]
11-Dec-2019 00:05:21 [INFO] --- maven-compiler-plugin:3.1:testCompile (default-testCompile) @ spring-cloud-dataflow-acceptance-tests ---
11-Dec-2019 00:05:21 [INFO] Changes detected - recompiling the module!
11-Dec-2019 00:05:21 [INFO] Compiling 16 source files to /opt/bamboo-home/xml-data/build-dir/SCDT-LOCAL20XSKIPPER20X-KAFKA/target/test-classes
11-Dec-2019 00:05:22 [WARNING] /opt/bamboo-home/xml-data/build-dir/SCDT-LOCAL20XSKIPPER20X-KAFKA/src/test/java/org/springframework/cloud/dataflow/acceptance/test/AbstractTaskTests.java: Some input files use unchecked or unsafe operations.
11-Dec-2019 00:05:22 [WARNING] /opt/bamboo-home/xml-data/build-dir/SCDT-LOCAL20XSKIPPER20X-KAFKA/src/test/java/org/springframework/cloud/dataflow/acceptance/test/AbstractTaskTests.java: Recompile with -Xlint:unchecked for details.
11-Dec-2019 00:05:22 [INFO]
11-Dec-2019 00:05:22 [INFO] --- maven-surefire-plugin:2.18.1:test (default-test) @ spring-cloud-dataflow-acceptance-tests ---
11-Dec-2019 00:05:22 [INFO] Surefire report directory: /opt/bamboo-home/xml-data/build-dir/SCDT-LOCAL20XSKIPPER20X-KAFKA/target/surefire-reports
11-Dec-2019 00:05:22
11-Dec-2019 00:05:22 -------------------------------------------------------
11-Dec-2019 00:05:22 T E S T S
11-Dec-2019 00:05:22 -------------------------------------------------------
11-Dec-2019 00:05:22 2019-12-11 00:05:22.659  INFO   --- [           main] .b.t.c.SpringBootTestContextBootstrapper : Neither @ContextConfiguration nor @ContextHierarchy found for test class [org.springframework.cloud.dataflow.acceptance.test.AnalyticsTests], using SpringBootContextLoader
11-Dec-2019 00:05:22 2019-12-11 00:05:22.700  INFO   --- [           main] .b.t.c.SpringBootTestContextBootstrapper : Loaded default TestExecutionListener class names from location [META-INF/spring.factories]: [org.springframework.boot.test.mock.mockito.MockitoTestExecutionListener, org.springframework.boot.test.mock.mockito.ResetMocksTestExecutionListener, org.springframework.boot.test.autoconfigure.restdocs.RestDocsTestExecutionListener, org.springframework.boot.test.autoconfigure.web.client.MockRestServiceServerResetTestExecutionListener, org.springframework.boot.test.autoconfigure.web.servlet.MockMvcPrintOnlyOnFailureTestExecutionListener, org.springframework.boot.test.autoconfigure.web.servlet.WebDriverTestExecutionListener, org.springframework.test.context.web.ServletTestExecutionListener, org.springframework.test.context.support.DirtiesContextBeforeModesTestExecutionListener, org.springframework.test.context.support.DependencyInjectionTestExecutionListener, org.springframework.test.context.support.DirtiesContextTestExecutionListener, org.springframework.test.context.transaction.TransactionalTestExecutionListener, org.springframework.test.context.jdbc.SqlScriptsTestExecutionListener]
11-Dec-2019 00:05:22 2019-12-11 00:05:22.715  INFO   --- [           main] .b.t.c.SpringBootTestContextBootstrapper : Using TestExecutionListeners: [org.springframework.test.context.web.ServletTestExecutionListener@4b5d6a01, org.springframework.test.context.support.DirtiesContextBeforeModesTestExecutionListener@4a22f9e2, org.springframework.boot.test.autoconfigure.SpringBootDependencyInjectionTestExecutionListener@3c419631, org.springframework.test.context.support.DirtiesContextTestExecutionListener@418e7838, org.springframework.test.context.transaction.TransactionalTestExecutionListener@61230f6a, org.springframework.test.context.jdbc.SqlScriptsTestExecutionListener@3c130745, org.springframework.boot.test.mock.mockito.MockitoTestExecutionListener@cd3fee8, org.springframework.boot.test.autoconfigure.web.servlet.MockMvcPrintOnlyOnFailureTestExecutionListener@3e2e18f2, org.springframework.boot.test.autoconfigure.web.client.MockRestServiceServerResetTestExecutionListener@470f1802, org.springframework.boot.test.mock.mockito.ResetMocksTestExecutionListener@63021689, org.springframework.boot.test.autoconfigure.web.servlet.WebDriverTestExecutionListener@703580bf, org.springframework.boot.test.autoconfigure.restdocs.RestDocsTestExecutionListener@3e92efc3]
11-Dec-2019 00:05:22 2019-12-11 00:05:22.717  INFO   --- [           main] .b.t.c.SpringBootTestContextBootstrapper : Neither @ContextConfiguration nor @ContextHierarchy found for test class [org.springframework.cloud.dataflow.acceptance.test.WoodChuckTests], using SpringBootContextLoader
11-Dec-2019 00:05:22 2019-12-11 00:05:22.727  INFO   --- [           main] .b.t.c.SpringBootTestContextBootstrapper : Loaded default TestExecutionListener class names from location [META-INF/spring.factories]: [org.springframework.boot.test.mock.mockito.MockitoTestExecutionListener, org.springframework.boot.test.mock.mockito.ResetMocksTestExecutionListener, org.springframework.boot.test.autoconfigure.restdocs.RestDocsTestExecutionListener, org.springframework.boot.test.autoconfigure.web.client.MockRestServiceServerResetTestExecutionListener, org.springframework.boot.test.autoconfigure.web.servlet.MockMvcPrintOnlyOnFailureTestExecutionListener, org.springframework.boot.test.autoconfigure.web.servlet.WebDriverTestExecutionListener, org.springframework.test.context.web.ServletTestExecutionListener, org.springframework.test.context.support.DirtiesContextBeforeModesTestExecutionListener, org.springframework.test.context.support.DependencyInjectionTestExecutionListener, org.springframework.test.context.support.DirtiesContextTestExecutionListener, org.springframework.test.context.transaction.TransactionalTestExecutionListener, org.springframework.test.context.jdbc.SqlScriptsTestExecutionListener]
11-Dec-2019 00:05:22 2019-12-11 00:05:22.731  INFO   --- [           main] .b.t.c.SpringBootTestContextBootstrapper : Using TestExecutionListeners: [org.springframework.test.context.web.ServletTestExecutionListener@7ec7ffd3, org.springframework.test.context.support.DirtiesContextBeforeModesTestExecutionListener@5b239d7d, org.springframework.boot.test.autoconfigure.SpringBootDependencyInjectionTestExecutionListener@6572421, org.springframework.test.context.support.DirtiesContextTestExecutionListener@6b81ce95, org.springframework.test.context.transaction.TransactionalTestExecutionListener@2a798d51, org.springframework.test.context.jdbc.SqlScriptsTestExecutionListener@6d763516, org.springframework.boot.test.mock.mockito.MockitoTestExecutionListener@52bf72b5, org.springframework.boot.test.autoconfigure.web.servlet.MockMvcPrintOnlyOnFailureTestExecutionListener@37afeb11, org.springframework.boot.test.autoconfigure.web.client.MockRestServiceServerResetTestExecutionListener@515aebb0, org.springframework.boot.test.mock.mockito.ResetMocksTestExecutionListener@dd8ba08, org.springframework.boot.test.autoconfigure.web.servlet.WebDriverTestExecutionListener@245b4bdc, org.springframework.boot.test.autoconfigure.restdocs.RestDocsTestExecutionListener@6c64cb25]
11-Dec-2019 00:05:22 2019-12-11 00:05:22.732  INFO   --- [           main] .b.t.c.SpringBootTestContextBootstrapper : Neither @ContextConfiguration nor @ContextHierarchy found for test class [org.springframework.cloud.dataflow.acceptance.test.HttpSourceTests], using SpringBootContextLoader
11-Dec-2019 00:05:22 2019-12-11 00:05:22.741  INFO   --- [           main] .b.t.c.SpringBootTestContextBootstrapper : Loaded default TestExecutionListener class names from location [META-INF/spring.factories]: [org.springframework.boot.test.mock.mockito.MockitoTestExecutionListener, org.springframework.boot.test.mock.mockito.ResetMocksTestExecutionListener, org.springframework.boot.test.autoconfigure.restdocs.RestDocsTestExecutionListener, org.springframework.boot.test.autoconfigure.web.client.MockRestServiceServerResetTestExecutionListener, org.springframework.boot.test.autoconfigure.web.servlet.MockMvcPrintOnlyOnFailureTestExecutionListener, org.springframework.boot.test.autoconfigure.web.servlet.WebDriverTestExecutionListener, org.springframework.test.context.web.ServletTestExecutionListener, org.springframework.test.context.support.DirtiesContextBeforeModesTestExecutionListener, org.springframework.test.context.support.DependencyInjectionTestExecutionListener, org.springframework.test.context.support.DirtiesContextTestExecutionListener, org.springframework.test.context.transaction.TransactionalTestExecutionListener, org.springframework.test.context.jdbc.SqlScriptsTestExecutionListener]
11-Dec-2019 00:05:22 2019-12-11 00:05:22.744  INFO   --- [           main] .b.t.c.SpringBootTestContextBootstrapper : Using TestExecutionListeners: [org.springframework.test.context.web.ServletTestExecutionListener@40a4337a, org.springframework.test.context.support.DirtiesContextBeforeModesTestExecutionListener@6025e1b6, org.springframework.boot.test.autoconfigure.SpringBootDependencyInjectionTestExecutionListener@22ff4249, org.springframework.test.context.support.DirtiesContextTestExecutionListener@2d1ef81a, org.springframework.test.context.transaction.TransactionalTestExecutionListener@4c402120, org.springframework.test.context.jdbc.SqlScriptsTestExecutionListener@327514f, org.springframework.boot.test.mock.mockito.MockitoTestExecutionListener@5b12b668, org.springframework.boot.test.autoconfigure.web.servlet.MockMvcPrintOnlyOnFailureTestExecutionListener@1165b38, org.springframework.boot.test.autoconfigure.web.client.MockRestServiceServerResetTestExecutionListener@4c12331b, org.springframework.boot.test.mock.mockito.ResetMocksTestExecutionListener@7586beff, org.springframework.boot.test.autoconfigure.web.servlet.WebDriverTestExecutionListener@3b69e7d1, org.springframework.boot.test.autoconfigure.restdocs.RestDocsTestExecutionListener@815b41f]
11-Dec-2019 00:05:22 2019-12-11 00:05:22.759  INFO   --- [           main] .b.t.c.SpringBootTestContextBootstrapper : Neither @ContextConfiguration nor @ContextHierarchy found for test class [org.springframework.cloud.dataflow.acceptance.test.TickTockTests], using SpringBootContextLoader
11-Dec-2019 00:05:22 2019-12-11 00:05:22.768  INFO   --- [           main] .b.t.c.SpringBootTestContextBootstrapper : Loaded default TestExecutionListener class names from location [META-INF/spring.factories]: [org.springframework.boot.test.mock.mockito.MockitoTestExecutionListener, org.springframework.boot.test.mock.mockito.ResetMocksTestExecutionListener, org.springframework.boot.test.autoconfigure.restdocs.RestDocsTestExecutionListener, org.springframework.boot.test.autoconfigure.web.client.MockRestServiceServerResetTestExecutionListener, org.springframework.boot.test.autoconfigure.web.servlet.MockMvcPrintOnlyOnFailureTestExecutionListener, org.springframework.boot.test.autoconfigure.web.servlet.WebDriverTestExecutionListener, org.springframework.test.context.web.ServletTestExecutionListener, org.springframework.test.context.support.DirtiesContextBeforeModesTestExecutionListener, org.springframework.test.context.support.DependencyInjectionTestExecutionListener, org.springframework.test.context.support.DirtiesContextTestExecutionListener, org.springframework.test.context.transaction.TransactionalTestExecutionListener, org.springframework.test.context.jdbc.SqlScriptsTestExecutionListener]
11-Dec-2019 00:05:22 2019-12-11 00:05:22.771  INFO   --- [           main] .b.t.c.SpringBootTestContextBootstrapper : Using TestExecutionListeners: [org.springframework.test.context.web.ServletTestExecutionListener@55b53d44, org.springframework.test.context.support.DirtiesContextBeforeModesTestExecutionListener@482bce4f, org.springframework.boot.test.autoconfigure.SpringBootDependencyInjectionTestExecutionListener@366647c2, org.springframework.test.context.support.DirtiesContextTestExecutionListener@6a6afff2, org.springframework.test.context.transaction.TransactionalTestExecutionListener@1649b0e6, org.springframework.test.context.jdbc.SqlScriptsTestExecutionListener@865dd6, org.springframework.boot.test.mock.mockito.MockitoTestExecutionListener@4da4253, org.springframework.boot.test.autoconfigure.web.servlet.MockMvcPrintOnlyOnFailureTestExecutionListener@3972a855, org.springframework.boot.test.autoconfigure.web.client.MockRestServiceServerResetTestExecutionListener@62e7f11d, org.springframework.boot.test.mock.mockito.ResetMocksTestExecutionListener@503d687a, org.springframework.boot.test.autoconfigure.web.servlet.WebDriverTestExecutionListener@6a370f4, org.springframework.boot.test.autoconfigure.restdocs.RestDocsTestExecutionListener@2abf4075]
11-Dec-2019 00:05:22 2019-12-11 00:05:22.778  INFO   --- [           main] .b.t.c.SpringBootTestContextBootstrapper : Neither @ContextConfiguration nor @ContextHierarchy found for test class [org.springframework.cloud.dataflow.acceptance.test.TransformTests], using SpringBootContextLoader
11-Dec-2019 00:05:22 2019-12-11 00:05:22.786  INFO   --- [           main] .b.t.c.SpringBootTestContextBootstrapper : Loaded default TestExecutionListener class names from location [META-INF/spring.factories]: [org.springframework.boot.test.mock.mockito.MockitoTestExecutionListener, org.springframework.boot.test.mock.mockito.ResetMocksTestExecutionListener, org.springframework.boot.test.autoconfigure.restdocs.RestDocsTestExecutionListener, org.springframework.boot.test.autoconfigure.web.client.MockRestServiceServerResetTestExecutionListener, org.springframework.boot.test.autoconfigure.web.servlet.MockMvcPrintOnlyOnFailureTestExecutionListener, org.springframework.boot.test.autoconfigure.web.servlet.WebDriverTestExecutionListener, org.springframework.test.context.web.ServletTestExecutionListener, org.springframework.test.context.support.DirtiesContextBeforeModesTestExecutionListener, org.springframework.test.context.support.DependencyInjectionTestExecutionListener, org.springframework.test.context.support.DirtiesContextTestExecutionListener, org.springframework.test.context.transaction.TransactionalTestExecutionListener, org.springframework.test.context.jdbc.SqlScriptsTestExecutionListener]
11-Dec-2019 00:05:22 2019-12-11 00:05:22.789  INFO   --- [           main] .b.t.c.SpringBootTestContextBootstrapper : Using TestExecutionListeners: [org.springframework.test.context.web.ServletTestExecutionListener@51e69659, org.springframework.test.context.support.DirtiesContextBeforeModesTestExecutionListener@47e2e487, org.springframework.boot.test.autoconfigure.SpringBootDependencyInjectionTestExecutionListener@201a4587, org.springframework.test.context.support.DirtiesContextTestExecutionListener@61001b64, org.springframework.test.context.transaction.TransactionalTestExecutionListener@4310d43, org.springframework.test.context.jdbc.SqlScriptsTestExecutionListener@54a7079e, org.springframework.boot.test.mock.mockito.MockitoTestExecutionListener@26e356f0, org.springframework.boot.test.autoconfigure.web.servlet.MockMvcPrintOnlyOnFailureTestExecutionListener@47d9a273, org.springframework.boot.test.autoconfigure.web.client.MockRestServiceServerResetTestExecutionListener@4b8ee4de, org.springframework.boot.test.mock.mockito.ResetMocksTestExecutionListener@27f981c6, org.springframework.boot.test.autoconfigure.web.servlet.WebDriverTestExecutionListener@1b11171f, org.springframework.boot.test.autoconfigure.restdocs.RestDocsTestExecutionListener@1151e434]
11-Dec-2019 00:05:22 2019-12-11 00:05:22.800  INFO   --- [           main] .b.t.c.SpringBootTestContextBootstrapper : Neither @ContextConfiguration nor @ContextHierarchy found for test class [org.springframework.cloud.dataflow.acceptance.test.NamedChannelTests], using SpringBootContextLoader
11-Dec-2019 00:05:22 2019-12-11 00:05:22.806  INFO   --- [           main] .b.t.c.SpringBootTestContextBootstrapper : Loaded default TestExecutionListener class names from location [META-INF/spring.factories]: [org.springframework.boot.test.mock.mockito.MockitoTestExecutionListener, org.springframework.boot.test.mock.mockito.ResetMocksTestExecutionListener, org.springframework.boot.test.autoconfigure.restdocs.RestDocsTestExecutionListener, org.springframework.boot.test.autoconfigure.web.client.MockRestServiceServerResetTestExecutionListener, org.springframework.boot.test.autoconfigure.web.servlet.MockMvcPrintOnlyOnFailureTestExecutionListener, org.springframework.boot.test.autoconfigure.web.servlet.WebDriverTestExecutionListener, org.springframework.test.context.web.ServletTestExecutionListener, org.springframework.test.context.support.DirtiesContextBeforeModesTestExecutionListener, org.springframework.test.context.support.DependencyInjectionTestExecutionListener, org.springframework.test.context.support.DirtiesContextTestExecutionListener, org.springframework.test.context.transaction.TransactionalTestExecutionListener, org.springframework.test.context.jdbc.SqlScriptsTestExecutionListener]
11-Dec-2019 00:05:22 2019-12-11 00:05:22.809  INFO   --- [           main] .b.t.c.SpringBootTestContextBootstrapper : Using TestExecutionListeners: [org.springframework.test.context.web.ServletTestExecutionListener@70cf32e3, org.springframework.test.context.support.DirtiesContextBeforeModesTestExecutionListener@5a59ca5e, org.springframework.boot.test.autoconfigure.SpringBootDependencyInjectionTestExecutionListener@4bdeaabb, org.springframework.test.context.support.DirtiesContextTestExecutionListener@6c4906d3, org.springframework.test.context.transaction.TransactionalTestExecutionListener@65987993, org.springframework.test.context.jdbc.SqlScriptsTestExecutionListener@71075444, org.springframework.boot.test.mock.mockito.MockitoTestExecutionListener@4f32a3ad, org.springframework.boot.test.autoconfigure.web.servlet.MockMvcPrintOnlyOnFailureTestExecutionListener@6b695b06, org.springframework.boot.test.autoconfigure.web.client.MockRestServiceServerResetTestExecutionListener@4d1bf319, org.springframework.boot.test.mock.mockito.ResetMocksTestExecutionListener@6f53b8a, org.springframework.boot.test.autoconfigure.web.servlet.WebDriverTestExecutionListener@5c80cf32, org.springframework.boot.test.autoconfigure.restdocs.RestDocsTestExecutionListener@7d900ecf]
11-Dec-2019 00:05:22 Running org.springframework.cloud.dataflow.acceptance.test.AnalyticsTests
11-Dec-2019 00:05:22 2019-12-11 00:05:22.830  INFO   --- [           main] .b.t.c.SpringBootTestContextBootstrapper : Neither @ContextConfiguration nor @ContextHierarchy found for test class [org.springframework.cloud.dataflow.acceptance.test.AnalyticsTests], using SpringBootContextLoader
11-Dec-2019 00:05:22 2019-12-11 00:05:22.847  INFO   --- [           main] .b.t.c.SpringBootTestContextBootstrapper : Loaded default TestExecutionListener class names from location [META-INF/spring.factories]: [org.springframework.boot.test.mock.mockito.MockitoTestExecutionListener, org.springframework.boot.test.mock.mockito.ResetMocksTestExecutionListener, org.springframework.boot.test.autoconfigure.restdocs.RestDocsTestExecutionListener, org.springframework.boot.test.autoconfigure.web.client.MockRestServiceServerResetTestExecutionListener, org.springframework.boot.test.autoconfigure.web.servlet.MockMvcPrintOnlyOnFailureTestExecutionListener, org.springframework.boot.test.autoconfigure.web.servlet.WebDriverTestExecutionListener, org.springframework.test.context.web.ServletTestExecutionListener, org.springframework.test.context.support.DirtiesContextBeforeModesTestExecutionListener, org.springframework.test.context.support.DependencyInjectionTestExecutionListener, org.springframework.test.context.support.DirtiesContextTestExecutionListener, org.springframework.test.context.transaction.TransactionalTestExecutionListener, org.springframework.test.context.jdbc.SqlScriptsTestExecutionListener]
11-Dec-2019 00:05:22 2019-12-11 00:05:22.850  INFO   --- [           main] .b.t.c.SpringBootTestContextBootstrapper : Using TestExecutionListeners: [org.springframework.test.context.web.ServletTestExecutionListener@77659b30, org.springframework.test.context.support.DirtiesContextBeforeModesTestExecutionListener@456d6c1e, org.springframework.boot.test.autoconfigure.SpringBootDependencyInjectionTestExecutionListener@1e13529a, org.springframework.test.context.support.DirtiesContextTestExecutionListener@1ec9bd38, org.springframework.test.context.transaction.TransactionalTestExecutionListener@452e19ca, org.springframework.test.context.jdbc.SqlScriptsTestExecutionListener@6b0d80ed, org.springframework.boot.test.mock.mockito.MockitoTestExecutionListener@6f8e8894, org.springframework.boot.test.autoconfigure.web.servlet.MockMvcPrintOnlyOnFailureTestExecutionListener@3cfdd820, org.springframework.boot.test.autoconfigure.web.client.MockRestServiceServerResetTestExecutionListener@928763c, org.springframework.boot.test.mock.mockito.ResetMocksTestExecutionListener@e25951c, org.springframework.boot.test.autoconfigure.web.servlet.WebDriverTestExecutionListener@15f47664, org.springframework.boot.test.autoconfigure.restdocs.RestDocsTestExecutionListener@471a9022]
11-Dec-2019 00:05:23 2019-12-11 00:05:23.403  INFO 9362 --- [           main] s.c.a.AnnotationConfigApplicationContext : Refreshing org.springframework.context.annotation.AnnotationConfigApplicationContext@2fa7ae9: startup date [Wed Dec 11 00:05:23 UTC 2019]; root of context hierarchy
11-Dec-2019 00:05:23 2019-12-11 00:05:23.664  INFO 9362 --- [           main] trationDelegate$BeanPostProcessorChecker : Bean 'configurationPropertiesRebinderAutoConfiguration' of type [class org.springframework.cloud.autoconfigure.ConfigurationPropertiesRebinderAutoConfiguration$$EnhancerBySpringCGLIB$$219d8b3d] is not eligible for getting processed by all BeanPostProcessors (for example: not eligible for auto-proxying)
11-Dec-2019 00:05:23
11-Dec-2019 00:05:23   .   ____          _            __ _ _
11-Dec-2019 00:05:23 /\\ / ___'_ __ _ _(_)_ __  __ _ \ \ \ \
11-Dec-2019 00:05:23 ( ( )\___ | '_ | '_| | '_ \/ _` | \ \ \ \
11-Dec-2019 00:05:23 \\/  ___)| |_)| | | | | || (_| |  ) ) ) )
11-Dec-2019 00:05:23   '  |____| .__|_| |_|_| |_\__, | / / / /
11-Dec-2019 00:05:23 =========|_|==============|___/=/_/_/_/
11-Dec-2019 00:05:23 :: Spring Boot ::        (v1.4.1.RELEASE)
11-Dec-2019 00:05:23
11-Dec-2019 00:05:23 2019-12-11 00:05:23.962  INFO 9362 --- [           main] c.c.c.ConfigServicePropertySourceLocator : Fetching config from server at: http://localhost:8888
11-Dec-2019 00:05:24 2019-12-11 00:05:24.044  WARN 9362 --- [           main] c.c.c.ConfigServicePropertySourceLocator : Could not locate PropertySource: I/O error on GET request for "http://localhost:8888//blah": Connection refused (Connection refused); nested exception is java.net.ConnectException: Connection refused (Connection refused)
11-Dec-2019 00:05:24 2019-12-11 00:05:24.050  INFO 9362 --- [           main] o.s.c.d.acceptance.test.AnalyticsTests   : The following profiles are active: blah
11-Dec-2019 00:05:24 2019-12-11 00:05:24.249  INFO 9362 --- [           main] o.s.c.d.acceptance.test.AnalyticsTests   : Started AnalyticsTests in 1.338 seconds (JVM running for 2.019)
11-Dec-2019 00:05:24 2019-12-11 00:05:24.506  INFO 9362 --- [           main] junit.logTestName                        : Starting Test analyticsTest(org.springframework.cloud.dataflow.acceptance.test.AnalyticsTests)
11-Dec-2019 00:05:24 2019-12-11 00:05:24.512  INFO 9362 --- [           main] o.s.c.d.acceptance.test.AnalyticsTests   : Importing stream apps from uri resource: https://dataflow.spring.io/kafka-maven-latest
11-Dec-2019 00:05:26 2019-12-11 00:05:26.803  INFO 9362 --- [           main] junit.logTestName                        : Finished Test analyticsTest(org.springframework.cloud.dataflow.acceptance.test.AnalyticsTests)
11-Dec-2019 00:05:26 2019-12-11 00:05:26.804  INFO 9362 --- [           main] o.s.c.d.acceptance.test.AnalyticsTests   : Destroy all streams
11-Dec-2019 00:05:26 Tests run: 1, Failures: 0, Errors: 0, Skipped: 1, Time elapsed: 4.003 sec - in org.springframework.cloud.dataflow.acceptance.test.AnalyticsTests
11-Dec-2019 00:05:26 Running org.springframework.cloud.dataflow.acceptance.test.WoodChuckTests
11-Dec-2019 00:05:26 2019-12-11 00:05:26.837  INFO 9362 --- [           main] .b.t.c.SpringBootTestContextBootstrapper : Neither @ContextConfiguration nor @ContextHierarchy found for test class [org.springframework.cloud.dataflow.acceptance.test.WoodChuckTests], using SpringBootContextLoader
11-Dec-2019 00:05:26 2019-12-11 00:05:26.864  INFO 9362 --- [           main] .b.t.c.SpringBootTestContextBootstrapper : Loaded default TestExecutionListener class names from location [META-INF/spring.factories]: [org.springframework.boot.test.mock.mockito.MockitoTestExecutionListener, org.springframework.boot.test.mock.mockito.ResetMocksTestExecutionListener, org.springframework.boot.test.autoconfigure.restdocs.RestDocsTestExecutionListener, org.springframework.boot.test.autoconfigure.web.client.MockRestServiceServerResetTestExecutionListener, org.springframework.boot.test.autoconfigure.web.servlet.MockMvcPrintOnlyOnFailureTestExecutionListener, org.springframework.boot.test.autoconfigure.web.servlet.WebDriverTestExecutionListener, org.springframework.test.context.web.ServletTestExecutionListener, org.springframework.test.context.support.DirtiesContextBeforeModesTestExecutionListener, org.springframework.test.context.support.DependencyInjectionTestExecutionListener, org.springframework.test.context.support.DirtiesContextTestExecutionListener, org.springframework.test.context.transaction.TransactionalTestExecutionListener, org.springframework.test.context.jdbc.SqlScriptsTestExecutionListener]
11-Dec-2019 00:05:26 2019-12-11 00:05:26.866  INFO 9362 --- [           main] .b.t.c.SpringBootTestContextBootstrapper : Using TestExecutionListeners: [org.springframework.test.context.web.ServletTestExecutionListener@2643d762, org.springframework.test.context.support.DirtiesContextBeforeModesTestExecutionListener@6403e24c, org.springframework.boot.test.autoconfigure.SpringBootDependencyInjectionTestExecutionListener@2f236de0, org.springframework.test.context.support.DirtiesContextTestExecutionListener@4eba373c, org.springframework.test.context.transaction.TransactionalTestExecutionListener@767a014e, org.springframework.test.context.jdbc.SqlScriptsTestExecutionListener@d109c4f, org.springframework.boot.test.mock.mockito.MockitoTestExecutionListener@3968bc60, org.springframework.boot.test.autoconfigure.web.servlet.MockMvcPrintOnlyOnFailureTestExecutionListener@26f46fa6, org.springframework.boot.test.autoconfigure.web.client.MockRestServiceServerResetTestExecutionListener@227a47, org.springframework.boot.test.mock.mockito.ResetMocksTestExecutionListener@9596ce8, org.springframework.boot.test.autoconfigure.web.servlet.WebDriverTestExecutionListener@75ae4a1f, org.springframework.boot.test.autoconfigure.restdocs.RestDocsTestExecutionListener@70228253]
11-Dec-2019 00:05:26 2019-12-11 00:05:26.952  INFO 9362 --- [           main] junit.logTestName                        : Starting Test testPartitioning(org.springframework.cloud.dataflow.acceptance.test.WoodChuckTests)
11-Dec-2019 00:05:26 2019-12-11 00:05:26.963  INFO 9362 --- [           main] o.s.c.d.acceptance.test.WoodChuckTests   : Creating stream 'WOODCHUCK-TEST'
11-Dec-2019 00:05:27 2019-12-11 00:05:27.086  INFO 9362 --- [           main] o.s.c.d.acceptance.test.WoodChuckTests   : Deploying stream 'WOODCHUCK-TEST' with properties: {app.*.spring.cloud.streamapp.security.enabled=false, app.log.logging.pattern.level=WOODCHUCK-${INSTANCE_INDEX:${CF_INSTANCE_INDEX:${spring.cloud.stream.instanceIndex:0}}} %5p, app.*.logging.file=${PID}-test.log, app.splitter.producer.partitionKeyExpression=payload, app.*.endpoints.logfile.sensitive=false, app.log.spring.cloud.stream.kafka.bindings.input.consumer.autoRebalanceEnabled=false, app.*.management.endpoints.web.exposure.include=*, deployer.log.count=2}
11-Dec-2019 00:05:29 2019-12-11 00:05:29.374  INFO 9362 --- [           main] o.s.c.d.acceptance.test.WoodChuckTests   : Checking: Stream=WOODCHUCK-TEST, status = deploying, status description = The stream is being deployed.
11-Dec-2019 00:05:29 2019-12-11 00:05:29.375  INFO 9362 --- [           main] o.s.c.d.acceptance.test.WoodChuckTests   : Sleeping to check status of Stream=WOODCHUCK-TEST
11-Dec-2019 00:05:39 2019-12-11 00:05:39.465  INFO 9362 --- [           main] o.s.c.d.acceptance.test.WoodChuckTests   : Checking: Stream=WOODCHUCK-TEST, status = deploying, status description = The stream is being deployed.
11-Dec-2019 00:05:39 2019-12-11 00:05:39.465  INFO 9362 --- [           main] o.s.c.d.acceptance.test.WoodChuckTests   : Sleeping to check status of Stream=WOODCHUCK-TEST
11-Dec-2019 00:05:49 2019-12-11 00:05:49.550  INFO 9362 --- [           main] o.s.c.d.acceptance.test.WoodChuckTests   : Checking: Stream=WOODCHUCK-TEST, status = deploying, status description = The stream is being deployed.
11-Dec-2019 00:05:49 2019-12-11 00:05:49.551  INFO 9362 --- [           main] o.s.c.d.acceptance.test.WoodChuckTests   : Sleeping to check status of Stream=WOODCHUCK-TEST
11-Dec-2019 00:05:59 2019-12-11 00:05:59.589  INFO 9362 --- [           main] o.s.c.d.acceptance.test.WoodChuckTests   : Checking: Stream=WOODCHUCK-TEST, status = deployed, status description = The stream has been successfully deployed
11-Dec-2019 00:05:59 2019-12-11 00:05:59.638  INFO 9362 --- [           main] o.s.c.d.acceptance.test.WoodChuckTests   : Sleeping to check status of Stream=WOODCHUCK-TEST
11-Dec-2019 00:06:09 2019-12-11 00:06:09.638  INFO 9362 --- [           main] o.s.c.d.acceptance.test.WoodChuckTests   : Stream 'WOODCHUCK-TEST' started with status: deployed
11-Dec-2019 00:06:09 2019-12-11 00:06:09.639  INFO 9362 --- [           main] o.s.c.d.acceptance.test.WoodChuckTests   : App 'log' has instances: {WOODCHUCK-TEST.log-v1-0=http://10.194.6.133:43057, WOODCHUCK-TEST.log-v1-1=http://10.194.6.133:52060}
11-Dec-2019 00:06:09 2019-12-11 00:06:09.639  INFO 9362 --- [           main] o.s.c.d.acceptance.test.WoodChuckTests   : App 'http' has instances: {WOODCHUCK-TEST.http-v1-0=http://10.194.6.133:23943}
11-Dec-2019 00:06:09 2019-12-11 00:06:09.639  INFO 9362 --- [           main] o.s.c.d.acceptance.test.WoodChuckTests   : App 'splitter' has instances: {WOODCHUCK-TEST.splitter-v1-0=http://10.194.6.133:55598}
11-Dec-2019 00:06:09 2019-12-11 00:06:09.639  INFO 9362 --- [           main] o.s.c.d.acceptance.test.WoodChuckTests   : Looking for 'Started HttpSource' in logfile for http
11-Dec-2019 00:06:19 2019-12-11 00:06:19.640  INFO 9362 --- [           main] o.s.c.d.acceptance.test.WoodChuckTests   : Requesting log for app WOODCHUCK-TEST.http-v1-0
11-Dec-2019 00:06:19 2019-12-11 00:06:19.902  INFO 9362 --- [           main] o.s.c.d.acceptance.test.WoodChuckTests   : Retrieved logfile from 'http://10.194.6.133:23943/actuator/logfile
11-Dec-2019 00:06:19 2019-12-11 00:06:19.907  INFO 9362 --- [           main] o.s.c.d.acceptance.test.WoodChuckTests   : Matched all 'Started HttpSource' in logfile for app http (source WOODCHUCK-TEST.http-v1-0)
11-Dec-2019 00:06:19 2019-12-11 00:06:19.907  INFO 9362 --- [           main] o.s.c.d.acceptance.test.WoodChuckTests   : Looking for 'Started SplitterProcessor' in logfile for splitter
11-Dec-2019 00:06:29 2019-12-11 00:06:29.907  INFO 9362 --- [           main] o.s.c.d.acceptance.test.WoodChuckTests   : Requesting log for app WOODCHUCK-TEST.splitter-v1-0
11-Dec-2019 00:06:30 2019-12-11 00:06:30.056  INFO 9362 --- [           main] o.s.c.d.acceptance.test.WoodChuckTests   : Retrieved logfile from 'http://10.194.6.133:55598/actuator/logfile
11-Dec-2019 00:06:30 2019-12-11 00:06:30.056  INFO 9362 --- [           main] o.s.c.d.acceptance.test.WoodChuckTests   : Matched all 'Started SplitterProcessor' in logfile for app splitter (source WOODCHUCK-TEST.splitter-v1-0)
11-Dec-2019 00:06:30 2019-12-11 00:06:30.056  INFO 9362 --- [           main] o.s.c.d.acceptance.test.WoodChuckTests   : Looking for 'Started LogSink' in logfile for log
11-Dec-2019 00:06:40 2019-12-11 00:06:40.056  INFO 9362 --- [           main] o.s.c.d.acceptance.test.WoodChuckTests   : Requesting log for app WOODCHUCK-TEST.log-v1-0
11-Dec-2019 00:06:40 2019-12-11 00:06:40.210  INFO 9362 --- [           main] o.s.c.d.acceptance.test.WoodChuckTests   : Retrieved logfile from 'http://10.194.6.133:43057/actuator/logfile
11-Dec-2019 00:06:40 2019-12-11 00:06:40.210  INFO 9362 --- [           main] o.s.c.d.acceptance.test.WoodChuckTests   : Requesting log for app WOODCHUCK-TEST.log-v1-1
11-Dec-2019 00:06:40 2019-12-11 00:06:40.583  INFO 9362 --- [           main] o.s.c.d.acceptance.test.WoodChuckTests   : Retrieved logfile from 'http://10.194.6.133:52060/actuator/logfile
11-Dec-2019 00:06:40 2019-12-11 00:06:40.584  INFO 9362 --- [           main] o.s.c.d.acceptance.test.WoodChuckTests   : Matched all 'Started LogSink' in logfile for app log (source WOODCHUCK-TEST.log-v1-0)
11-Dec-2019 00:06:40 2019-12-11 00:06:40.814  INFO 9362 --- [           main] o.s.c.d.acceptance.test.WoodChuckTests   : Looking for 'WOODCHUCK-0,How,chuck' in logfile for log
11-Dec-2019 00:06:50 2019-12-11 00:06:50.815  INFO 9362 --- [           main] o.s.c.d.acceptance.test.WoodChuckTests   : Requesting log for app WOODCHUCK-TEST.log-v1-0
11-Dec-2019 00:06:50 2019-12-11 00:06:50.823  INFO 9362 --- [           main] o.s.c.d.acceptance.test.WoodChuckTests   : Retrieved logfile from 'http://10.194.6.133:43057/actuator/logfile
11-Dec-2019 00:06:50 2019-12-11 00:06:50.823  INFO 9362 --- [           main] o.s.c.d.acceptance.test.WoodChuckTests   : Requesting log for app WOODCHUCK-TEST.log-v1-1
11-Dec-2019 00:06:50 2019-12-11 00:06:50.831  INFO 9362 --- [           main] o.s.c.d.acceptance.test.WoodChuckTests   : Retrieved logfile from 'http://10.194.6.133:52060/actuator/logfile
11-Dec-2019 00:06:50 2019-12-11 00:06:50.831  INFO 9362 --- [           main] o.s.c.d.acceptance.test.WoodChuckTests   : Matched all 'WOODCHUCK-0,How,chuck' in logfile for app log (source WOODCHUCK-TEST.log-v1-0)
11-Dec-2019 00:06:50 2019-12-11 00:06:50.831  INFO 9362 --- [           main] o.s.c.d.acceptance.test.WoodChuckTests   : Looking for 'WOODCHUCK-1,much,wood,would,if,a,woodchuck,could' in logfile for log
11-Dec-2019 00:07:00 2019-12-11 00:07:00.832  INFO 9362 --- [           main] o.s.c.d.acceptance.test.WoodChuckTests   : Requesting log for app WOODCHUCK-TEST.log-v1-0
11-Dec-2019 00:07:00 2019-12-11 00:07:00.840  INFO 9362 --- [           main] o.s.c.d.acceptance.test.WoodChuckTests   : Retrieved logfile from 'http://10.194.6.133:43057/actuator/logfile
11-Dec-2019 00:07:00 2019-12-11 00:07:00.840  INFO 9362 --- [           main] o.s.c.d.acceptance.test.WoodChuckTests   : Requesting log for app WOODCHUCK-TEST.log-v1-1
11-Dec-2019 00:07:00 2019-12-11 00:07:00.846  INFO 9362 --- [           main] o.s.c.d.acceptance.test.WoodChuckTests   : Retrieved logfile from 'http://10.194.6.133:52060/actuator/logfile
11-Dec-2019 00:07:00 2019-12-11 00:07:00.847  INFO 9362 --- [           main] o.s.c.d.acceptance.test.WoodChuckTests   : Matched all 'WOODCHUCK-1,much,wood,would,if,a,woodchuck,could' in logfile for app log (source WOODCHUCK-TEST.log-v1-1)
11-Dec-2019 00:07:00 2019-12-11 00:07:00.848  INFO 9362 --- [           main] junit.logTestName                        : Test testPartitioning(org.springframework.cloud.dataflow.acceptance.test.WoodChuckTests) Succeeded
11-Dec-2019 00:07:00 2019-12-11 00:07:00.849  INFO 9362 --- [           main] junit.logTestName                        : Finished Test testPartitioning(org.springframework.cloud.dataflow.acceptance.test.WoodChuckTests)
11-Dec-2019 00:07:00 2019-12-11 00:07:00.849  INFO 9362 --- [           main] o.s.c.d.acceptance.test.WoodChuckTests   : Destroy all streams
11-Dec-2019 00:07:01 Tests run: 1, Failures: 0, Errors: 0, Skipped: 0, Time elapsed: 94.408 sec - in org.springframework.cloud.dataflow.acceptance.test.WoodChuckTests
11-Dec-2019 00:07:01 Running org.springframework.cloud.dataflow.acceptance.test.HttpSourceTests
11-Dec-2019 00:07:01 2019-12-11 00:07:01.273  INFO 9362 --- [           main] .b.t.c.SpringBootTestContextBootstrapper : Neither @ContextConfiguration nor @ContextHierarchy found for test class [org.springframework.cloud.dataflow.acceptance.test.HttpSourceTests], using SpringBootContextLoader
11-Dec-2019 00:07:01 2019-12-11 00:07:01.282  INFO 9362 --- [           main] .b.t.c.SpringBootTestContextBootstrapper : Loaded default TestExecutionListener class names from location [META-INF/spring.factories]: [org.springframework.boot.test.mock.mockito.MockitoTestExecutionListener, org.springframework.boot.test.mock.mockito.ResetMocksTestExecutionListener, org.springframework.boot.test.autoconfigure.restdocs.RestDocsTestExecutionListener, org.springframework.boot.test.autoconfigure.web.client.MockRestServiceServerResetTestExecutionListener, org.springframework.boot.test.autoconfigure.web.servlet.MockMvcPrintOnlyOnFailureTestExecutionListener, org.springframework.boot.test.autoconfigure.web.servlet.WebDriverTestExecutionListener, org.springframework.test.context.web.ServletTestExecutionListener, org.springframework.test.context.support.DirtiesContextBeforeModesTestExecutionListener, org.springframework.test.context.support.DependencyInjectionTestExecutionListener, org.springframework.test.context.support.DirtiesContextTestExecutionListener, org.springframework.test.context.transaction.TransactionalTestExecutionListener, org.springframework.test.context.jdbc.SqlScriptsTestExecutionListener]
11-Dec-2019 00:07:01 2019-12-11 00:07:01.284  INFO 9362 --- [           main] .b.t.c.SpringBootTestContextBootstrapper : Using TestExecutionListeners: [org.springframework.test.context.web.ServletTestExecutionListener@5a1c3cb4, org.springframework.test.context.support.DirtiesContextBeforeModesTestExecutionListener@76ad6715, org.springframework.boot.test.autoconfigure.SpringBootDependencyInjectionTestExecutionListener@56637cff, org.springframework.test.context.support.DirtiesContextTestExecutionListener@2938127d, org.springframework.test.context.transaction.TransactionalTestExecutionListener@127a7272, org.springframework.test.context.jdbc.SqlScriptsTestExecutionListener@ff23ae7, org.springframework.boot.test.mock.mockito.MockitoTestExecutionListener@423b2b62, org.springframework.boot.test.autoconfigure.web.servlet.MockMvcPrintOnlyOnFailureTestExecutionListener@2b7962a2, org.springframework.boot.test.autoconfigure.web.client.MockRestServiceServerResetTestExecutionListener@6ad16c5d, org.springframework.boot.test.mock.mockito.ResetMocksTestExecutionListener@74ea46e2, org.springframework.boot.test.autoconfigure.web.servlet.WebDriverTestExecutionListener@6f911326, org.springframework.boot.test.autoconfigure.restdocs.RestDocsTestExecutionListener@f1d0004]
11-Dec-2019 00:07:01 2019-12-11 00:07:01.370  INFO 9362 --- [           main] junit.logTestName                        : Starting Test httpSourceTests(org.springframework.cloud.dataflow.acceptance.test.HttpSourceTests)
11-Dec-2019 00:07:01 2019-12-11 00:07:01.384  INFO 9362 --- [           main] o.s.c.d.acceptance.test.HttpSourceTests  : Creating stream 'HTTP-TEST'
11-Dec-2019 00:07:01 2019-12-11 00:07:01.421  INFO 9362 --- [           main] o.s.c.d.acceptance.test.HttpSourceTests  : Deploying stream 'HTTP-TEST' with properties: {app.*.spring.cloud.streamapp.security.enabled=false, app.*.logging.file=${PID}-test.log, app.*.endpoints.logfile.sensitive=false, app.*.management.endpoints.web.exposure.include=*}
11-Dec-2019 00:07:02 2019-12-11 00:07:02.075  INFO 9362 --- [           main] o.s.c.d.acceptance.test.HttpSourceTests  : Checking: Stream=HTTP-TEST, status = deploying, status description = The stream is being deployed.
11-Dec-2019 00:07:02 2019-12-11 00:07:02.075  INFO 9362 --- [           main] o.s.c.d.acceptance.test.HttpSourceTests  : Sleeping to check status of Stream=HTTP-TEST
11-Dec-2019 00:07:12 2019-12-11 00:07:12.127  INFO 9362 --- [           main] o.s.c.d.acceptance.test.HttpSourceTests  : Checking: Stream=HTTP-TEST, status = deploying, status description = The stream is being deployed.
11-Dec-2019 00:07:12 2019-12-11 00:07:12.128  INFO 9362 --- [           main] o.s.c.d.acceptance.test.HttpSourceTests  : Sleeping to check status of Stream=HTTP-TEST
11-Dec-2019 00:07:22 2019-12-11 00:07:22.162  INFO 9362 --- [           main] o.s.c.d.acceptance.test.HttpSourceTests  : Checking: Stream=HTTP-TEST, status = deployed, status description = The stream has been successfully deployed
11-Dec-2019 00:07:22 2019-12-11 00:07:22.212  INFO 9362 --- [           main] o.s.c.d.acceptance.test.HttpSourceTests  : Sleeping to check status of Stream=HTTP-TEST
11-Dec-2019 00:07:32 2019-12-11 00:07:32.213  INFO 9362 --- [           main] o.s.c.d.acceptance.test.HttpSourceTests  : Stream 'HTTP-TEST' started with status: deployed
11-Dec-2019 00:07:32 2019-12-11 00:07:32.213  INFO 9362 --- [           main] o.s.c.d.acceptance.test.HttpSourceTests  : App 'log' has instances: {HTTP-TEST.log-v1-0=http://10.194.6.133:32104}
11-Dec-2019 00:07:32 2019-12-11 00:07:32.214  INFO 9362 --- [           main] o.s.c.d.acceptance.test.HttpSourceTests  : App 'http' has instances: {HTTP-TEST.http-v1-0=http://10.194.6.133:43774}
11-Dec-2019 00:07:32 2019-12-11 00:07:32.220  INFO 9362 --- [           main] o.s.c.d.acceptance.test.HttpSourceTests  : Looking for 'Started HttpSource' in logfile for http
11-Dec-2019 00:07:42 2019-12-11 00:07:42.220  INFO 9362 --- [           main] o.s.c.d.acceptance.test.HttpSourceTests  : Requesting log for app HTTP-TEST.http-v1-0
11-Dec-2019 00:07:42 2019-12-11 00:07:42.537  INFO 9362 --- [           main] o.s.c.d.acceptance.test.HttpSourceTests  : Retrieved logfile from 'http://10.194.6.133:43774/actuator/logfile
11-Dec-2019 00:07:42 2019-12-11 00:07:42.538  INFO 9362 --- [           main] o.s.c.d.acceptance.test.HttpSourceTests  : Matched all 'Started HttpSource' in logfile for app http (source HTTP-TEST.http-v1-0)
11-Dec-2019 00:07:42 2019-12-11 00:07:42.538  INFO 9362 --- [           main] o.s.c.d.acceptance.test.HttpSourceTests  : Looking for 'Started LogSink' in logfile for log
11-Dec-2019 00:07:52 2019-12-11 00:07:52.538  INFO 9362 --- [           main] o.s.c.d.acceptance.test.HttpSourceTests  : Requesting log for app HTTP-TEST.log-v1-0
11-Dec-2019 00:07:52 2019-12-11 00:07:52.683  INFO 9362 --- [           main] o.s.c.d.acceptance.test.HttpSourceTests  : Retrieved logfile from 'http://10.194.6.133:32104/actuator/logfile
11-Dec-2019 00:07:52 2019-12-11 00:07:52.683  INFO 9362 --- [           main] o.s.c.d.acceptance.test.HttpSourceTests  : Matched all 'Started LogSink' in logfile for app log (source HTTP-TEST.log-v1-0)
11-Dec-2019 00:07:52 2019-12-11 00:07:52.950  INFO 9362 --- [           main] o.s.c.d.acceptance.test.HttpSourceTests  : Looking for '537cbcce-3577-4939-94c4-64daa4be3ee7' in logfile for log
11-Dec-2019 00:08:02 2019-12-11 00:08:02.950  INFO 9362 --- [           main] o.s.c.d.acceptance.test.HttpSourceTests  : Requesting log for app HTTP-TEST.log-v1-0
11-Dec-2019 00:08:02 2019-12-11 00:08:02.959  INFO 9362 --- [           main] o.s.c.d.acceptance.test.HttpSourceTests  : Retrieved logfile from 'http://10.194.6.133:32104/actuator/logfile
11-Dec-2019 00:08:02 2019-12-11 00:08:02.959  INFO 9362 --- [           main] o.s.c.d.acceptance.test.HttpSourceTests  : Matched all '537cbcce-3577-4939-94c4-64daa4be3ee7' in logfile for app log (source HTTP-TEST.log-v1-0)
11-Dec-2019 00:08:02 2019-12-11 00:08:02.961  INFO 9362 --- [           main] junit.logTestName                        : Test httpSourceTests(org.springframework.cloud.dataflow.acceptance.test.HttpSourceTests) Succeeded
11-Dec-2019 00:08:02 2019-12-11 00:08:02.961  INFO 9362 --- [           main] junit.logTestName                        : Finished Test httpSourceTests(org.springframework.cloud.dataflow.acceptance.test.HttpSourceTests)
11-Dec-2019 00:08:02 2019-12-11 00:08:02.961  INFO 9362 --- [           main] o.s.c.d.acceptance.test.HttpSourceTests  : Destroy all streams
11-Dec-2019 00:08:03 Tests run: 1, Failures: 0, Errors: 0, Skipped: 0, Time elapsed: 61.922 sec - in org.springframework.cloud.dataflow.acceptance.test.HttpSourceTests
11-Dec-2019 00:08:03 Running org.springframework.cloud.dataflow.acceptance.test.TimestampTaskTests
11-Dec-2019 00:08:03 2019-12-11 00:08:03.214  INFO 9362 --- [           main] o.s.c.support.GenericApplicationContext  : Refreshing org.springframework.context.support.GenericApplicationContext@6cd3ad8a: startup date [Wed Dec 11 00:08:03 UTC 2019]; root of context hierarchy
11-Dec-2019 00:08:03 2019-12-11 00:08:03.316  INFO 9362 --- [           main] junit.logTestName                        : Starting Test timeStampTests(org.springframework.cloud.dataflow.acceptance.test.TimestampTaskTests)
11-Dec-2019 00:08:03 2019-12-11 00:08:03.317  INFO 9362 --- [           main] o.s.c.d.a.test.AbstractTaskTests         : Importing task apps from uri resource: https://dataflow.spring.io/task-maven-latest
11-Dec-2019 00:08:03 2019-12-11 00:08:03.895  INFO 9362 --- [           main] o.s.c.d.a.test.AbstractTaskTests         : Done importing task apps.
11-Dec-2019 00:08:14 2019-12-11 00:08:14.280  INFO 9362 --- [           main] junit.logTestName                        : Test timeStampTests(org.springframework.cloud.dataflow.acceptance.test.TimestampTaskTests) Succeeded
11-Dec-2019 00:08:14 2019-12-11 00:08:14.280  INFO 9362 --- [           main] junit.logTestName                        : Finished Test timeStampTests(org.springframework.cloud.dataflow.acceptance.test.TimestampTaskTests)
11-Dec-2019 00:08:14 2019-12-11 00:08:14.348  INFO 9362 --- [           main] junit.logTestName                        : Starting Test timeStampTestsMultipleLaunch(org.springframework.cloud.dataflow.acceptance.test.TimestampTaskTests)
11-Dec-2019 00:08:34 2019-12-11 00:08:34.806  INFO 9362 --- [           main] junit.logTestName                        : Test timeStampTestsMultipleLaunch(org.springframework.cloud.dataflow.acceptance.test.TimestampTaskTests) Succeeded
11-Dec-2019 00:08:34 2019-12-11 00:08:34.806  INFO 9362 --- [           main] junit.logTestName                        : Finished Test timeStampTestsMultipleLaunch(org.springframework.cloud.dataflow.acceptance.test.TimestampTaskTests)
11-Dec-2019 00:08:34 Tests run: 2, Failures: 0, Errors: 0, Skipped: 0, Time elapsed: 31.604 sec - in org.springframework.cloud.dataflow.acceptance.test.TimestampTaskTests
11-Dec-2019 00:08:34 Running org.springframework.cloud.dataflow.acceptance.test.TickTockTests
11-Dec-2019 00:08:34 2019-12-11 00:08:34.807  INFO 9362 --- [           main] .b.t.c.SpringBootTestContextBootstrapper : Neither @ContextConfiguration nor @ContextHierarchy found for test class [org.springframework.cloud.dataflow.acceptance.test.TickTockTests], using SpringBootContextLoader
11-Dec-2019 00:08:34 2019-12-11 00:08:34.812  INFO 9362 --- [           main] .b.t.c.SpringBootTestContextBootstrapper : Loaded default TestExecutionListener class names from location [META-INF/spring.factories]: [org.springframework.boot.test.mock.mockito.MockitoTestExecutionListener, org.springframework.boot.test.mock.mockito.ResetMocksTestExecutionListener, org.springframework.boot.test.autoconfigure.restdocs.RestDocsTestExecutionListener, org.springframework.boot.test.autoconfigure.web.client.MockRestServiceServerResetTestExecutionListener, org.springframework.boot.test.autoconfigure.web.servlet.MockMvcPrintOnlyOnFailureTestExecutionListener, org.springframework.boot.test.autoconfigure.web.servlet.WebDriverTestExecutionListener, org.springframework.test.context.web.ServletTestExecutionListener, org.springframework.test.context.support.DirtiesContextBeforeModesTestExecutionListener, org.springframework.test.context.support.DependencyInjectionTestExecutionListener, org.springframework.test.context.support.DirtiesContextTestExecutionListener, org.springframework.test.context.transaction.TransactionalTestExecutionListener, org.springframework.test.context.jdbc.SqlScriptsTestExecutionListener]
11-Dec-2019 00:08:34 2019-12-11 00:08:34.814  INFO 9362 --- [           main] .b.t.c.SpringBootTestContextBootstrapper : Using TestExecutionListeners: [org.springframework.test.context.web.ServletTestExecutionListener@7f6874f2, org.springframework.test.context.support.DirtiesContextBeforeModesTestExecutionListener@1a6dc589, org.springframework.boot.test.autoconfigure.SpringBootDependencyInjectionTestExecutionListener@697a34af, org.springframework.test.context.support.DirtiesContextTestExecutionListener@70211df5, org.springframework.test.context.transaction.TransactionalTestExecutionListener@4c5228e7, org.springframework.test.context.jdbc.SqlScriptsTestExecutionListener@38e7ed69, org.springframework.boot.test.mock.mockito.MockitoTestExecutionListener@806996, org.springframework.boot.test.autoconfigure.web.servlet.MockMvcPrintOnlyOnFailureTestExecutionListener@78b612c6, org.springframework.boot.test.autoconfigure.web.client.MockRestServiceServerResetTestExecutionListener@257e0827, org.springframework.boot.test.mock.mockito.ResetMocksTestExecutionListener@22752544, org.springframework.boot.test.autoconfigure.web.servlet.WebDriverTestExecutionListener@21ba2445, org.springframework.boot.test.autoconfigure.restdocs.RestDocsTestExecutionListener@69d23296]
11-Dec-2019 00:08:34 2019-12-11 00:08:34.893  INFO 9362 --- [           main] junit.logTestName                        : Starting Test tickTockUpdateRollbackTests(org.springframework.cloud.dataflow.acceptance.test.TickTockTests)
11-Dec-2019 00:08:34 2019-12-11 00:08:34.925  INFO 9362 --- [           main] o.s.c.d.acceptance.test.TickTockTests    : Creating stream 'TICKTOCK'
11-Dec-2019 00:08:34 2019-12-11 00:08:34.956  INFO 9362 --- [           main] o.s.c.d.acceptance.test.TickTockTests    : Deploying stream 'TICKTOCK' with properties: {app.*.spring.cloud.streamapp.security.enabled=false, app.*.logging.file=${PID}-test.log, app.*.endpoints.logfile.sensitive=false, app.log.log.expression='TICKTOCK - TIMESTAMP: '.concat(payload), app.*.management.endpoints.web.exposure.include=*}
11-Dec-2019 00:08:35 2019-12-11 00:08:35.593  INFO 9362 --- [           main] o.s.c.d.acceptance.test.TickTockTests    : Checking: Stream=TICKTOCK, status = deploying, status description = The stream is being deployed.
11-Dec-2019 00:08:35 2019-12-11 00:08:35.593  INFO 9362 --- [           main] o.s.c.d.acceptance.test.TickTockTests    : Sleeping to check status of Stream=TICKTOCK
11-Dec-2019 00:08:45 2019-12-11 00:08:45.665  INFO 9362 --- [           main] o.s.c.d.acceptance.test.TickTockTests    : Checking: Stream=TICKTOCK, status = deploying, status description = The stream is being deployed.
11-Dec-2019 00:08:45 2019-12-11 00:08:45.665  INFO 9362 --- [           main] o.s.c.d.acceptance.test.TickTockTests    : Sleeping to check status of Stream=TICKTOCK
11-Dec-2019 00:08:55 2019-12-11 00:08:55.709  INFO 9362 --- [           main] o.s.c.d.acceptance.test.TickTockTests    : Checking: Stream=TICKTOCK, status = deployed, status description = The stream has been successfully deployed
11-Dec-2019 00:08:55 2019-12-11 00:08:55.755  INFO 9362 --- [           main] o.s.c.d.acceptance.test.TickTockTests    : Sleeping to check status of Stream=TICKTOCK
11-Dec-2019 00:09:05 2019-12-11 00:09:05.755  INFO 9362 --- [           main] o.s.c.d.acceptance.test.TickTockTests    : Stream 'TICKTOCK' started with status: deployed
11-Dec-2019 00:09:05 2019-12-11 00:09:05.756  INFO 9362 --- [           main] o.s.c.d.acceptance.test.TickTockTests    : App 'log' has instances: {TICKTOCK.log-v1-0=http://10.194.6.133:35340}
11-Dec-2019 00:09:05 2019-12-11 00:09:05.756  INFO 9362 --- [           main] o.s.c.d.acceptance.test.TickTockTests    : App 'time' has instances: {TICKTOCK.time-v1-0=http://10.194.6.133:42414}
11-Dec-2019 00:09:05 2019-12-11 00:09:05.756  INFO 9362 --- [           main] o.s.c.d.acceptance.test.TickTockTests    : Looking for 'Started TimeSource' in logfile for time
11-Dec-2019 00:09:15 2019-12-11 00:09:15.756  INFO 9362 --- [           main] o.s.c.d.acceptance.test.TickTockTests    : Requesting log for app TICKTOCK.time-v1-0
11-Dec-2019 00:09:16 2019-12-11 00:09:16.020  INFO 9362 --- [           main] o.s.c.d.acceptance.test.TickTockTests    : Retrieved logfile from 'http://10.194.6.133:42414/actuator/logfile
11-Dec-2019 00:09:16 2019-12-11 00:09:16.020  INFO 9362 --- [           main] o.s.c.d.acceptance.test.TickTockTests    : Matched all 'Started TimeSource' in logfile for app time (source TICKTOCK.time-v1-0)
11-Dec-2019 00:09:16 2019-12-11 00:09:16.020  INFO 9362 --- [           main] o.s.c.d.acceptance.test.TickTockTests    : Looking for 'Started LogSink' in logfile for log
11-Dec-2019 00:09:26 2019-12-11 00:09:26.020  INFO 9362 --- [           main] o.s.c.d.acceptance.test.TickTockTests    : Requesting log for app TICKTOCK.log-v1-0
11-Dec-2019 00:09:26 2019-12-11 00:09:26.143  INFO 9362 --- [           main] o.s.c.d.acceptance.test.TickTockTests    : Retrieved logfile from 'http://10.194.6.133:35340/actuator/logfile
11-Dec-2019 00:09:26 2019-12-11 00:09:26.144  INFO 9362 --- [           main] o.s.c.d.acceptance.test.TickTockTests    : Matched all 'Started LogSink' in logfile for app log (source TICKTOCK.log-v1-0)
11-Dec-2019 00:09:26 2019-12-11 00:09:26.144  INFO 9362 --- [           main] o.s.c.d.acceptance.test.TickTockTests    : Looking for 'TICKTOCK - TIMESTAMP:' in logfile for log
11-Dec-2019 00:09:36 2019-12-11 00:09:36.144  INFO 9362 --- [           main] o.s.c.d.acceptance.test.TickTockTests    : Requesting log for app TICKTOCK.log-v1-0
11-Dec-2019 00:09:36 2019-12-11 00:09:36.154  INFO 9362 --- [           main] o.s.c.d.acceptance.test.TickTockTests    : Retrieved logfile from 'http://10.194.6.133:35340/actuator/logfile
11-Dec-2019 00:09:36 2019-12-11 00:09:36.154  INFO 9362 --- [           main] o.s.c.d.acceptance.test.TickTockTests    : Matched all 'TICKTOCK - TIMESTAMP:' in logfile for app log (source TICKTOCK.log-v1-0)
11-Dec-2019 00:09:36 2019-12-11 00:09:36.155  INFO 9362 --- [           main] o.s.c.d.acceptance.test.TickTockTests    : Updating stream 'TICKTOCK'
11-Dec-2019 00:09:36 2019-12-11 00:09:36.706  INFO 9362 --- [           main] o.s.c.d.acceptance.test.TickTockTests    : Checking: Stream=TICKTOCK, status = deploying, status description = The stream is being deployed.
11-Dec-2019 00:09:36 2019-12-11 00:09:36.707  INFO 9362 --- [           main] o.s.c.d.acceptance.test.TickTockTests    : Sleeping to check status of Stream=TICKTOCK
11-Dec-2019 00:09:46 2019-12-11 00:09:46.739  INFO 9362 --- [           main] o.s.c.d.acceptance.test.TickTockTests    : Checking: Stream=TICKTOCK, status = deployed, status description = The stream has been successfully deployed
11-Dec-2019 00:09:46 2019-12-11 00:09:46.782  INFO 9362 --- [           main] o.s.c.d.acceptance.test.TickTockTests    : Sleeping to check status of Stream=TICKTOCK
11-Dec-2019 00:09:56 2019-12-11 00:09:56.783  INFO 9362 --- [           main] o.s.c.d.acceptance.test.TickTockTests    : Stream 'TICKTOCK' started with status: deployed
11-Dec-2019 00:09:56 2019-12-11 00:09:56.783  INFO 9362 --- [           main] o.s.c.d.acceptance.test.TickTockTests    : App 'log' has instances: {TICKTOCK.log-v1-0=http://10.194.6.133:35340, TICKTOCK.log-v2-0=http://10.194.6.133:47883}
11-Dec-2019 00:09:56 2019-12-11 00:09:56.783  INFO 9362 --- [           main] o.s.c.d.acceptance.test.TickTockTests    : App 'time' has instances: {TICKTOCK.time-v1-0=http://10.194.6.133:42414}
11-Dec-2019 00:09:56 2019-12-11 00:09:56.783  INFO 9362 --- [           main] o.s.c.d.acceptance.test.TickTockTests    : Looking for 'Started LogSink' in logfile for log
11-Dec-2019 00:10:06 2019-12-11 00:10:06.783  INFO 9362 --- [           main] o.s.c.d.acceptance.test.TickTockTests    : Requesting log for app TICKTOCK.log-v1-0
11-Dec-2019 00:10:06 2019-12-11 00:10:06.785  WARN 9362 --- [           main] o.s.c.d.acceptance.test.TickTockTests    : Error while trying to access logfile from 'http://10.194.6.133:35340/logfile' due to : org.springframework.web.client.ResourceAccessException: I/O error on GET request for "http://10.194.6.133:35340/logfile": Connection refused (Connection refused); nested exception is java.net.ConnectException: Connection refused (Connection refused)
11-Dec-2019 00:10:06 2019-12-11 00:10:06.785  INFO 9362 --- [           main] o.s.c.d.acceptance.test.TickTockTests    : Requesting log for app TICKTOCK.log-v2-0
11-Dec-2019 00:10:06 2019-12-11 00:10:06.987  INFO 9362 --- [           main] o.s.c.d.acceptance.test.TickTockTests    : Retrieved logfile from 'http://10.194.6.133:47883/actuator/logfile
11-Dec-2019 00:10:06 2019-12-11 00:10:06.988  INFO 9362 --- [           main] o.s.c.d.acceptance.test.TickTockTests    : Matched all 'Started LogSink' in logfile for app log (source TICKTOCK.log-v2-0)
11-Dec-2019 00:10:06 2019-12-11 00:10:06.988  INFO 9362 --- [           main] o.s.c.d.acceptance.test.TickTockTests    : Looking for 'TICKTOCK Updated - TIMESTAMP:' in logfile for log
11-Dec-2019 00:10:16 2019-12-11 00:10:16.988  INFO 9362 --- [           main] o.s.c.d.acceptance.test.TickTockTests    : Requesting log for app TICKTOCK.log-v1-0
11-Dec-2019 00:10:16 2019-12-11 00:10:16.989  WARN 9362 --- [           main] o.s.c.d.acceptance.test.TickTockTests    : Error while trying to access logfile from 'http://10.194.6.133:35340/logfile' due to : org.springframework.web.client.ResourceAccessException: I/O error on GET request for "http://10.194.6.133:35340/logfile": Connection refused (Connection refused); nested exception is java.net.ConnectException: Connection refused (Connection refused)
11-Dec-2019 00:10:16 2019-12-11 00:10:16.989  INFO 9362 --- [           main] o.s.c.d.acceptance.test.TickTockTests    : Requesting log for app TICKTOCK.log-v2-0
11-Dec-2019 00:10:16 2019-12-11 00:10:16.997  INFO 9362 --- [           main] o.s.c.d.acceptance.test.TickTockTests    : Retrieved logfile from 'http://10.194.6.133:47883/actuator/logfile
11-Dec-2019 00:10:16 2019-12-11 00:10:16.997  INFO 9362 --- [           main] o.s.c.d.acceptance.test.TickTockTests    : Matched all 'TICKTOCK Updated - TIMESTAMP:' in logfile for app log (source TICKTOCK.log-v2-0)
11-Dec-2019 00:10:16 2019-12-11 00:10:16.997  INFO 9362 --- [           main] o.s.c.d.acceptance.test.TickTockTests    : Rolling back the stream 'TICKTOCK' to the version 0
11-Dec-2019 00:10:17 2019-12-11 00:10:17.396  INFO 9362 --- [           main] o.s.c.d.acceptance.test.TickTockTests    : Checking: Stream=TICKTOCK, status = deploying, status description = The stream is being deployed.
11-Dec-2019 00:10:17 2019-12-11 00:10:17.396  INFO 9362 --- [           main] o.s.c.d.acceptance.test.TickTockTests    : Sleeping to check status of Stream=TICKTOCK
11-Dec-2019 00:10:27 2019-12-11 00:10:27.430  INFO 9362 --- [           main] o.s.c.d.acceptance.test.TickTockTests    : Checking: Stream=TICKTOCK, status = deployed, status description = The stream has been successfully deployed
11-Dec-2019 00:10:27 2019-12-11 00:10:27.455  INFO 9362 --- [           main] o.s.c.d.acceptance.test.TickTockTests    : Sleeping to check status of Stream=TICKTOCK
11-Dec-2019 00:10:37 2019-12-11 00:10:37.456  INFO 9362 --- [           main] o.s.c.d.acceptance.test.TickTockTests    : Stream 'TICKTOCK' started with status: deployed
11-Dec-2019 00:10:37 2019-12-11 00:10:37.456  INFO 9362 --- [           main] o.s.c.d.acceptance.test.TickTockTests    : App 'log' has instances: {TICKTOCK.log-v1-0=http://10.194.6.133:35340, TICKTOCK.log-v3-0=http://10.194.6.133:27098, TICKTOCK.log-v2-0=http://10.194.6.133:47883}
11-Dec-2019 00:10:37 2019-12-11 00:10:37.456  INFO 9362 --- [           main] o.s.c.d.acceptance.test.TickTockTests    : App 'time' has instances: {TICKTOCK.time-v1-0=http://10.194.6.133:42414}
11-Dec-2019 00:10:37 2019-12-11 00:10:37.456  INFO 9362 --- [           main] o.s.c.d.acceptance.test.TickTockTests    : Looking for 'TICKTOCK - TIMESTAMP:' in logfile for log
11-Dec-2019 00:10:47 2019-12-11 00:10:47.456  INFO 9362 --- [           main] o.s.c.d.acceptance.test.TickTockTests    : Requesting log for app TICKTOCK.log-v1-0
11-Dec-2019 00:10:47 2019-12-11 00:10:47.458  WARN 9362 --- [           main] o.s.c.d.acceptance.test.TickTockTests    : Error while trying to access logfile from 'http://10.194.6.133:35340/logfile' due to : org.springframework.web.client.ResourceAccessException: I/O error on GET request for "http://10.194.6.133:35340/logfile": Connection refused (Connection refused); nested exception is java.net.ConnectException: Connection refused (Connection refused)
11-Dec-2019 00:10:47 2019-12-11 00:10:47.458  INFO 9362 --- [           main] o.s.c.d.acceptance.test.TickTockTests    : Requesting log for app TICKTOCK.log-v3-0
11-Dec-2019 00:10:47 2019-12-11 00:10:47.604  INFO 9362 --- [           main] o.s.c.d.acceptance.test.TickTockTests    : Retrieved logfile from 'http://10.194.6.133:27098/actuator/logfile
11-Dec-2019 00:10:47 2019-12-11 00:10:47.604  INFO 9362 --- [           main] o.s.c.d.acceptance.test.TickTockTests    : Requesting log for app TICKTOCK.log-v2-0
11-Dec-2019 00:10:47 2019-12-11 00:10:47.605  WARN 9362 --- [           main] o.s.c.d.acceptance.test.TickTockTests    : Error while trying to access logfile from 'http://10.194.6.133:47883/logfile' due to : org.springframework.web.client.ResourceAccessException: I/O error on GET request for "http://10.194.6.133:47883/logfile": Connection refused (Connection refused); nested exception is java.net.ConnectException: Connection refused (Connection refused)
11-Dec-2019 00:10:47 2019-12-11 00:10:47.605  INFO 9362 --- [           main] o.s.c.d.acceptance.test.TickTockTests    : Matched all 'TICKTOCK - TIMESTAMP:' in logfile for app log (source TICKTOCK.log-v3-0)
11-Dec-2019 00:10:47 2019-12-11 00:10:47.606  INFO 9362 --- [           main] junit.logTestName                        : Test tickTockUpdateRollbackTests(org.springframework.cloud.dataflow.acceptance.test.TickTockTests) Succeeded
11-Dec-2019 00:10:47 2019-12-11 00:10:47.606  INFO 9362 --- [           main] junit.logTestName                        : Finished Test tickTockUpdateRollbackTests(org.springframework.cloud.dataflow.acceptance.test.TickTockTests)
11-Dec-2019 00:10:47 2019-12-11 00:10:47.607  INFO 9362 --- [           main] o.s.c.d.acceptance.test.TickTockTests    : Destroy all streams
11-Dec-2019 00:10:47 2019-12-11 00:10:47.929  INFO 9362 --- [           main] junit.logTestName                        : Starting Test tickTockTests(org.springframework.cloud.dataflow.acceptance.test.TickTockTests)
11-Dec-2019 00:10:47 2019-12-11 00:10:47.930  INFO 9362 --- [           main] o.s.c.d.acceptance.test.TickTockTests    : Creating stream 'TICKTOCK'
11-Dec-2019 00:10:47 2019-12-11 00:10:47.961  INFO 9362 --- [           main] o.s.c.d.acceptance.test.TickTockTests    : Deploying stream 'TICKTOCK' with properties: {app.*.spring.cloud.streamapp.security.enabled=false, app.*.logging.file=${PID}-test.log, app.*.endpoints.logfile.sensitive=false, app.log.log.expression='TICKTOCK - TIMESTAMP: '.concat(payload), app.*.management.endpoints.web.exposure.include=*}
11-Dec-2019 00:10:48 2019-12-11 00:10:48.510  INFO 9362 --- [           main] o.s.c.d.acceptance.test.TickTockTests    : Checking: Stream=TICKTOCK, status = deploying, status description = The stream is being deployed.
11-Dec-2019 00:10:48 2019-12-11 00:10:48.511  INFO 9362 --- [           main] o.s.c.d.acceptance.test.TickTockTests    : Sleeping to check status of Stream=TICKTOCK
11-Dec-2019 00:10:58 2019-12-11 00:10:58.567  INFO 9362 --- [           main] o.s.c.d.acceptance.test.TickTockTests    : Checking: Stream=TICKTOCK, status = deploying, status description = The stream is being deployed.
11-Dec-2019 00:10:58 2019-12-11 00:10:58.567  INFO 9362 --- [           main] o.s.c.d.acceptance.test.TickTockTests    : Sleeping to check status of Stream=TICKTOCK
11-Dec-2019 00:11:08 2019-12-11 00:11:08.598  INFO 9362 --- [           main] o.s.c.d.acceptance.test.TickTockTests    : Checking: Stream=TICKTOCK, status = deployed, status description = The stream has been successfully deployed
11-Dec-2019 00:11:08 2019-12-11 00:11:08.631  INFO 9362 --- [           main] o.s.c.d.acceptance.test.TickTockTests    : Sleeping to check status of Stream=TICKTOCK
11-Dec-2019 00:11:18 2019-12-11 00:11:18.631  INFO 9362 --- [           main] o.s.c.d.acceptance.test.TickTockTests    : Stream 'TICKTOCK' started with status: deployed
11-Dec-2019 00:11:18 2019-12-11 00:11:18.631  INFO 9362 --- [           main] o.s.c.d.acceptance.test.TickTockTests    : App 'log' has instances: {TICKTOCK.log-v4-0=http://10.194.6.133:38040}
11-Dec-2019 00:11:18 2019-12-11 00:11:18.631  INFO 9362 --- [           main] o.s.c.d.acceptance.test.TickTockTests    : App 'time' has instances: {TICKTOCK.time-v4-0=http://10.194.6.133:50761}
11-Dec-2019 00:11:18 2019-12-11 00:11:18.631  INFO 9362 --- [           main] o.s.c.d.acceptance.test.TickTockTests    : Looking for 'Started TimeSource' in logfile for time
11-Dec-2019 00:11:28 2019-12-11 00:11:28.631  INFO 9362 --- [           main] o.s.c.d.acceptance.test.TickTockTests    : Requesting log for app TICKTOCK.time-v4-0
11-Dec-2019 00:11:28 2019-12-11 00:11:28.911  INFO 9362 --- [           main] o.s.c.d.acceptance.test.TickTockTests    : Retrieved logfile from 'http://10.194.6.133:50761/actuator/logfile
11-Dec-2019 00:11:28 2019-12-11 00:11:28.912  INFO 9362 --- [           main] o.s.c.d.acceptance.test.TickTockTests    : Matched all 'Started TimeSource' in logfile for app time (source TICKTOCK.time-v4-0)
11-Dec-2019 00:11:28 2019-12-11 00:11:28.912  INFO 9362 --- [           main] o.s.c.d.acceptance.test.TickTockTests    : Looking for 'Started LogSink' in logfile for log
11-Dec-2019 00:11:38 2019-12-11 00:11:38.912  INFO 9362 --- [           main] o.s.c.d.acceptance.test.TickTockTests    : Requesting log for app TICKTOCK.log-v4-0
11-Dec-2019 00:11:39 2019-12-11 00:11:39.037  INFO 9362 --- [           main] o.s.c.d.acceptance.test.TickTockTests    : Retrieved logfile from 'http://10.194.6.133:38040/actuator/logfile
11-Dec-2019 00:11:39 2019-12-11 00:11:39.037  INFO 9362 --- [           main] o.s.c.d.acceptance.test.TickTockTests    : Matched all 'Started LogSink' in logfile for app log (source TICKTOCK.log-v4-0)
11-Dec-2019 00:11:39 2019-12-11 00:11:39.037  INFO 9362 --- [           main] o.s.c.d.acceptance.test.TickTockTests    : Looking for 'TICKTOCK - TIMESTAMP:' in logfile for log
11-Dec-2019 00:11:49 2019-12-11 00:11:49.037  INFO 9362 --- [           main] o.s.c.d.acceptance.test.TickTockTests    : Requesting log for app TICKTOCK.log-v4-0
11-Dec-2019 00:11:49 2019-12-11 00:11:49.045  INFO 9362 --- [           main] o.s.c.d.acceptance.test.TickTockTests    : Retrieved logfile from 'http://10.194.6.133:38040/actuator/logfile
11-Dec-2019 00:11:49 2019-12-11 00:11:49.045  INFO 9362 --- [           main] o.s.c.d.acceptance.test.TickTockTests    : Matched all 'TICKTOCK - TIMESTAMP:' in logfile for app log (source TICKTOCK.log-v4-0)
11-Dec-2019 00:11:49 2019-12-11 00:11:49.047  INFO 9362 --- [           main] junit.logTestName                        : Test tickTockTests(org.springframework.cloud.dataflow.acceptance.test.TickTockTests) Succeeded
11-Dec-2019 00:11:49 2019-12-11 00:11:49.047  INFO 9362 --- [           main] junit.logTestName                        : Finished Test tickTockTests(org.springframework.cloud.dataflow.acceptance.test.TickTockTests)
11-Dec-2019 00:11:49 2019-12-11 00:11:49.047  INFO 9362 --- [           main] o.s.c.d.acceptance.test.TickTockTests    : Destroy all streams
11-Dec-2019 00:11:49 2019-12-11 00:11:49.327  INFO 9362 --- [           main] junit.logTestName                        : Starting Test tickTockTestsFromConfigServer(org.springframework.cloud.dataflow.acceptance.test.TickTockTests)
11-Dec-2019 00:11:49 2019-12-11 00:11:49.331  INFO 9362 --- [           main] junit.logTestName                        : Finished Test tickTockTestsFromConfigServer(org.springframework.cloud.dataflow.acceptance.test.TickTockTests)
11-Dec-2019 00:11:49 2019-12-11 00:11:49.331  INFO 9362 --- [           main] o.s.c.d.acceptance.test.TickTockTests    : Destroy all streams
11-Dec-2019 00:11:49 Tests run: 3, Failures: 0, Errors: 0, Skipped: 1, Time elapsed: 194.522 sec - in org.springframework.cloud.dataflow.acceptance.test.TickTockTests
11-Dec-2019 00:11:49 Running org.springframework.cloud.dataflow.acceptance.test.ComposedTaskTests
11-Dec-2019 00:11:49 2019-12-11 00:11:49.422  INFO 9362 --- [           main] junit.logTestName                        : Starting Test ctrMultipleLaunchWithArguments(org.springframework.cloud.dataflow.acceptance.test.ComposedTaskTests)
11-Dec-2019 00:13:10 2019-12-11 00:13:10.107  INFO 9362 --- [           main] junit.logTestName                        : Test ctrMultipleLaunchWithArguments(org.springframework.cloud.dataflow.acceptance.test.ComposedTaskTests) Succeeded
11-Dec-2019 00:13:10 2019-12-11 00:13:10.107  INFO 9362 --- [           main] junit.logTestName                        : Finished Test ctrMultipleLaunchWithArguments(org.springframework.cloud.dataflow.acceptance.test.ComposedTaskTests)
11-Dec-2019 00:13:10 2019-12-11 00:13:10.164  INFO 9362 --- [           main] junit.logTestName                        : Starting Test ctrMultipleLaunch(org.springframework.cloud.dataflow.acceptance.test.ComposedTaskTests)
11-Dec-2019 00:14:10 2019-12-11 00:14:10.714  INFO 9362 --- [           main] junit.logTestName                        : Test ctrMultipleLaunch(org.springframework.cloud.dataflow.acceptance.test.ComposedTaskTests) Succeeded
11-Dec-2019 00:14:10 2019-12-11 00:14:10.714  INFO 9362 --- [           main] junit.logTestName                        : Finished Test ctrMultipleLaunch(org.springframework.cloud.dataflow.acceptance.test.ComposedTaskTests)
11-Dec-2019 00:14:10 2019-12-11 00:14:10.810  INFO 9362 --- [           main] junit.logTestName                        : Starting Test ctrLaunch(org.springframework.cloud.dataflow.acceptance.test.ComposedTaskTests)
11-Dec-2019 00:15:01 2019-12-11 00:15:01.195  INFO 9362 --- [           main] junit.logTestName                        : Test ctrLaunch(org.springframework.cloud.dataflow.acceptance.test.ComposedTaskTests) Succeeded
11-Dec-2019 00:15:01 2019-12-11 00:15:01.195  INFO 9362 --- [           main] junit.logTestName                        : Finished Test ctrLaunch(org.springframework.cloud.dataflow.acceptance.test.ComposedTaskTests)
11-Dec-2019 00:15:01 Tests run: 3, Failures: 0, Errors: 0, Skipped: 0, Time elapsed: 191.856 sec - in org.springframework.cloud.dataflow.acceptance.test.ComposedTaskTests
11-Dec-2019 00:15:01 Running org.springframework.cloud.dataflow.acceptance.test.TransformTests
11-Dec-2019 00:15:01 2019-12-11 00:15:01.197  INFO 9362 --- [           main] .b.t.c.SpringBootTestContextBootstrapper : Neither @ContextConfiguration nor @ContextHierarchy found for test class [org.springframework.cloud.dataflow.acceptance.test.TransformTests], using SpringBootContextLoader
11-Dec-2019 00:15:01 2019-12-11 00:15:01.207  INFO 9362 --- [           main] .b.t.c.SpringBootTestContextBootstrapper : Loaded default TestExecutionListener class names from location [META-INF/spring.factories]: [org.springframework.boot.test.mock.mockito.MockitoTestExecutionListener, org.springframework.boot.test.mock.mockito.ResetMocksTestExecutionListener, org.springframework.boot.test.autoconfigure.restdocs.RestDocsTestExecutionListener, org.springframework.boot.test.autoconfigure.web.client.MockRestServiceServerResetTestExecutionListener, org.springframework.boot.test.autoconfigure.web.servlet.MockMvcPrintOnlyOnFailureTestExecutionListener, org.springframework.boot.test.autoconfigure.web.servlet.WebDriverTestExecutionListener, org.springframework.test.context.web.ServletTestExecutionListener, org.springframework.test.context.support.DirtiesContextBeforeModesTestExecutionListener, org.springframework.test.context.support.DependencyInjectionTestExecutionListener, org.springframework.test.context.support.DirtiesContextTestExecutionListener, org.springframework.test.context.transaction.TransactionalTestExecutionListener, org.springframework.test.context.jdbc.SqlScriptsTestExecutionListener]
11-Dec-2019 00:15:01 2019-12-11 00:15:01.211  INFO 9362 --- [           main] .b.t.c.SpringBootTestContextBootstrapper : Using TestExecutionListeners: [org.springframework.test.context.web.ServletTestExecutionListener@4d3c6593, org.springframework.test.context.support.DirtiesContextBeforeModesTestExecutionListener@7426a448, org.springframework.boot.test.autoconfigure.SpringBootDependencyInjectionTestExecutionListener@516462cc, org.springframework.test.context.support.DirtiesContextTestExecutionListener@3456558, org.springframework.test.context.transaction.TransactionalTestExecutionListener@2dfb885e, org.springframework.test.context.jdbc.SqlScriptsTestExecutionListener@6cbe7d4d, org.springframework.boot.test.mock.mockito.MockitoTestExecutionListener@1e3e1014, org.springframework.boot.test.autoconfigure.web.servlet.MockMvcPrintOnlyOnFailureTestExecutionListener@3679d92e, org.springframework.boot.test.autoconfigure.web.client.MockRestServiceServerResetTestExecutionListener@47b11ec7, org.springframework.boot.test.mock.mockito.ResetMocksTestExecutionListener@58fa5769, org.springframework.boot.test.autoconfigure.web.servlet.WebDriverTestExecutionListener@36aa52d2, org.springframework.boot.test.autoconfigure.restdocs.RestDocsTestExecutionListener@4ee25d80]
11-Dec-2019 00:15:01 2019-12-11 00:15:01.266  INFO 9362 --- [           main] junit.logTestName                        : Starting Test transformTests(org.springframework.cloud.dataflow.acceptance.test.TransformTests)
11-Dec-2019 00:15:01 2019-12-11 00:15:01.267  INFO 9362 --- [           main] o.s.c.d.acceptance.test.TransformTests   : Creating stream 'TRANSFORM-TEST'
11-Dec-2019 00:15:01 2019-12-11 00:15:01.299  INFO 9362 --- [           main] o.s.c.d.acceptance.test.TransformTests   : Deploying stream 'TRANSFORM-TEST' with properties: {app.*.spring.cloud.streamapp.security.enabled=false, app.*.logging.file=${PID}-test.log, app.*.endpoints.logfile.sensitive=false, app.*.management.endpoints.web.exposure.include=*}
11-Dec-2019 00:15:02 2019-12-11 00:15:02.048  INFO 9362 --- [           main] o.s.c.d.acceptance.test.TransformTests   : Checking: Stream=TRANSFORM-TEST, status = deploying, status description = The stream is being deployed.
11-Dec-2019 00:15:02 2019-12-11 00:15:02.048  INFO 9362 --- [           main] o.s.c.d.acceptance.test.TransformTests   : Sleeping to check status of Stream=TRANSFORM-TEST
11-Dec-2019 00:15:12 2019-12-11 00:15:12.087  INFO 9362 --- [           main] o.s.c.d.acceptance.test.TransformTests   : Checking: Stream=TRANSFORM-TEST, status = deploying, status description = The stream is being deployed.
11-Dec-2019 00:15:12 2019-12-11 00:15:12.087  INFO 9362 --- [           main] o.s.c.d.acceptance.test.TransformTests   : Sleeping to check status of Stream=TRANSFORM-TEST
11-Dec-2019 00:15:22 2019-12-11 00:15:22.113  INFO 9362 --- [           main] o.s.c.d.acceptance.test.TransformTests   : Checking: Stream=TRANSFORM-TEST, status = deployed, status description = The stream has been successfully deployed
11-Dec-2019 00:15:22 2019-12-11 00:15:22.145  INFO 9362 --- [           main] o.s.c.d.acceptance.test.TransformTests   : Sleeping to check status of Stream=TRANSFORM-TEST
11-Dec-2019 00:15:32 2019-12-11 00:15:32.146  INFO 9362 --- [           main] o.s.c.d.acceptance.test.TransformTests   : Stream 'TRANSFORM-TEST' started with status: deployed
11-Dec-2019 00:15:32 2019-12-11 00:15:32.146  INFO 9362 --- [           main] o.s.c.d.acceptance.test.TransformTests   : App 'transform' has instances: {TRANSFORM-TEST.transform-v1-0=http://10.194.6.133:34423}
11-Dec-2019 00:15:32 2019-12-11 00:15:32.146  INFO 9362 --- [           main] o.s.c.d.acceptance.test.TransformTests   : App 'log' has instances: {TRANSFORM-TEST.log-v1-0=http://10.194.6.133:26738}
11-Dec-2019 00:15:32 2019-12-11 00:15:32.146  INFO 9362 --- [           main] o.s.c.d.acceptance.test.TransformTests   : App 'http' has instances: {TRANSFORM-TEST.http-v1-0=http://10.194.6.133:37560}
11-Dec-2019 00:15:32 2019-12-11 00:15:32.146  INFO 9362 --- [           main] o.s.c.d.acceptance.test.TransformTests   : Looking for 'Started HttpSource' in logfile for http
11-Dec-2019 00:15:42 2019-12-11 00:15:42.146  INFO 9362 --- [           main] o.s.c.d.acceptance.test.TransformTests   : Requesting log for app TRANSFORM-TEST.http-v1-0
11-Dec-2019 00:15:42 2019-12-11 00:15:42.450  INFO 9362 --- [           main] o.s.c.d.acceptance.test.TransformTests   : Retrieved logfile from 'http://10.194.6.133:37560/actuator/logfile
11-Dec-2019 00:15:42 2019-12-11 00:15:42.450  INFO 9362 --- [           main] o.s.c.d.acceptance.test.TransformTests   : Matched all 'Started HttpSource' in logfile for app http (source TRANSFORM-TEST.http-v1-0)
11-Dec-2019 00:15:42 2019-12-11 00:15:42.601  INFO 9362 --- [           main] o.s.c.d.acceptance.test.TransformTests   : Looking for 'Started LogSink' in logfile for log
11-Dec-2019 00:15:52 2019-12-11 00:15:52.602  INFO 9362 --- [           main] o.s.c.d.acceptance.test.TransformTests   : Requesting log for app TRANSFORM-TEST.log-v1-0
11-Dec-2019 00:15:52 2019-12-11 00:15:52.752  INFO 9362 --- [           main] o.s.c.d.acceptance.test.TransformTests   : Retrieved logfile from 'http://10.194.6.133:26738/actuator/logfile
11-Dec-2019 00:15:52 2019-12-11 00:15:52.752  INFO 9362 --- [           main] o.s.c.d.acceptance.test.TransformTests   : Matched all 'Started LogSink' in logfile for app log (source TRANSFORM-TEST.log-v1-0)
11-Dec-2019 00:15:52 2019-12-11 00:15:52.752  INFO 9362 --- [           main] o.s.c.d.acceptance.test.TransformTests   : Looking for 'ABCDEFG' in logfile for log
11-Dec-2019 00:16:02 2019-12-11 00:16:02.752  INFO 9362 --- [           main] o.s.c.d.acceptance.test.TransformTests   : Requesting log for app TRANSFORM-TEST.log-v1-0
11-Dec-2019 00:16:02 2019-12-11 00:16:02.764  INFO 9362 --- [           main] o.s.c.d.acceptance.test.TransformTests   : Retrieved logfile from 'http://10.194.6.133:26738/actuator/logfile
11-Dec-2019 00:16:02 2019-12-11 00:16:02.764  INFO 9362 --- [           main] o.s.c.d.acceptance.test.TransformTests   : Matched all 'ABCDEFG' in logfile for app log (source TRANSFORM-TEST.log-v1-0)
11-Dec-2019 00:16:02 2019-12-11 00:16:02.766  INFO 9362 --- [           main] junit.logTestName                        : Test transformTests(org.springframework.cloud.dataflow.acceptance.test.TransformTests) Succeeded
11-Dec-2019 00:16:02 2019-12-11 00:16:02.766  INFO 9362 --- [           main] junit.logTestName                        : Finished Test transformTests(org.springframework.cloud.dataflow.acceptance.test.TransformTests)
11-Dec-2019 00:16:02 2019-12-11 00:16:02.766  INFO 9362 --- [           main] o.s.c.d.acceptance.test.TransformTests   : Destroy all streams
11-Dec-2019 00:16:03 Tests run: 1, Failures: 0, Errors: 0, Skipped: 0, Time elapsed: 61.902 sec - in org.springframework.cloud.dataflow.acceptance.test.TransformTests
11-Dec-2019 00:16:03 Running org.springframework.cloud.dataflow.acceptance.test.SchedulerTests
11-Dec-2019 00:16:03 2019-12-11 00:16:03.219  INFO 9362 --- [           main] s.c.a.AnnotationConfigApplicationContext : Refreshing org.springframework.context.annotation.AnnotationConfigApplicationContext@3c9c6245: startup date [Wed Dec 11 00:16:03 UTC 2019]; root of context hierarchy
11-Dec-2019 00:16:03 2019-12-11 00:16:03.250  INFO 9362 --- [           main] trationDelegate$BeanPostProcessorChecker : Bean 'configurationPropertiesRebinderAutoConfiguration' of type [class org.springframework.cloud.autoconfigure.ConfigurationPropertiesRebinderAutoConfiguration$$EnhancerBySpringCGLIB$$219d8b3d] is not eligible for getting processed by all BeanPostProcessors (for example: not eligible for auto-proxying)
11-Dec-2019 00:16:03
11-Dec-2019 00:16:03   .   ____          _            __ _ _
11-Dec-2019 00:16:03 /\\ / ___'_ __ _ _(_)_ __  __ _ \ \ \ \
11-Dec-2019 00:16:03 ( ( )\___ | '_ | '_| | '_ \/ _` | \ \ \ \
11-Dec-2019 00:16:03 \\/  ___)| |_)| | | | | || (_| |  ) ) ) )
11-Dec-2019 00:16:03   '  |____| .__|_| |_|_| |_\__, | / / / /
11-Dec-2019 00:16:03 =========|_|==============|___/=/_/_/_/
11-Dec-2019 00:16:03 :: Spring Boot ::        (v1.4.1.RELEASE)
11-Dec-2019 00:16:03
11-Dec-2019 00:16:03 2019-12-11 00:16:03.349  INFO 9362 --- [           main] c.c.c.ConfigServicePropertySourceLocator : Fetching config from server at: http://localhost:8888
11-Dec-2019 00:16:03 2019-12-11 00:16:03.352  WARN 9362 --- [           main] c.c.c.ConfigServicePropertySourceLocator : Could not locate PropertySource: I/O error on GET request for "http://localhost:8888//blah": Connection refused (Connection refused); nested exception is java.net.ConnectException: Connection refused (Connection refused)
11-Dec-2019 00:16:03 2019-12-11 00:16:03.353  INFO 9362 --- [           main] o.a.maven.surefire.booter.ForkedBooter   : The following profiles are active: blah
11-Dec-2019 00:16:03 2019-12-11 00:16:03.354  INFO 9362 --- [           main] s.c.a.AnnotationConfigApplicationContext : Refreshing org.springframework.context.annotation.AnnotationConfigApplicationContext@1727e03a: startup date [Wed Dec 11 00:16:03 UTC 2019]; parent: org.springframework.context.annotation.AnnotationConfigApplicationContext@3c9c6245
11-Dec-2019 00:16:03 2019-12-11 00:16:03.438  INFO 9362 --- [           main] o.a.maven.surefire.booter.ForkedBooter   : Started ForkedBooter in 0.328 seconds (JVM running for 641.208)
11-Dec-2019 00:16:03 2019-12-11 00:16:03.438  INFO 9362 --- [           main] s.c.a.AnnotationConfigApplicationContext : Closing org.springframework.context.annotation.AnnotationConfigApplicationContext@1727e03a: startup date [Wed Dec 11 00:16:03 UTC 2019]; parent: org.springframework.context.annotation.AnnotationConfigApplicationContext@3c9c6245
11-Dec-2019 00:16:03 2019-12-11 00:16:03.441 ERROR 9362 --- [           main] o.s.c.d.a.test.util.SchedulerRule        : SCHEDULER IS NOT AVAILABLE, SKIPPING TESTS
11-Dec-2019 00:16:03
11-Dec-2019 00:16:03 java.lang.IllegalArgumentException: no SchedulerOperations bean is available.  Skipping test.
11-Dec-2019 00:16:03         at org.springframework.util.Assert.notNull(Assert.java:115)
11-Dec-2019 00:16:03         at org.springframework.cloud.dataflow.acceptance.test.util.SchedulerRule.obtainResource(SchedulerRule.java:57)
11-Dec-2019 00:16:03         at org.springframework.cloud.scheduler.spi.junit.AbstractExternalResourceTestSupport.apply(AbstractExternalResourceTestSupport.java:58)
11-Dec-2019 00:16:03         at org.junit.rules.RunRules.applyAll(RunRules.java:26)
11-Dec-2019 00:16:03         at org.junit.rules.RunRules.<init>(RunRules.java:15)
11-Dec-2019 00:16:03         at org.junit.runners.ParentRunner.withClassRules(ParentRunner.java:245)
11-Dec-2019 00:16:03         at org.junit.runners.ParentRunner.classBlock(ParentRunner.java:194)
11-Dec-2019 00:16:03         at org.junit.runners.ParentRunner.run(ParentRunner.java:362)
11-Dec-2019 00:16:03         at org.springframework.test.context.junit4.SpringJUnit4ClassRunner.run(SpringJUnit4ClassRunner.java:191)
11-Dec-2019 00:16:03         at org.apache.maven.surefire.junit4.JUnit4Provider.execute(JUnit4Provider.java:283)
11-Dec-2019 00:16:03         at org.apache.maven.surefire.junit4.JUnit4Provider.executeWithRerun(JUnit4Provider.java:173)
11-Dec-2019 00:16:03         at org.apache.maven.surefire.junit4.JUnit4Provider.executeTestSet(JUnit4Provider.java:153)
11-Dec-2019 00:16:03         at org.apache.maven.surefire.junit4.JUnit4Provider.invoke(JUnit4Provider.java:128)
11-Dec-2019 00:16:03         at org.apache.maven.surefire.booter.ForkedBooter.invokeProviderInSameClassLoader(ForkedBooter.java:203)
11-Dec-2019 00:16:03         at org.apache.maven.surefire.booter.ForkedBooter.runSuitesInProcess(ForkedBooter.java:155)
11-Dec-2019 00:16:03         at org.apache.maven.surefire.booter.ForkedBooter.main(ForkedBooter.java:103)
11-Dec-2019 00:16:03
11-Dec-2019 00:16:03 Tests run: 1, Failures: 0, Errors: 0, Skipped: 1, Time elapsed: 0.343 sec - in org.springframework.cloud.dataflow.acceptance.test.SchedulerTests
11-Dec-2019 00:16:03 Running org.springframework.cloud.dataflow.acceptance.test.NamedChannelTests
11-Dec-2019 00:16:03 2019-12-11 00:16:03.442  INFO 9362 --- [           main] .b.t.c.SpringBootTestContextBootstrapper : Neither @ContextConfiguration nor @ContextHierarchy found for test class [org.springframework.cloud.dataflow.acceptance.test.NamedChannelTests], using SpringBootContextLoader
11-Dec-2019 00:16:03 2019-12-11 00:16:03.449  INFO 9362 --- [           main] .b.t.c.SpringBootTestContextBootstrapper : Loaded default TestExecutionListener class names from location [META-INF/spring.factories]: [org.springframework.boot.test.mock.mockito.MockitoTestExecutionListener, org.springframework.boot.test.mock.mockito.ResetMocksTestExecutionListener, org.springframework.boot.test.autoconfigure.restdocs.RestDocsTestExecutionListener, org.springframework.boot.test.autoconfigure.web.client.MockRestServiceServerResetTestExecutionListener, org.springframework.boot.test.autoconfigure.web.servlet.MockMvcPrintOnlyOnFailureTestExecutionListener, org.springframework.boot.test.autoconfigure.web.servlet.WebDriverTestExecutionListener, org.springframework.test.context.web.ServletTestExecutionListener, org.springframework.test.context.support.DirtiesContextBeforeModesTestExecutionListener, org.springframework.test.context.support.DependencyInjectionTestExecutionListener, org.springframework.test.context.support.DirtiesContextTestExecutionListener, org.springframework.test.context.transaction.TransactionalTestExecutionListener, org.springframework.test.context.jdbc.SqlScriptsTestExecutionListener]
11-Dec-2019 00:16:03 2019-12-11 00:16:03.451  INFO 9362 --- [           main] .b.t.c.SpringBootTestContextBootstrapper : Using TestExecutionListeners: [org.springframework.test.context.web.ServletTestExecutionListener@17fede14, org.springframework.test.context.support.DirtiesContextBeforeModesTestExecutionListener@712ac7e6, org.springframework.boot.test.autoconfigure.SpringBootDependencyInjectionTestExecutionListener@86d6bf7, org.springframework.test.context.support.DirtiesContextTestExecutionListener@2fbe26da, org.springframework.test.context.transaction.TransactionalTestExecutionListener@4ed15347, org.springframework.test.context.jdbc.SqlScriptsTestExecutionListener@6963b88c, org.springframework.boot.test.mock.mockito.MockitoTestExecutionListener@ab24484, org.springframework.boot.test.autoconfigure.web.servlet.MockMvcPrintOnlyOnFailureTestExecutionListener@54e43bfe, org.springframework.boot.test.autoconfigure.web.client.MockRestServiceServerResetTestExecutionListener@106b014e, org.springframework.boot.test.mock.mockito.ResetMocksTestExecutionListener@64387c17, org.springframework.boot.test.autoconfigure.web.servlet.WebDriverTestExecutionListener@7c369270, org.springframework.boot.test.autoconfigure.restdocs.RestDocsTestExecutionListener@9f86dc3]
11-Dec-2019 00:16:03 2019-12-11 00:16:03.507  INFO 9362 --- [           main] junit.logTestName                        : Starting Test testDestination(org.springframework.cloud.dataflow.acceptance.test.NamedChannelTests)
11-Dec-2019 00:16:03 2019-12-11 00:16:03.509  INFO 9362 --- [           main] o.s.c.d.a.test.NamedChannelTests         : Creating stream 'LOG-DESTINATION-SINK'
11-Dec-2019 00:16:03 2019-12-11 00:16:03.554  INFO 9362 --- [           main] o.s.c.d.a.test.NamedChannelTests         : Deploying stream 'LOG-DESTINATION-SINK' with properties: {app.*.spring.cloud.streamapp.security.enabled=false, app.*.logging.file=${PID}-test.log, app.*.endpoints.logfile.sensitive=false, app.*.management.endpoints.web.exposure.include=*}
11-Dec-2019 00:16:03 2019-12-11 00:16:03.945  INFO 9362 --- [           main] o.s.c.d.a.test.NamedChannelTests         : Checking: Stream=LOG-DESTINATION-SINK, status = deploying, status description = The stream is being deployed.
11-Dec-2019 00:16:03 2019-12-11 00:16:03.945  INFO 9362 --- [           main] o.s.c.d.a.test.NamedChannelTests         : Sleeping to check status of Stream=LOG-DESTINATION-SINK
11-Dec-2019 00:16:13 2019-12-11 00:16:13.974  INFO 9362 --- [           main] o.s.c.d.a.test.NamedChannelTests         : Checking: Stream=LOG-DESTINATION-SINK, status = deployed, status description = The stream has been successfully deployed
11-Dec-2019 00:16:14 2019-12-11 00:16:14.009  INFO 9362 --- [           main] o.s.c.d.a.test.NamedChannelTests         : Sleeping to check status of Stream=LOG-DESTINATION-SINK
11-Dec-2019 00:16:24 2019-12-11 00:16:24.009  INFO 9362 --- [           main] o.s.c.d.a.test.NamedChannelTests         : Stream 'LOG-DESTINATION-SINK' started with status: deployed
11-Dec-2019 00:16:24 2019-12-11 00:16:24.010  INFO 9362 --- [           main] o.s.c.d.a.test.NamedChannelTests         : App 'log' has instances: {LOG-DESTINATION-SINK.log-v1-0=http://10.194.6.133:32059}
11-Dec-2019 00:16:24 2019-12-11 00:16:24.010  INFO 9362 --- [           main] o.s.c.d.a.test.NamedChannelTests         : Looking for 'Started LogSink' in logfile for log
11-Dec-2019 00:16:34 2019-12-11 00:16:34.010  INFO 9362 --- [           main] o.s.c.d.a.test.NamedChannelTests         : Requesting log for app LOG-DESTINATION-SINK.log-v1-0
11-Dec-2019 00:16:34 2019-12-11 00:16:34.299  INFO 9362 --- [           main] o.s.c.d.a.test.NamedChannelTests         : Retrieved logfile from 'http://10.194.6.133:32059/actuator/logfile
11-Dec-2019 00:16:34 2019-12-11 00:16:34.300  INFO 9362 --- [           main] o.s.c.d.a.test.NamedChannelTests         : Matched all 'Started LogSink' in logfile for app log (source LOG-DESTINATION-SINK.log-v1-0)
11-Dec-2019 00:16:34 2019-12-11 00:16:34.300  INFO 9362 --- [           main] o.s.c.d.a.test.NamedChannelTests         : Creating stream 'HTTP-DESTINATION-SOURCE'
11-Dec-2019 00:16:34 2019-12-11 00:16:34.326  INFO 9362 --- [           main] o.s.c.d.a.test.NamedChannelTests         : Deploying stream 'HTTP-DESTINATION-SOURCE' with properties: {app.*.spring.cloud.streamapp.security.enabled=false, app.*.logging.file=${PID}-test.log, app.*.endpoints.logfile.sensitive=false, app.*.management.endpoints.web.exposure.include=*}
11-Dec-2019 00:16:34 2019-12-11 00:16:34.795  INFO 9362 --- [           main] o.s.c.d.a.test.NamedChannelTests         : Checking: Stream=HTTP-DESTINATION-SOURCE, status = deploying, status description = The stream is being deployed.
11-Dec-2019 00:16:34 2019-12-11 00:16:34.795  INFO 9362 --- [           main] o.s.c.d.a.test.NamedChannelTests         : Sleeping to check status of Stream=HTTP-DESTINATION-SOURCE
11-Dec-2019 00:16:44 2019-12-11 00:16:44.847  INFO 9362 --- [           main] o.s.c.d.a.test.NamedChannelTests         : Checking: Stream=HTTP-DESTINATION-SOURCE, status = deployed, status description = The stream has been successfully deployed
11-Dec-2019 00:16:44 2019-12-11 00:16:44.894  INFO 9362 --- [           main] o.s.c.d.a.test.NamedChannelTests         : Sleeping to check status of Stream=HTTP-DESTINATION-SOURCE
11-Dec-2019 00:16:54 2019-12-11 00:16:54.894  INFO 9362 --- [           main] o.s.c.d.a.test.NamedChannelTests         : Stream 'HTTP-DESTINATION-SOURCE' started with status: deployed
11-Dec-2019 00:16:54 2019-12-11 00:16:54.895  INFO 9362 --- [           main] o.s.c.d.a.test.NamedChannelTests         : App 'http' has instances: {HTTP-DESTINATION-SOURCE.http-v1-0=http://10.194.6.133:47956}
11-Dec-2019 00:16:54 2019-12-11 00:16:54.895  INFO 9362 --- [           main] o.s.c.d.a.test.NamedChannelTests         : Looking for 'Started HttpSource' in logfile for http
11-Dec-2019 00:17:04 2019-12-11 00:17:04.896  INFO 9362 --- [           main] o.s.c.d.a.test.NamedChannelTests         : Requesting log for app HTTP-DESTINATION-SOURCE.http-v1-0
11-Dec-2019 00:17:05 2019-12-11 00:17:05.188  INFO 9362 --- [           main] o.s.c.d.a.test.NamedChannelTests         : Retrieved logfile from 'http://10.194.6.133:47956/actuator/logfile
11-Dec-2019 00:17:05 2019-12-11 00:17:05.189  INFO 9362 --- [           main] o.s.c.d.a.test.NamedChannelTests         : Matched all 'Started HttpSource' in logfile for app http (source HTTP-DESTINATION-SOURCE.http-v1-0)
11-Dec-2019 00:17:05 2019-12-11 00:17:05.334  INFO 9362 --- [           main] o.s.c.d.a.test.NamedChannelTests         : Looking for 'abcdefg' in logfile for log
11-Dec-2019 00:17:15 2019-12-11 00:17:15.334  INFO 9362 --- [           main] o.s.c.d.a.test.NamedChannelTests         : Requesting log for app LOG-DESTINATION-SINK.log-v1-0
11-Dec-2019 00:17:15 2019-12-11 00:17:15.346  INFO 9362 --- [           main] o.s.c.d.a.test.NamedChannelTests         : Retrieved logfile from 'http://10.194.6.133:32059/actuator/logfile
11-Dec-2019 00:17:15 2019-12-11 00:17:15.346  INFO 9362 --- [           main] o.s.c.d.a.test.NamedChannelTests         : Matched all 'abcdefg' in logfile for app log (source LOG-DESTINATION-SINK.log-v1-0)
11-Dec-2019 00:17:15 2019-12-11 00:17:15.347  INFO 9362 --- [           main] junit.logTestName                        : Test testDestination(org.springframework.cloud.dataflow.acceptance.test.NamedChannelTests) Succeeded
11-Dec-2019 00:17:15 2019-12-11 00:17:15.347  INFO 9362 --- [           main] junit.logTestName                        : Finished Test testDestination(org.springframework.cloud.dataflow.acceptance.test.NamedChannelTests)
11-Dec-2019 00:17:15 2019-12-11 00:17:15.347  INFO 9362 --- [           main] o.s.c.d.a.test.NamedChannelTests         : Destroy all streams
11-Dec-2019 00:17:15 2019-12-11 00:17:15.668  INFO 9362 --- [           main] junit.logTestName                        : Starting Test testTap(org.springframework.cloud.dataflow.acceptance.test.NamedChannelTests)
11-Dec-2019 00:17:15 2019-12-11 00:17:15.668  INFO 9362 --- [           main] o.s.c.d.a.test.NamedChannelTests         : Creating stream 'TAPHTTP'
11-Dec-2019 00:17:15 2019-12-11 00:17:15.694  INFO 9362 --- [           main] o.s.c.d.a.test.NamedChannelTests         : Deploying stream 'TAPHTTP' with properties: {app.*.spring.cloud.streamapp.security.enabled=false, app.*.logging.file=${PID}-test.log, app.*.endpoints.logfile.sensitive=false, app.*.management.endpoints.web.exposure.include=*}
11-Dec-2019 00:17:16 2019-12-11 00:17:16.218  INFO 9362 --- [           main] o.s.c.d.a.test.NamedChannelTests         : Checking: Stream=TAPHTTP, status = deploying, status description = The stream is being deployed.
11-Dec-2019 00:17:16 2019-12-11 00:17:16.218  INFO 9362 --- [           main] o.s.c.d.a.test.NamedChannelTests         : Sleeping to check status of Stream=TAPHTTP
11-Dec-2019 00:17:26 2019-12-11 00:17:26.245  INFO 9362 --- [           main] o.s.c.d.a.test.NamedChannelTests         : Checking: Stream=TAPHTTP, status = deploying, status description = The stream is being deployed.
11-Dec-2019 00:17:26 2019-12-11 00:17:26.245  INFO 9362 --- [           main] o.s.c.d.a.test.NamedChannelTests         : Sleeping to check status of Stream=TAPHTTP
11-Dec-2019 00:17:36 2019-12-11 00:17:36.275  INFO 9362 --- [           main] o.s.c.d.a.test.NamedChannelTests         : Checking: Stream=TAPHTTP, status = deployed, status description = The stream has been successfully deployed
11-Dec-2019 00:17:36 2019-12-11 00:17:36.300  INFO 9362 --- [           main] o.s.c.d.a.test.NamedChannelTests         : Sleeping to check status of Stream=TAPHTTP
11-Dec-2019 00:17:46 2019-12-11 00:17:46.303  INFO 9362 --- [           main] o.s.c.d.a.test.NamedChannelTests         : Stream 'TAPHTTP' started with status: deployed
11-Dec-2019 00:17:46 2019-12-11 00:17:46.303  INFO 9362 --- [           main] o.s.c.d.a.test.NamedChannelTests         : App 'log' has instances: {TAPHTTP.log-v1-0=http://10.194.6.133:54103}
11-Dec-2019 00:17:46 2019-12-11 00:17:46.303  INFO 9362 --- [           main] o.s.c.d.a.test.NamedChannelTests         : App 'http' has instances: {TAPHTTP.http-v1-0=http://10.194.6.133:23228}
11-Dec-2019 00:17:46 2019-12-11 00:17:46.303  INFO 9362 --- [           main] o.s.c.d.a.test.NamedChannelTests         : Looking for 'Started HttpSource' in logfile for http
11-Dec-2019 00:17:56 2019-12-11 00:17:56.303  INFO 9362 --- [           main] o.s.c.d.a.test.NamedChannelTests         : Requesting log for app TAPHTTP.http-v1-0
11-Dec-2019 00:17:56 2019-12-11 00:17:56.579  INFO 9362 --- [           main] o.s.c.d.a.test.NamedChannelTests         : Retrieved logfile from 'http://10.194.6.133:23228/actuator/logfile
11-Dec-2019 00:17:56 2019-12-11 00:17:56.580  INFO 9362 --- [           main] o.s.c.d.a.test.NamedChannelTests         : Matched all 'Started HttpSource' in logfile for app http (source TAPHTTP.http-v1-0)
11-Dec-2019 00:17:56 2019-12-11 00:17:56.580  INFO 9362 --- [           main] o.s.c.d.a.test.NamedChannelTests         : Looking for 'Started LogSink' in logfile for log
11-Dec-2019 00:18:06 2019-12-11 00:18:06.580  INFO 9362 --- [           main] o.s.c.d.a.test.NamedChannelTests         : Requesting log for app TAPHTTP.log-v1-0
11-Dec-2019 00:18:06 2019-12-11 00:18:06.702  INFO 9362 --- [           main] o.s.c.d.a.test.NamedChannelTests         : Retrieved logfile from 'http://10.194.6.133:54103/actuator/logfile
11-Dec-2019 00:18:06 2019-12-11 00:18:06.703  INFO 9362 --- [           main] o.s.c.d.a.test.NamedChannelTests         : Matched all 'Started LogSink' in logfile for app log (source TAPHTTP.log-v1-0)
11-Dec-2019 00:18:06 2019-12-11 00:18:06.703  INFO 9362 --- [           main] o.s.c.d.a.test.NamedChannelTests         : Creating stream 'TAPSTREAM'
11-Dec-2019 00:18:06 2019-12-11 00:18:06.759  INFO 9362 --- [           main] o.s.c.d.a.test.NamedChannelTests         : Deploying stream 'TAPSTREAM' with properties: {app.*.spring.cloud.streamapp.security.enabled=false, app.*.logging.file=${PID}-test.log, app.*.endpoints.logfile.sensitive=false, app.*.management.endpoints.web.exposure.include=*}
11-Dec-2019 00:18:07 2019-12-11 00:18:07.181  INFO 9362 --- [           main] o.s.c.d.a.test.NamedChannelTests         : Checking: Stream=TAPSTREAM, status = deploying, status description = The stream is being deployed.
11-Dec-2019 00:18:07 2019-12-11 00:18:07.181  INFO 9362 --- [           main] o.s.c.d.a.test.NamedChannelTests         : Sleeping to check status of Stream=TAPSTREAM
11-Dec-2019 00:18:17 2019-12-11 00:18:17.224  INFO 9362 --- [           main] o.s.c.d.a.test.NamedChannelTests         : Checking: Stream=TAPSTREAM, status = deployed, status description = The stream has been successfully deployed
11-Dec-2019 00:18:17 2019-12-11 00:18:17.265  INFO 9362 --- [           main] o.s.c.d.a.test.NamedChannelTests         : Sleeping to check status of Stream=TAPSTREAM
11-Dec-2019 00:18:27 2019-12-11 00:18:27.265  INFO 9362 --- [           main] o.s.c.d.a.test.NamedChannelTests         : Stream 'TAPSTREAM' started with status: deployed
11-Dec-2019 00:18:27 2019-12-11 00:18:27.266  INFO 9362 --- [           main] o.s.c.d.a.test.NamedChannelTests         : App 'log' has instances: {TAPSTREAM.log-v1-0=http://10.194.6.133:36037}
11-Dec-2019 00:18:27 2019-12-11 00:18:27.266  INFO 9362 --- [           main] o.s.c.d.a.test.NamedChannelTests         : Looking for 'Started LogSink' in logfile for log
11-Dec-2019 00:18:37 2019-12-11 00:18:37.266  INFO 9362 --- [           main] o.s.c.d.a.test.NamedChannelTests         : Requesting log for app TAPSTREAM.log-v1-0
11-Dec-2019 00:18:37 2019-12-11 00:18:37.538  INFO 9362 --- [           main] o.s.c.d.a.test.NamedChannelTests         : Retrieved logfile from 'http://10.194.6.133:36037/actuator/logfile
11-Dec-2019 00:18:37 2019-12-11 00:18:37.538  INFO 9362 --- [           main] o.s.c.d.a.test.NamedChannelTests         : Matched all 'Started LogSink' in logfile for app log (source TAPSTREAM.log-v1-0)
11-Dec-2019 00:18:37 2019-12-11 00:18:37.692  INFO 9362 --- [           main] o.s.c.d.a.test.NamedChannelTests         : Looking for 'abcdefg' in logfile for log
11-Dec-2019 00:18:47 2019-12-11 00:18:47.693  INFO 9362 --- [           main] o.s.c.d.a.test.NamedChannelTests         : Requesting log for app TAPSTREAM.log-v1-0
11-Dec-2019 00:18:47 2019-12-11 00:18:47.700  INFO 9362 --- [           main] o.s.c.d.a.test.NamedChannelTests         : Retrieved logfile from 'http://10.194.6.133:36037/actuator/logfile
11-Dec-2019 00:18:47 2019-12-11 00:18:47.700  INFO 9362 --- [           main] o.s.c.d.a.test.NamedChannelTests         : Matched all 'abcdefg' in logfile for app log (source TAPSTREAM.log-v1-0)
11-Dec-2019 00:18:47 2019-12-11 00:18:47.701  INFO 9362 --- [           main] junit.logTestName                        : Test testTap(org.springframework.cloud.dataflow.acceptance.test.NamedChannelTests) Succeeded
11-Dec-2019 00:18:47 2019-12-11 00:18:47.701  INFO 9362 --- [           main] junit.logTestName                        : Finished Test testTap(org.springframework.cloud.dataflow.acceptance.test.NamedChannelTests)
11-Dec-2019 00:18:47 2019-12-11 00:18:47.702  INFO 9362 --- [           main] o.s.c.d.a.test.NamedChannelTests         : Destroy all streams
11-Dec-2019 00:18:48 2019-12-11 00:18:48.100  INFO 9362 --- [           main] junit.logTestName                        : Starting Test manyToOneTest(org.springframework.cloud.dataflow.acceptance.test.NamedChannelTests)
11-Dec-2019 00:18:48 2019-12-11 00:18:48.101  INFO 9362 --- [           main] o.s.c.d.a.test.NamedChannelTests         : Creating stream 'MANY-TO-ONE'
11-Dec-2019 00:18:48 2019-12-11 00:18:48.125  INFO 9362 --- [           main] o.s.c.d.a.test.NamedChannelTests         : Deploying stream 'MANY-TO-ONE' with properties: {app.*.spring.cloud.streamapp.security.enabled=false, app.*.logging.file=${PID}-test.log, app.*.endpoints.logfile.sensitive=false, app.*.management.endpoints.web.exposure.include=*}
11-Dec-2019 00:18:48 2019-12-11 00:18:48.498  INFO 9362 --- [           main] o.s.c.d.a.test.NamedChannelTests         : Checking: Stream=MANY-TO-ONE, status = deploying, status description = The stream is being deployed.
11-Dec-2019 00:18:48 2019-12-11 00:18:48.498  INFO 9362 --- [           main] o.s.c.d.a.test.NamedChannelTests         : Sleeping to check status of Stream=MANY-TO-ONE
11-Dec-2019 00:18:58 2019-12-11 00:18:58.526  INFO 9362 --- [           main] o.s.c.d.a.test.NamedChannelTests         : Checking: Stream=MANY-TO-ONE, status = deployed, status description = The stream has been successfully deployed
11-Dec-2019 00:18:58 2019-12-11 00:18:58.548  INFO 9362 --- [           main] o.s.c.d.a.test.NamedChannelTests         : Sleeping to check status of Stream=MANY-TO-ONE
11-Dec-2019 00:19:08 2019-12-11 00:19:08.548  INFO 9362 --- [           main] o.s.c.d.a.test.NamedChannelTests         : Stream 'MANY-TO-ONE' started with status: deployed
11-Dec-2019 00:19:08 2019-12-11 00:19:08.549  INFO 9362 --- [           main] o.s.c.d.a.test.NamedChannelTests         : App 'log' has instances: {MANY-TO-ONE.log-v1-0=http://10.194.6.133:28375}
11-Dec-2019 00:19:08 2019-12-11 00:19:08.549  INFO 9362 --- [           main] o.s.c.d.a.test.NamedChannelTests         : Looking for 'Started LogSink' in logfile for log
11-Dec-2019 00:19:18 2019-12-11 00:19:18.549  INFO 9362 --- [           main] o.s.c.d.a.test.NamedChannelTests         : Requesting log for app MANY-TO-ONE.log-v1-0
11-Dec-2019 00:19:18 2019-12-11 00:19:18.855  INFO 9362 --- [           main] o.s.c.d.a.test.NamedChannelTests         : Retrieved logfile from 'http://10.194.6.133:28375/actuator/logfile
11-Dec-2019 00:19:18 2019-12-11 00:19:18.855  INFO 9362 --- [           main] o.s.c.d.a.test.NamedChannelTests         : Matched all 'Started LogSink' in logfile for app log (source MANY-TO-ONE.log-v1-0)
11-Dec-2019 00:19:18 2019-12-11 00:19:18.855  INFO 9362 --- [           main] o.s.c.d.a.test.NamedChannelTests         : Creating stream 'HTTP-SOURCE-1'
11-Dec-2019 00:19:18 2019-12-11 00:19:18.882  INFO 9362 --- [           main] o.s.c.d.a.test.NamedChannelTests         : Deploying stream 'HTTP-SOURCE-1' with properties: {app.*.spring.cloud.streamapp.security.enabled=false, app.*.logging.file=${PID}-test.log, app.*.endpoints.logfile.sensitive=false, app.*.management.endpoints.web.exposure.include=*}
11-Dec-2019 00:19:19 2019-12-11 00:19:19.255  INFO 9362 --- [           main] o.s.c.d.a.test.NamedChannelTests         : Checking: Stream=HTTP-SOURCE-1, status = deploying, status description = The stream is being deployed.
11-Dec-2019 00:19:19 2019-12-11 00:19:19.255  INFO 9362 --- [           main] o.s.c.d.a.test.NamedChannelTests         : Sleeping to check status of Stream=HTTP-SOURCE-1
11-Dec-2019 00:19:29 2019-12-11 00:19:29.301  INFO 9362 --- [           main] o.s.c.d.a.test.NamedChannelTests         : Checking: Stream=HTTP-SOURCE-1, status = deployed, status description = The stream has been successfully deployed
11-Dec-2019 00:19:29 2019-12-11 00:19:29.339  INFO 9362 --- [           main] o.s.c.d.a.test.NamedChannelTests         : Sleeping to check status of Stream=HTTP-SOURCE-1
11-Dec-2019 00:19:39 2019-12-11 00:19:39.339  INFO 9362 --- [           main] o.s.c.d.a.test.NamedChannelTests         : Stream 'HTTP-SOURCE-1' started with status: deployed
11-Dec-2019 00:19:39 2019-12-11 00:19:39.339  INFO 9362 --- [           main] o.s.c.d.a.test.NamedChannelTests         : App 'http' has instances: {HTTP-SOURCE-1.http-v1-0=http://10.194.6.133:20785}
11-Dec-2019 00:19:39 2019-12-11 00:19:39.339  INFO 9362 --- [           main] o.s.c.d.a.test.NamedChannelTests         : Looking for 'Started HttpSource' in logfile for http
11-Dec-2019 00:19:49 2019-12-11 00:19:49.339  INFO 9362 --- [           main] o.s.c.d.a.test.NamedChannelTests         : Requesting log for app HTTP-SOURCE-1.http-v1-0
11-Dec-2019 00:19:49 2019-12-11 00:19:49.617  INFO 9362 --- [           main] o.s.c.d.a.test.NamedChannelTests         : Retrieved logfile from 'http://10.194.6.133:20785/actuator/logfile
11-Dec-2019 00:19:49 2019-12-11 00:19:49.617  INFO 9362 --- [           main] o.s.c.d.a.test.NamedChannelTests         : Matched all 'Started HttpSource' in logfile for app http (source HTTP-SOURCE-1.http-v1-0)
11-Dec-2019 00:19:49 2019-12-11 00:19:49.617  INFO 9362 --- [           main] o.s.c.d.a.test.NamedChannelTests         : Creating stream 'HTTP-SOURCE-2'
11-Dec-2019 00:19:49 2019-12-11 00:19:49.647  INFO 9362 --- [           main] o.s.c.d.a.test.NamedChannelTests         : Deploying stream 'HTTP-SOURCE-2' with properties: {app.*.spring.cloud.streamapp.security.enabled=false, app.*.logging.file=${PID}-test.log, app.*.endpoints.logfile.sensitive=false, app.*.management.endpoints.web.exposure.include=*}
11-Dec-2019 00:19:50 2019-12-11 00:19:50.111  INFO 9362 --- [           main] o.s.c.d.a.test.NamedChannelTests         : Checking: Stream=HTTP-SOURCE-2, status = deploying, status description = The stream is being deployed.
11-Dec-2019 00:19:50 2019-12-11 00:19:50.112  INFO 9362 --- [           main] o.s.c.d.a.test.NamedChannelTests         : Sleeping to check status of Stream=HTTP-SOURCE-2
11-Dec-2019 00:20:00 2019-12-11 00:20:00.170  INFO 9362 --- [           main] o.s.c.d.a.test.NamedChannelTests         : Checking: Stream=HTTP-SOURCE-2, status = deployed, status description = The stream has been successfully deployed
11-Dec-2019 00:20:00 2019-12-11 00:20:00.206  INFO 9362 --- [           main] o.s.c.d.a.test.NamedChannelTests         : Sleeping to check status of Stream=HTTP-SOURCE-2
11-Dec-2019 00:20:10 2019-12-11 00:20:10.206  INFO 9362 --- [           main] o.s.c.d.a.test.NamedChannelTests         : Stream 'HTTP-SOURCE-2' started with status: deployed
11-Dec-2019 00:20:10 2019-12-11 00:20:10.207  INFO 9362 --- [           main] o.s.c.d.a.test.NamedChannelTests         : App 'http' has instances: {HTTP-SOURCE-2.http-v1-0=http://10.194.6.133:20982}
11-Dec-2019 00:20:10 2019-12-11 00:20:10.207  INFO 9362 --- [           main] o.s.c.d.a.test.NamedChannelTests         : Looking for 'Started HttpSource' in logfile for http
11-Dec-2019 00:20:20 2019-12-11 00:20:20.207  INFO 9362 --- [           main] o.s.c.d.a.test.NamedChannelTests         : Requesting log for app HTTP-SOURCE-2.http-v1-0
11-Dec-2019 00:20:20 2019-12-11 00:20:20.472  INFO 9362 --- [           main] o.s.c.d.a.test.NamedChannelTests         : Retrieved logfile from 'http://10.194.6.133:20982/actuator/logfile
11-Dec-2019 00:20:20 2019-12-11 00:20:20.472  INFO 9362 --- [           main] o.s.c.d.a.test.NamedChannelTests         : Matched all 'Started HttpSource' in logfile for app http (source HTTP-SOURCE-2.http-v1-0)
11-Dec-2019 00:20:20 2019-12-11 00:20:20.706  INFO 9362 --- [           main] o.s.c.d.a.test.NamedChannelTests         : Looking for 'abcdefg' in logfile for log
11-Dec-2019 00:20:30 2019-12-11 00:20:30.706  INFO 9362 --- [           main] o.s.c.d.a.test.NamedChannelTests         : Requesting log for app MANY-TO-ONE.log-v1-0
11-Dec-2019 00:20:30 2019-12-11 00:20:30.715  INFO 9362 --- [           main] o.s.c.d.a.test.NamedChannelTests         : Retrieved logfile from 'http://10.194.6.133:28375/actuator/logfile
11-Dec-2019 00:20:30 2019-12-11 00:20:30.715  INFO 9362 --- [           main] o.s.c.d.a.test.NamedChannelTests         : Matched all 'abcdefg' in logfile for app log (source MANY-TO-ONE.log-v1-0)
11-Dec-2019 00:20:30 2019-12-11 00:20:30.918  INFO 9362 --- [           main] o.s.c.d.a.test.NamedChannelTests         : Looking for 'hijklmn' in logfile for log
11-Dec-2019 00:20:40 2019-12-11 00:20:40.918  INFO 9362 --- [           main] o.s.c.d.a.test.NamedChannelTests         : Requesting log for app MANY-TO-ONE.log-v1-0
11-Dec-2019 00:20:40 2019-12-11 00:20:40.925  INFO 9362 --- [           main] o.s.c.d.a.test.NamedChannelTests         : Retrieved logfile from 'http://10.194.6.133:28375/actuator/logfile
11-Dec-2019 00:20:40 2019-12-11 00:20:40.925  INFO 9362 --- [           main] o.s.c.d.a.test.NamedChannelTests         : Matched all 'hijklmn' in logfile for app log (source MANY-TO-ONE.log-v1-0)
11-Dec-2019 00:20:40 2019-12-11 00:20:40.926  INFO 9362 --- [           main] junit.logTestName                        : Test manyToOneTest(org.springframework.cloud.dataflow.acceptance.test.NamedChannelTests) Succeeded
11-Dec-2019 00:20:40 2019-12-11 00:20:40.927  INFO 9362 --- [           main] junit.logTestName                        : Finished Test manyToOneTest(org.springframework.cloud.dataflow.acceptance.test.NamedChannelTests)
11-Dec-2019 00:20:40 2019-12-11 00:20:40.927  INFO 9362 --- [           main] o.s.c.d.a.test.NamedChannelTests         : Destroy all streams
11-Dec-2019 00:20:41 Tests run: 4, Failures: 0, Errors: 0, Skipped: 1, Time elapsed: 277.845 sec - in org.springframework.cloud.dataflow.acceptance.test.NamedChannelTests
11-Dec-2019 00:20:41 Running org.springframework.cloud.dataflow.acceptance.test.util.PlatformHelperTests
11-Dec-2019 00:20:41 Tests run: 3, Failures: 0, Errors: 0, Skipped: 0, Time elapsed: 0.083 sec - in org.springframework.cloud.dataflow.acceptance.test.util.PlatformHelperTests
11-Dec-2019 00:20:41 Running org.springframework.cloud.dataflow.acceptance.test.util.ApplicationTests
11-Dec-2019 00:20:41 Tests run: 2, Failures: 0, Errors: 0, Skipped: 0, Time elapsed: 0 sec - in org.springframework.cloud.dataflow.acceptance.test.util.ApplicationTests
11-Dec-2019 00:20:41 2019-12-11 00:20:41.380  INFO 9362 --- [       Thread-6] o.s.c.support.GenericApplicationContext  : Closing org.springframework.context.support.GenericApplicationContext@6cd3ad8a: startup date [Wed Dec 11 00:08:03 UTC 2019]; root of context hierarchy
11-Dec-2019 00:20:41
11-Dec-2019 00:20:41 Results :
11-Dec-2019 00:20:41
11-Dec-2019 00:20:41 Tests run: 22, Failures: 0, Errors: 0, Skipped: 4
11-Dec-2019 00:20:41
11-Dec-2019 00:20:41 [INFO]
11-Dec-2019 00:20:41 [INFO] >>> maven-surefire-report-plugin:3.0.0-M3:report (default-cli) > [surefire]test @ spring-cloud-dataflow-acceptance-tests >>>
11-Dec-2019 00:20:41 [INFO]
11-Dec-2019 00:20:41 [INFO] --- maven-checkstyle-plugin:2.17:check (checkstyle-validation) @ spring-cloud-dataflow-acceptance-tests ---
11-Dec-2019 00:20:41 [INFO]
11-Dec-2019 00:20:41 [INFO] --- maven-resources-plugin:2.6:resources (default-resources) @ spring-cloud-dataflow-acceptance-tests ---
11-Dec-2019 00:20:41 [INFO] Using 'UTF-8' encoding to copy filtered resources.
11-Dec-2019 00:20:41 [INFO] skip non existing resourceDirectory /opt/bamboo-home/xml-data/build-dir/SCDT-LOCAL20XSKIPPER20X-KAFKA/src/main/resources
11-Dec-2019 00:20:41 [INFO] skip non existing resourceDirectory /opt/bamboo-home/xml-data/build-dir/SCDT-LOCAL20XSKIPPER20X-KAFKA/src/main/resources
11-Dec-2019 00:20:41 [INFO]
11-Dec-2019 00:20:41 [INFO] --- maven-compiler-plugin:3.1:compile (default-compile) @ spring-cloud-dataflow-acceptance-tests ---
11-Dec-2019 00:20:41 [INFO] Nothing to compile - all classes are up to date
11-Dec-2019 00:20:41 [INFO]
11-Dec-2019 00:20:41 [INFO] --- maven-resources-plugin:2.6:testResources (default-testResources) @ spring-cloud-dataflow-acceptance-tests ---
11-Dec-2019 00:20:41 [INFO] Using 'UTF-8' encoding to copy filtered resources.
11-Dec-2019 00:20:41 [INFO] Copying 1 resource
11-Dec-2019 00:20:41 [INFO]
11-Dec-2019 00:20:41 [INFO] --- maven-compiler-plugin:3.1:testCompile (default-testCompile) @ spring-cloud-dataflow-acceptance-tests ---
11-Dec-2019 00:20:41 [INFO] Nothing to compile - all classes are up to date
11-Dec-2019 00:20:41 [INFO]
11-Dec-2019 00:20:41 [INFO] --- maven-surefire-plugin:2.18.1:test (default-test) @ spring-cloud-dataflow-acceptance-tests ---
11-Dec-2019 00:20:41 [INFO] Skipping execution of surefire because it has already been run for this configuration
11-Dec-2019 00:20:41 [INFO]
11-Dec-2019 00:20:41 [INFO] <<< maven-surefire-report-plugin:3.0.0-M3:report (default-cli) < [surefire]test @ spring-cloud-dataflow-acceptance-tests <<<
11-Dec-2019 00:20:41 [INFO]
11-Dec-2019 00:20:41 [INFO] --- maven-surefire-report-plugin:3.0.0-M3:report (default-cli) @ spring-cloud-dataflow-acceptance-tests ---
11-Dec-2019 00:20:41 [WARNING] Unable to locate Test Source XRef to link to - DISABLED
11-Dec-2019 00:20:41 [INFO] ------------------------------------------------------------------------
11-Dec-2019 00:20:41 [INFO] BUILD SUCCESS
11-Dec-2019 00:20:41 [INFO] ------------------------------------------------------------------------
11-Dec-2019 00:20:41 [INFO] Total time: 15:24 min
11-Dec-2019 00:20:41 [INFO] Finished at: 2019-12-11T00:20:41+00:00
11-Dec-2019 00:20:42 [INFO] Final Memory: 59M/503M
11-Dec-2019 00:20:42 [INFO] ------------------------------------------------------------------------
11-Dec-2019 00:20:42 Clean up, clean up, everybody everywhere; clean up clean up, everybody do your share!
11-Dec-2019 00:20:42 Clean up servers
11-Dec-2019 00:20:42 Killing process PID [9209]
11-Dec-2019 00:20:42 Killing process PID [9133]
11-Dec-2019 00:20:43 No stopped containers
11-Dec-2019 00:20:43 Stopping mysql_mysql_1 ...
11-Dec-2019 00:20:45
11-Dec-2019 00:20:45 Stopping mysql_mysql_1 ... done
11-Dec-2019 00:20:45 Removing mysql_mysql_1 ...
11-Dec-2019 00:20:45
11-Dec-2019 00:20:45 Removing mysql_mysql_1 ... done
11-Dec-2019 00:20:45 Going to remove mysql_mysql_1
11-Dec-2019 00:20:45 Stopping kafka_kafka_1     ...
11-Dec-2019 00:20:45 Stopping kafka_zookeeper_1 ...
11-Dec-2019 00:20:49
11-Dec-2019 00:20:49 Stopping kafka_kafka_1     ... done
11-Dec-2019 00:20:56
11-Dec-2019 00:20:56 Stopping kafka_zookeeper_1 ... done
11-Dec-2019 00:20:56 Removing kafka_kafka_1     ...
11-Dec-2019 00:20:56 Removing kafka_zookeeper_1 ...
11-Dec-2019 00:20:56
11-Dec-2019 00:20:56 Removing kafka_zookeeper_1 ... done
11-Dec-2019 00:20:56
11-Dec-2019 00:20:56 Removing kafka_kafka_1     ... done
11-Dec-2019 00:20:56 Going to remove kafka_kafka_1, kafka_zookeeper_1
11-Dec-2019 00:20:56
11-Dec-2019 00:20:56 Finished task 'Execute Acceptance Tests' with result: Success
11-Dec-2019 00:20:56 Starting task 'JUnit Parser' of type 'com.atlassian.bamboo.plugins.testresultparser:task.testresultparser.junit'
11-Dec-2019 00:20:56 Parsing test results under /opt/bamboo-home/xml-data/build-dir/SCDT-LOCAL20XSKIPPER20X-KAFKA...
11-Dec-2019 00:20:56 Finished task 'JUnit Parser' with result: Success
11-Dec-2019 00:20:56 Starting task 'clean up' of type 'com.atlassian.bamboo.plugins.scripttask:task.builder.script'
11-Dec-2019 00:20:56
Beginning to execute external process for build 'Spring Cloud Data Flow Acceptance Tests - Local + SCDF-2.0.4.BS + Skipper 2.0.4.BS (12 am) - Run Data Flow Acceptance Tests for Kafka #193 (SCDT-LOCAL20XSKIPPER20X-KAFKA-193)'
... running command line:
/opt/bamboo-home/temp/SCDT-LOCAL20XSKIPPER20X-KAFKA-193-ScriptBuildTask-2569721255470154351.sh
... in: /opt/bamboo-home/xml-data/build-dir/SCDT-LOCAL20XSKIPPER20X-KAFKA
... using extra environment variables:
bamboo_planRepository_1_branch=master
bamboo_********_username_password=********
bamboo_signing_store_password=********
bamboo_capability_system_builder_ant_Ant_1_9=/opt/ant-1.9
bamboo_capability_system_builder_ant_Ant_1_8=/opt/ant-1.8
bamboo_planRepository_1_branchDisplayName=master
bamboo_repository_274694331_git_username=spring-buildmaster
bamboo_artifactory_override_resolve_repo=libs-milestone
bamboo_capability_system_builder_node_Node_js_10_16=/opt/node-10.16/bin/node
bamboo_repository_revision_number=ccc77f664d11e18a3b7f2fa17f012d09d08432a9
bamboo_RIAK_BIN=/usr/sbin/riak
bamboo_buildKey=SCDT-LOCAL20XSKIPPER20X-KAFKA
bamboo_repository_274694331_branch_name=master
bamboo_ge_cache_username=ci
bamboo_bintray_password=********
bamboo_sonar_token_password=********
bamboo_shortJobName=Run Data Flow Acceptance Tests for Kafka
bamboo_artifactory_override_resolver_password=********
bamboo_sonatype_token=RSJChaox
bamboo_capability_system_builder_gradle___gradlew=./gradlew
bamboo_buildResultsUrl=https://build.spring.io/browse/SCDT-LOCAL20XSKIPPER20X-KAFKA-193
bamboo_capability_system_builder_mvn3_Maven_3_3=/opt/maven-3.3
bamboo_capability_system_builder_mvn3_Maven_3_2=/opt/maven-3.2
bamboo_capability_system_builder_mvn3_Maven_3_1=/opt/maven-3.1
bamboo_planRepository_repositoryUrl=https://github.com/spring-cloud/spring-cloud-dataflow-acceptance-tests.git
bamboo_capability_system_builder_mvn3_Maven_3_6=/opt/maven-3.6
bamboo_agentId=286195717
bamboo_capability_system_builder_mvn3_Maven_3_5=/opt/maven-3.5
bamboo_capability_system_builder_mvn3_Maven_3_0=/opt/maven-3.0
bamboo_planRepository_revision=ccc77f664d11e18a3b7f2fa17f012d09d08432a9
bamboo_planRepository_previousRevision=ccc77f664d11e18a3b7f2fa17f012d09d08432a9
bamboo_capability_remote_build=true
bamboo_repository_branch_name=master
bamboo_sonatype_token_password=********
bamboo_sonatype_user=springsource
bamboo_repository_274694331_name=Git
bamboo_scdf_acceptance_tests_password=********
bamboo_APPLE_AC_PASSWORD=********
bamboo_repository_274694331_git_branch=master
bamboo_planRepository_branch=master
bamboo_capability_system_jdk_JDK_13=/opt/jdk-13
bamboo_planRepository_1_type=gitv2
bamboo_planRepository_branchName=master
bamboo_capability_system_jdk_JDK_12=/opt/jdk-12
bamboo_capability_system_builder_gradlew_gradlew=./
bamboo_capability_system_builder_ant_Ant_1_10=/opt/ant-1.10
bamboo_sonar_password=********
bamboo_hg_cache_directory=/opt/bamboo-home/xml-data/build-dir/_hg-repositories-cache
bamboo_planRepository_1_username=spring-buildmaster
bamboo_repository_274694331_git_repositoryUrl=https://github.com/spring-cloud/spring-cloud-dataflow-acceptance-tests.git
bamboo_planRepository_type=gitv2
bamboo_git_cache_directory=/opt/bamboo-home/xml-data/build-dir/_git-repositories-cache
bamboo_artifactory_username=buildmaster
bamboo_tmp_directory=/opt/bamboo-home/temp
bamboo_planKey=SCDT-LOCAL20XSKIPPER20X
bamboo_planRepository_username=spring-buildmaster
bamboo_JDK8_HOME=/opt/jdk-8
bamboo_repository_274694331_previous_revision_number=ccc77f664d11e18a3b7f2fa17f012d09d08432a9
bamboo_planRepository_1_branchName=master
bamboo_sonar_version=6.7.7
bamboo_sonar_jdbc_password=********
bamboo_bintray_api_key_password=********
bamboo_capability_system_jdk_JDK_1_11=/opt/jdk-11
bamboo_resultsUrl=https://build.spring.io/browse/SCDT-LOCAL20XSKIPPER20X-KAFKA-193
bamboo_APPLE_AC_USERNAME_PASSWORD=********
bamboo_capability_system_jdk_JDK_1_10=/opt/jdk-10
bamboo_build_working_directory=/opt/bamboo-home/xml-data/build-dir/SCDT-LOCAL20XSKIPPER20X-KAFKA
bamboo_planRepository_1_name=Git
bamboo_capability_system_os=ubuntu1804
bamboo_nexusPush_stagingProfile=buildmaster
bamboo_shortPlanName=Local + SCDF-2.0.4.BS + Skipper 2.0.4.BS (12 am)
bamboo_planRepository_name=Git
bamboo_buildNumber=193
bamboo_planName=Spring Cloud Data Flow Acceptance Tests - Local + SCDF-2.0.4.BS + Skipper 2.0.4.BS (12 am)
bamboo_JDK7_HOME=/opt/jdk-7
bamboo_build_commandline_com_atlassian_bamboo_plugins_scripttask_task_builder_script_7=/opt/bamboo-home/temp/SCDT-LOCAL20XSKIPPER20X-KAFKA-193-ScriptBuildTask-3314422636666466517.sh
bamboo_shortPlanKey=LOCAL20XSKIPPER20X
bamboo_shortJobKey=KAFKA
bamboo_artifactory_password=********
bamboo_buildTimeStamp=2019-12-11T00:00:05.528Z
bamboo_repository_previous_revision_number=ccc77f664d11e18a3b7f2fa17f012d09d08432a9
bamboo_sonar_username=buildmaster
bamboo_********_password=********
bamboo_repository_git_branch=master
bamboo_buildResultKey=SCDT-LOCAL20XSKIPPER20X-KAFKA-193
bamboo_nexusPush_close=true
bamboo_artifactory_override_resolver_username=buildmaster
bamboo_buildPlanName=Spring Cloud Data Flow Acceptance Tests - Local + SCDF-2.0.4.BS + Skipper 2.0.4.BS (12 am) - Run Data Flow Acceptance Tests for Kafka
bamboo_repository_274694331_revision_number=ccc77f664d11e18a3b7f2fa17f012d09d08432a9
bamboo_planRepository_1_revision=ccc77f664d11e18a3b7f2fa17f012d09d08432a9
bamboo_repository_name=Git
bamboo_signing_key_password=********
bamboo_capability_system_builder_groovy_Groovy_2_5=/opt/groovy-2.5
bamboo_buildFailed=false
bamboo_capability_system_docker_executable=/usr/bin/docker
bamboo_capability_system_jdk_OpenJDK_7=/opt/jdk-7
bamboo_capability_system_builder_groovy_Groovy_2_4=/opt/groovy-2.4
bamboo_artifactory_override_deployer_username=buildmaster
bamboo_capability_system_builder_command_Bash=/bin/bash
bamboo_jobFailed=false
bamboo_agentWorkingDirectory=/opt/bamboo-home/xml-data/build-dir
bamboo_capability_system_git_executable=/usr/bin/git
bamboo_repository_git_username=spring-buildmaster
bamboo_planRepository_1_previousRevision=ccc77f664d11e18a3b7f2fa17f012d09d08432a9
bamboo_capability_os_family=unix
bamboo_planRepository_branchDisplayName=master
bamboo_capability_system_builder_maven_Artifactory_Maven_3_6=/opt/maven-3.6
bamboo_capability_system_builder_maven_Artifactory_Maven_3_5=/opt/maven-3.5
bamboo_capability_system_builder_maven_Artifactory_Maven_3_3=/opt/maven-3.3
bamboo_capability_system_builder_maven_Artifactory_Maven_3_2=/opt/maven-3.2
bamboo_s3_properties=/home/bamboo/tools/s3.properties
bamboo_capability_system_builder_maven_Artifactory_Maven_3_1=/opt/maven-3.1
bamboo_artifactory_override_deploy_repo=libs-snapshot-local
bamboo_capability_system_builder_maven_Artifactory_Maven_3_0=/opt/maven-3.0
bamboo_plan_storageTag=plan-274497908
bamboo_bintray_username_password=********
bamboo_repository_git_repositoryUrl=https://github.com/spring-cloud/spring-cloud-dataflow-acceptance-tests.git
bamboo_working_directory=/opt/bamboo-home/xml-data/build-dir/SCDT-LOCAL20XSKIPPER20X-KAFKA
bamboo_planRepository_1_repositoryUrl=https://github.com/spring-cloud/spring-cloud-dataflow-acceptance-tests.git
bamboo_capability_system_jdk_JDK_1_8=/opt/jdk-8
bamboo_artifactory_override_deployer_password=********
bamboo_capability_system_jdk_JDK_1_9=/opt/jdk-9
bamboo_capability_system_jdk_JDK_1_6=/opt/jdk-6
bamboo_sonatype_password=********
bamboo_capability_system_jdk_JDK_1_7=/opt/jdk-7
bamboo_sonar_ip=10.194.6.9
bamboo_ge_cache_password=********
11-Dec-2019 00:20:56 CLEANING UP RESOURCES AFTER RUNNING TESTS
11-Dec-2019 00:20:56 Environment variable JAVA_HOME must be set
11-Dec-2019 00:20:56 FINISHED CLEANING UP RESOURCES
11-Dec-2019 00:20:56 Finished task 'clean up' with result: Success
11-Dec-2019 00:20:56 Running post build plugin 'Docker Container Cleanup'
11-Dec-2019 00:20:56 Running post build plugin 'NCover Results Collector'
11-Dec-2019 00:20:56 Running post build plugin 'Artifactory Release Management Staging'
11-Dec-2019 00:20:56 Running post build plugin 'Artifactory Build Info Copier'
11-Dec-2019 00:20:56 Running post build plugin 'Artifactory Gradle Properties Info Copier'
11-Dec-2019 00:20:56 Running post build plugin 'Clover Results Collector'
11-Dec-2019 00:20:56 Running post build plugin 'npm Cache Cleanup'
11-Dec-2019 00:20:56 Running post build plugin 'Artifact Copier'
11-Dec-2019 00:20:56 Publishing an artifact: App and Server Logs
11-Dec-2019 00:20:56 Finished publishing of artifact Non required job artifact: [App and Server Logs], pattern: [**/*.log] anchored at: [local] in 39.56 ms
11-Dec-2019 00:20:56 Publishing an artifact: Test Results
11-Dec-2019 00:20:56 Finished publishing of artifact Non required job artifact: [Test Results], pattern: [**/target/surefire-reports/**/*.*] in 36.97 ms
11-Dec-2019 00:20:57 Successfully removed working directory at '/opt/bamboo-home/xml-data/build-dir/SCDT-LOCAL20XSKIPPER20X-KAFKA'
11-Dec-2019 00:20:57 Finalising the build...
11-Dec-2019 00:20:57 Stopping timer.
11-Dec-2019 00:20:57 Build SCDT-LOCAL20XSKIPPER20X-KAFKA-193 completed.
11-Dec-2019 00:20:57 Running on server: post build plugin 'NCover Results Collector'
11-Dec-2019 00:20:57 Running on server: post build plugin 'Build Hanging Detection Configuration'
11-Dec-2019 00:20:57 Running on server: post build plugin 'Bamboo project link creator'
11-Dec-2019 00:20:57 Running on server: post build plugin 'Clover Delta Calculator'
11-Dec-2019 00:20:57 Running on server: post build plugin 'Maven Dependencies Postprocessor'
11-Dec-2019 00:20:57 All post build plugins have finished
11-Dec-2019 00:20:57 Generating build results summary...
11-Dec-2019 00:20:57 Saving build results to disk...
11-Dec-2019 00:20:57 Logging substituted variables...
11-Dec-2019 00:20:57 Indexing build results...
11-Dec-2019 00:20:57 Finished building SCDT-LOCAL20XSKIPPER20X-KAFKA-193.