Build: #194 failed

Job: Run Data Flow Acceptance Tests for Kafka failed

Stages & jobs

  1. Test Stage - Kafka

  2. Test Stage - Rabbit

Build log

The build generated 954 lines of output. Download or view full build log

12-Dec-2019 00:07:33 Build Spring Cloud Data Flow Acceptance Tests - Local + SCDF-2.0.4.BS + Skipper 2.0.4.BS (12 am) - Run Data Flow Acceptance Tests for Kafka #194 (SCDT-LOCAL20XSKIPPER20X-KAFKA-194) started building on agent bamboo-21.af.pivotal.io
12-Dec-2019 00:07:33 Remote agent on host bamboo-21.af.pivotal.io
12-Dec-2019 00:07:33 Build working directory is /opt/bamboo-home/xml-data/build-dir/SCDT-LOCAL20XSKIPPER20X-KAFKA
12-Dec-2019 00:07:33 Executing build Spring Cloud Data Flow Acceptance Tests - Local + SCDF-2.0.4.BS + Skipper 2.0.4.BS (12 am) - Run Data Flow Acceptance Tests for Kafka #194 (SCDT-LOCAL20XSKIPPER20X-KAFKA-194)
12-Dec-2019 00:07:33 Starting task 'Checkout Default Repository' of type 'com.atlassian.bamboo.plugins.vcs:task.vcs.checkout'
12-Dec-2019 00:07:33 Checking out into /opt/bamboo-home/xml-data/build-dir/SCDT-LOCAL20XSKIPPER20X-KAFKA
12-Dec-2019 00:07:33 Updating source code to revision: ccc77f664d11e18a3b7f2fa17f012d09d08432a9
12-Dec-2019 00:07:33 Creating local git repository in '/opt/bamboo-home/xml-data/build-dir/SCDT-LOCAL20XSKIPPER20X-KAFKA/.git'.
12-Dec-2019 00:07:33 Initialized empty Git repository in /opt/bamboo-home/xml-data/build-dir/SCDT-LOCAL20XSKIPPER20X-KAFKA/.git/
12-Dec-2019 00:07:34 Fetching 'refs/heads/master' from 'https://github.com/spring-cloud/spring-cloud-dataflow-acceptance-tests.git'.
12-Dec-2019 00:07:34 From https://github.com/spring-cloud/spring-cloud-dataflow-acceptance-tests
12-Dec-2019 00:07:34 * [new branch]      master     -> master
12-Dec-2019 00:07:34 Checking out revision ccc77f664d11e18a3b7f2fa17f012d09d08432a9.
12-Dec-2019 00:07:34 Already on 'master'
12-Dec-2019 00:07:34 Updated source code to revision: ccc77f664d11e18a3b7f2fa17f012d09d08432a9
12-Dec-2019 00:07:34 Finished task 'Checkout Default Repository' with result: Success
12-Dec-2019 00:07:34 Running pre-build action: Artifactory Release Staging
12-Dec-2019 00:07:34 Running pre-build action: VCS Version Collector
12-Dec-2019 00:07:35 Starting task 'Execute Acceptance Tests' of type 'com.atlassian.bamboo.plugins.scripttask:task.builder.script'
12-Dec-2019 00:07:35
Beginning to execute external process for build 'Spring Cloud Data Flow Acceptance Tests - Local + SCDF-2.0.4.BS + Skipper 2.0.4.BS (12 am) - Run Data Flow Acceptance Tests for Kafka #194 (SCDT-LOCAL20XSKIPPER20X-KAFKA-194)'
... running command line:
/opt/bamboo-home/temp/SCDT-LOCAL20XSKIPPER20X-KAFKA-194-ScriptBuildTask-5340752339533466428.sh
... in: /opt/bamboo-home/xml-data/build-dir/SCDT-LOCAL20XSKIPPER20X-KAFKA
... using extra environment variables:
bamboo_planRepository_1_branch=master
bamboo_********_username_password=********
bamboo_signing_store_password=********
bamboo_capability_system_builder_ant_Ant_1_9=/opt/ant-1.9
bamboo_capability_system_builder_ant_Ant_1_8=/opt/ant-1.8
bamboo_planRepository_1_branchDisplayName=master
bamboo_repository_274694331_git_username=spring-buildmaster
bamboo_artifactory_override_resolve_repo=libs-milestone
bamboo_capability_system_builder_node_Node_js_10_16=/opt/node-10.16/bin/node
bamboo_repository_revision_number=ccc77f664d11e18a3b7f2fa17f012d09d08432a9
bamboo_RIAK_BIN=/usr/sbin/riak
bamboo_buildKey=SCDT-LOCAL20XSKIPPER20X-KAFKA
bamboo_repository_274694331_branch_name=master
bamboo_ge_cache_username=ci
bamboo_bintray_password=********
bamboo_sonar_token_password=********
bamboo_shortJobName=Run Data Flow Acceptance Tests for Kafka
bamboo_artifactory_override_resolver_password=********
bamboo_sonatype_token=RSJChaox
bamboo_capability_system_builder_gradle___gradlew=./gradlew
bamboo_buildResultsUrl=https://build.spring.io/browse/SCDT-LOCAL20XSKIPPER20X-KAFKA-194
bamboo_capability_system_builder_mvn3_Maven_3_3=/opt/maven-3.3
bamboo_capability_system_builder_mvn3_Maven_3_2=/opt/maven-3.2
bamboo_capability_system_builder_mvn3_Maven_3_1=/opt/maven-3.1
bamboo_planRepository_repositoryUrl=https://github.com/spring-cloud/spring-cloud-dataflow-acceptance-tests.git
bamboo_capability_system_builder_mvn3_Maven_3_6=/opt/maven-3.6
bamboo_agentId=286195722
bamboo_capability_system_builder_mvn3_Maven_3_5=/opt/maven-3.5
bamboo_capability_system_builder_mvn3_Maven_3_0=/opt/maven-3.0
bamboo_planRepository_revision=ccc77f664d11e18a3b7f2fa17f012d09d08432a9
bamboo_planRepository_previousRevision=ccc77f664d11e18a3b7f2fa17f012d09d08432a9
bamboo_capability_remote_build=true
bamboo_repository_branch_name=master
bamboo_sonatype_token_password=********
bamboo_sonatype_user=springsource
bamboo_repository_274694331_name=Git
bamboo_scdf_acceptance_tests_password=********
bamboo_APPLE_AC_PASSWORD=********
JAVA_HOME=/opt/jdk-8
bamboo_repository_274694331_git_branch=master
bamboo_planRepository_branch=master
bamboo_capability_system_jdk_JDK_13=/opt/jdk-13
bamboo_planRepository_1_type=gitv2
bamboo_planRepository_branchName=master
bamboo_capability_system_jdk_JDK_12=/opt/jdk-12
bamboo_capability_system_builder_gradlew_gradlew=./
bamboo_capability_system_builder_ant_Ant_1_10=/opt/ant-1.10
bamboo_sonar_password=********
bamboo_hg_cache_directory=/opt/bamboo-home/xml-data/build-dir/_hg-repositories-cache
bamboo_planRepository_1_username=spring-buildmaster
bamboo_repository_274694331_git_repositoryUrl=https://github.com/spring-cloud/spring-cloud-dataflow-acceptance-tests.git
bamboo_planRepository_type=gitv2
bamboo_git_cache_directory=/opt/bamboo-home/xml-data/build-dir/_git-repositories-cache
bamboo_artifactory_username=buildmaster
bamboo_tmp_directory=/opt/bamboo-home/temp
bamboo_planKey=SCDT-LOCAL20XSKIPPER20X
bamboo_planRepository_username=spring-buildmaster
bamboo_JDK8_HOME=/opt/jdk-8
bamboo_repository_274694331_previous_revision_number=ccc77f664d11e18a3b7f2fa17f012d09d08432a9
bamboo_planRepository_1_branchName=master
bamboo_sonar_version=6.7.7
bamboo_sonar_jdbc_password=********
bamboo_bintray_api_key_password=********
bamboo_capability_system_jdk_JDK_1_11=/opt/jdk-11
bamboo_resultsUrl=https://build.spring.io/browse/SCDT-LOCAL20XSKIPPER20X-KAFKA-194
bamboo_APPLE_AC_USERNAME_PASSWORD=********
bamboo_capability_system_jdk_JDK_1_10=/opt/jdk-10
bamboo_build_working_directory=/opt/bamboo-home/xml-data/build-dir/SCDT-LOCAL20XSKIPPER20X-KAFKA
bamboo_planRepository_1_name=Git
bamboo_capability_system_os=ubuntu1804
bamboo_nexusPush_stagingProfile=buildmaster
bamboo_shortPlanName=Local + SCDF-2.0.4.BS + Skipper 2.0.4.BS (12 am)
bamboo_planRepository_name=Git
bamboo_buildNumber=194
bamboo_planName=Spring Cloud Data Flow Acceptance Tests - Local + SCDF-2.0.4.BS + Skipper 2.0.4.BS (12 am)
bamboo_JDK7_HOME=/opt/jdk-7
bamboo_shortPlanKey=LOCAL20XSKIPPER20X
bamboo_shortJobKey=KAFKA
bamboo_artifactory_password=********
bamboo_buildTimeStamp=2019-12-12T00:00:04.925Z
bamboo_repository_previous_revision_number=ccc77f664d11e18a3b7f2fa17f012d09d08432a9
bamboo_sonar_username=buildmaster
bamboo_********_password=********
bamboo_repository_git_branch=master
bamboo_buildResultKey=SCDT-LOCAL20XSKIPPER20X-KAFKA-194
bamboo_nexusPush_close=true
bamboo_artifactory_override_resolver_username=buildmaster
bamboo_buildPlanName=Spring Cloud Data Flow Acceptance Tests - Local + SCDF-2.0.4.BS + Skipper 2.0.4.BS (12 am) - Run Data Flow Acceptance Tests for Kafka
bamboo_repository_274694331_revision_number=ccc77f664d11e18a3b7f2fa17f012d09d08432a9
bamboo_planRepository_1_revision=ccc77f664d11e18a3b7f2fa17f012d09d08432a9
bamboo_repository_name=Git
bamboo_signing_key_password=********
bamboo_capability_system_builder_groovy_Groovy_2_5=/opt/groovy-2.5
bamboo_buildFailed=false
bamboo_capability_system_docker_executable=/usr/bin/docker
bamboo_capability_system_jdk_OpenJDK_7=/opt/jdk-7
bamboo_capability_system_builder_groovy_Groovy_2_4=/opt/groovy-2.4
bamboo_artifactory_override_deployer_username=buildmaster
bamboo_capability_system_builder_command_Bash=/bin/bash
bamboo_agentWorkingDirectory=/opt/bamboo-home/xml-data/build-dir
bamboo_capability_system_git_executable=/usr/bin/git
bamboo_repository_git_username=spring-buildmaster
bamboo_planRepository_1_previousRevision=ccc77f664d11e18a3b7f2fa17f012d09d08432a9
bamboo_capability_os_family=unix
bamboo_planRepository_branchDisplayName=master
bamboo_capability_system_builder_maven_Artifactory_Maven_3_6=/opt/maven-3.6
bamboo_capability_system_builder_maven_Artifactory_Maven_3_5=/opt/maven-3.5
bamboo_capability_system_builder_maven_Artifactory_Maven_3_3=/opt/maven-3.3
bamboo_capability_system_builder_maven_Artifactory_Maven_3_2=/opt/maven-3.2
bamboo_s3_properties=/home/bamboo/tools/s3.properties
bamboo_capability_system_builder_maven_Artifactory_Maven_3_1=/opt/maven-3.1
bamboo_artifactory_override_deploy_repo=libs-snapshot-local
bamboo_capability_system_builder_maven_Artifactory_Maven_3_0=/opt/maven-3.0
bamboo_plan_storageTag=plan-274497908
bamboo_bintray_username_password=********
bamboo_repository_git_repositoryUrl=https://github.com/spring-cloud/spring-cloud-dataflow-acceptance-tests.git
bamboo_working_directory=/opt/bamboo-home/xml-data/build-dir/SCDT-LOCAL20XSKIPPER20X-KAFKA
bamboo_planRepository_1_repositoryUrl=https://github.com/spring-cloud/spring-cloud-dataflow-acceptance-tests.git
bamboo_capability_system_jdk_JDK_1_8=/opt/jdk-8
bamboo_artifactory_override_deployer_password=********
bamboo_capability_system_jdk_JDK_1_9=/opt/jdk-9
bamboo_capability_system_jdk_JDK_1_6=/opt/jdk-6
bamboo_sonatype_password=********
bamboo_capability_system_jdk_JDK_1_7=/opt/jdk-7
bamboo_sonar_ip=10.194.6.9
bamboo_ge_cache_password=********
12-Dec-2019 00:07:35 CLEANING UP RESOURCES BEFORE TESTS
12-Dec-2019 00:07:35 Setting the environment variables
12-Dec-2019 00:07:35 Export the unset env. variables from /opt/bamboo-home/xml-data/build-dir/SCDT-LOCAL20XSKIPPER20X-KAFKA/local/init/env.properties :
12-Dec-2019 00:07:35    SPRING_CLOUD_DATAFLOW_SERVER_DOWNLOAD_URL = https://repo.spring.io/libs-snapshot/org/springframework/cloud/spring-cloud-dataflow-server-local//spring-cloud-dataflow-server-local-.jar
12-Dec-2019 00:07:35    SPRING_CLOUD_SKIPPER_SERVER_DOWNLOAD_URL = https://repo.spring.io/libs-snapshot/org/springframework/cloud/spring-cloud-skipper-server//spring-cloud-skipper-server-.jar
12-Dec-2019 00:07:35    SPRING_DATASOURCE_USERNAME = spring
12-Dec-2019 00:07:35    SPRING_DATASOURCE_PASSWORD = cloud
12-Dec-2019 00:07:35    SPRING_SCHEMA_NAME = dataflow
12-Dec-2019 00:07:35    DOCKER_SERVER = localhost
12-Dec-2019 00:07:35 Setting retries to 60 and WAIT_TIME to 5
12-Dec-2019 00:07:35 Export the unset env. variables from /opt/bamboo-home/xml-data/build-dir/SCDT-LOCAL20XSKIPPER20X-KAFKA/local/binder/rabbit/env.properties :
12-Dec-2019 00:07:35    STREAM_REGISTRATION_RESOURCE = https://dataflow.spring.io/latest-stream-applications-rabbit-maven
12-Dec-2019 00:07:35    TASK_REGISTRATION_RESOURCE = https://dataflow.spring.io/latest-task-applications-maven
12-Dec-2019 00:07:35 SCDF SERVER URI: http://localhost:9393
12-Dec-2019 00:07:35 Clean up, clean up, everybody everywhere; clean up clean up, everybody do your share!
12-Dec-2019 00:07:35 Clean up servers
12-Dec-2019 00:07:35 No stopped containers
12-Dec-2019 00:07:36 No stopped containers
12-Dec-2019 00:07:37 No stopped containers
12-Dec-2019 00:07:37 FINISHED CLEANING UP RESOURCES
12-Dec-2019 00:07:37 Setting the environment variables
12-Dec-2019 00:07:37 Export the unset env. variables from /opt/bamboo-home/xml-data/build-dir/SCDT-LOCAL20XSKIPPER20X-KAFKA/local/init/env.properties :
12-Dec-2019 00:07:37    SPRING_CLOUD_DATAFLOW_SERVER_DOWNLOAD_URL = https://repo.spring.io/libs-snapshot/org/springframework/cloud/spring-cloud-dataflow-server/2.0.4.BUILD-SNAPSHOT/spring-cloud-dataflow-server-2.0.4.BUILD-SNAPSHOT.jar
12-Dec-2019 00:07:37    SPRING_CLOUD_SKIPPER_SERVER_DOWNLOAD_URL = https://repo.spring.io/libs-snapshot/org/springframework/cloud/spring-cloud-skipper-server/2.0.4.BUILD-SNAPSHOT/spring-cloud-skipper-server-2.0.4.BUILD-SNAPSHOT.jar
12-Dec-2019 00:07:37    SPRING_DATASOURCE_USERNAME = spring
12-Dec-2019 00:07:37    SPRING_DATASOURCE_PASSWORD = cloud
12-Dec-2019 00:07:37    SPRING_SCHEMA_NAME = dataflow
12-Dec-2019 00:07:37    DOCKER_SERVER = localhost
12-Dec-2019 00:07:37 Setting retries to 60 and WAIT_TIME to 5
12-Dec-2019 00:07:37 cleaning up any previous mysql docker containers...
12-Dec-2019 00:07:37 done cleaning up.
12-Dec-2019 00:07:37 Could not find a local mysql server, trying docker.
12-Dec-2019 00:07:38 Pulling mysql (mysql:5.7)...
12-Dec-2019 00:07:39 5.7: Pulling from library/mysql
12-Dec-2019 00:07:46 Digest: sha256:5779c71a4730da36f013a23a437b5831198e68e634575f487d37a0639470e3a8
12-Dec-2019 00:07:46 Status: Downloaded newer image for mysql:5.7
12-Dec-2019 00:07:46 Creating mysql_mysql_1 ...
12-Dec-2019 00:07:47
12-Dec-2019 00:07:47 Creating mysql_mysql_1 ... done
12-Dec-2019 00:07:47 mysql running on localhost:3306
12-Dec-2019 00:07:47 Service host is localhost
12-Dec-2019 00:07:47 Creating kafka compose file on /opt/bamboo-home/xml-data/build-dir/SCDT-LOCAL20XSKIPPER20X-KAFKA/local/binder/kafka/docker-compose.yml
12-Dec-2019 00:07:47 cleaning up any previous kafka docker containers...
12-Dec-2019 00:07:47 done cleaning up
12-Dec-2019 00:07:47 Could not find a local kafka server, trying docker.
12-Dec-2019 00:07:48 Pulling zookeeper (wurstmeister/zookeeper:)...
12-Dec-2019 00:07:49 latest: Pulling from wurstmeister/zookeeper
12-Dec-2019 00:08:00 Digest: sha256:7a7fd44a72104bfbd24a77844bad5fabc86485b036f988ea927d1780782a6680
12-Dec-2019 00:08:00 Status: Downloaded newer image for wurstmeister/zookeeper:latest
12-Dec-2019 00:08:00 Pulling kafka (wurstmeister/kafka:2.11-0.11.0.3)...
12-Dec-2019 00:08:01 2.11-0.11.0.3: Pulling from wurstmeister/kafka
12-Dec-2019 00:08:10 Digest: sha256:04df57268bb64654df6487b3f345748fd8412a9c01953a4c1d15c2e41d413113
12-Dec-2019 00:08:10 Status: Downloaded newer image for wurstmeister/kafka:2.11-0.11.0.3
12-Dec-2019 00:08:10 Creating kafka_kafka_1 ...
12-Dec-2019 00:08:10 Creating kafka_zookeeper_1 ...
12-Dec-2019 00:08:12
12-Dec-2019 00:08:12 Creating kafka_kafka_1     ... done
12-Dec-2019 00:08:13
12-Dec-2019 00:08:13 Creating kafka_zookeeper_1 ... done
12-Dec-2019 00:08:13 kafka running on localhost:9092
12-Dec-2019 00:08:13 Export the unset env. variables from /opt/bamboo-home/xml-data/build-dir/SCDT-LOCAL20XSKIPPER20X-KAFKA/local/binder/kafka/env.properties :
12-Dec-2019 00:08:13    STREAM_REGISTRATION_RESOURCE = https://dataflow.spring.io/latest-stream-applications-kafka-maven
12-Dec-2019 00:08:13    TASK_REGISTRATION_RESOURCE = https://dataflow.spring.io/latest-task-applications-maven
12-Dec-2019 00:08:13 cleaning up any previous redis docker containers...
12-Dec-2019 00:08:13 done cleaning up.
12-Dec-2019 00:08:14 redis found on localhost
12-Dec-2019 00:08:14 SKIPPER SERVER URI: http://localhost:7577
12-Dec-2019 00:08:14 Downloading server from https://repo.spring.io/libs-snapshot/org/springframework/cloud/spring-cloud-skipper-server/2.0.4.BUILD-SNAPSHOT/spring-cloud-skipper-server-2.0.4.BUILD-SNAPSHOT.jar
12-Dec-2019 00:08:24 2019-12-12 00:08:24 URL:https://repo.spring.io/libs-snapshot/org/springframework/cloud/spring-cloud-skipper-server/2.0.4.BUILD-SNAPSHOT/spring-cloud-skipper-server-2.0.4.BUILD-SNAPSHOT.jar [84387317/84387317] -> "/opt/bamboo-home/xml-data/build-dir/SCDT-LOCAL20XSKIPPER20X-KAFKA/local/skipper-server/skipper-server.jar" [1]
12-Dec-2019 00:08:24 executing [nohup /opt/jdk-8/bin/java  -Dlogging.level.org.springframework.cloud.deployer.spi.local.LocalAppDeployer=DEBUG -Xmx1024m -Xss1024k -jar /opt/bamboo-home/xml-data/build-dir/SCDT-LOCAL20XSKIPPER20X-KAFKA/local/skipper-server/skipper-server.jar  --spring.datasource.driver-class-name=org.mariadb.jdbc.Driver --spring.datasource.url=jdbc:mysql://localhost/dataflow --spring.datasource.username=spring --spring.datasource.password=cloud  --spring.cloud.dataflow.applicationProperties.stream.spring.cloud.stream.kafka.binder.brokers=localhost --spring.cloud.dataflow.applicationProperties.stream.spring.cloud.stream.kafka.binder.zkNodes=localhost  --spring.redis.host=127.0.0.1 --spring.cloud.skipper.server.platform.local.accounts.default.workingDirectoriesRoot=/opt/bamboo-home/xml-data/build-dir/SCDT-LOCAL20XSKIPPER20X-KAFKA/local/skipper-server/app-logs > /opt/bamboo-home/xml-data/build-dir/SCDT-LOCAL20XSKIPPER20X-KAFKA/local/skipper-server/skipper-server.log &]
12-Dec-2019 00:08:24 [/opt/bamboo-home/xml-data/build-dir/SCDT-LOCAL20XSKIPPER20X-KAFKA/local/skipper-server] process pid is [5196]
12-Dec-2019 00:08:24 System props are []
12-Dec-2019 00:08:24 Logs are under [/opt/bamboo-home/xml-data/build-dir/SCDT-LOCAL20XSKIPPER20X-KAFKA/local/skipper-server/skipper-server.log] or from nohup [/opt/bamboo-home/xml-data/build-dir/SCDT-LOCAL20XSKIPPER20X-KAFKA/local/skipper-server/nohup.log]
12-Dec-2019 00:08:24 Failed to connect to localhost:7577. Attempt  #1/60... will try again in [5] seconds
12-Dec-2019 00:08:29 Failed to connect to localhost:7577. Attempt  #2/60... will try again in [5] seconds
12-Dec-2019 00:08:34 Failed to connect to localhost:7577. Attempt  #3/60... will try again in [5] seconds
12-Dec-2019 00:08:39 Failed to connect to localhost:7577. Attempt  #4/60... will try again in [5] seconds
12-Dec-2019 00:08:45 SCDF SERVER URI: http://localhost:9393
12-Dec-2019 00:08:45 Downloading server from https://repo.spring.io/libs-snapshot/org/springframework/cloud/spring-cloud-dataflow-server/2.0.4.BUILD-SNAPSHOT/spring-cloud-dataflow-server-2.0.4.BUILD-SNAPSHOT.jar
12-Dec-2019 00:08:48 2019-12-12 00:08:48 URL:https://repo.spring.io/libs-snapshot/org/springframework/cloud/spring-cloud-dataflow-server/2.0.4.BUILD-SNAPSHOT/spring-cloud-dataflow-server-2.0.4.BUILD-SNAPSHOT.jar [87897631/87897631] -> "/opt/bamboo-home/xml-data/build-dir/SCDT-LOCAL20XSKIPPER20X-KAFKA/local/server/scdf-server.jar" [1]
12-Dec-2019 00:08:48 SPRING_PROFILES_ACTIVE []
12-Dec-2019 00:08:48 executing [nohup /opt/jdk-8/bin/java  -Xmx1024m -Xss1024k -jar /opt/bamboo-home/xml-data/build-dir/SCDT-LOCAL20XSKIPPER20X-KAFKA/local/server/scdf-server.jar  --spring.datasource.driver-class-name=org.mariadb.jdbc.Driver --spring.datasource.url=jdbc:mysql://localhost/dataflow --spring.datasource.username=spring --spring.datasource.password=cloud  --spring.cloud.dataflow.applicationProperties.stream.spring.cloud.stream.kafka.binder.brokers=localhost --spring.cloud.dataflow.applicationProperties.stream.spring.cloud.stream.kafka.binder.zkNodes=localhost  --spring.redis.host=127.0.0.1 --spring.cloud.skipper.server.platform.local.accounts.default.workingDirectoriesRoot=/opt/bamboo-home/xml-data/build-dir/SCDT-LOCAL20XSKIPPER20X-KAFKA/local/skipper-server/app-logs --spring.cloud.dataflow.features.skipper-enabled=true > /opt/bamboo-home/xml-data/build-dir/SCDT-LOCAL20XSKIPPER20X-KAFKA/local/server/scdf-server.log &]
12-Dec-2019 00:08:48 [/opt/bamboo-home/xml-data/build-dir/SCDT-LOCAL20XSKIPPER20X-KAFKA/local/server] process pid is [5307]
12-Dec-2019 00:08:48 System props are []
12-Dec-2019 00:08:48 Logs are under [/opt/bamboo-home/xml-data/build-dir/SCDT-LOCAL20XSKIPPER20X-KAFKA/local/server/scdf-server.log] or from nohup [/opt/bamboo-home/xml-data/build-dir/SCDT-LOCAL20XSKIPPER20X-KAFKA/local/server/nohup.log]
12-Dec-2019 00:08:48 Failed to connect to localhost:9393. Attempt  #1/60... will try again in [5] seconds
12-Dec-2019 00:08:53 Failed to connect to localhost:9393. Attempt  #2/60... will try again in [5] seconds
12-Dec-2019 00:08:58 Failed to connect to localhost:9393. Attempt  #3/60... will try again in [5] seconds
12-Dec-2019 00:09:04 SCDF SERVER ABOUT:
12-Dec-2019 00:09:04 --2019-12-12 00:09:04--  http://localhost:9393/about
12-Dec-2019 00:09:04 Resolving localhost (localhost)... ::1, 127.0.0.1
12-Dec-2019 00:09:04 Connecting to localhost (localhost)|::1|:9393... connected.
12-Dec-2019 00:09:05 HTTP request sent, awaiting response... 200
12-Dec-2019 00:09:05 Length: unspecified [application/hal+json]
12-Dec-2019 00:09:05 Saving to: ‘STDOUT’
12-Dec-2019 00:09:05
12-Dec-2019 00:09:05      0K .                                                       200M=0s
12-Dec-2019 00:09:05
12-Dec-2019 00:09:05 2019-12-12 00:09:05 (200 MB/s) - written to stdout [1681]
12-Dec-2019 00:09:05
12-Dec-2019 00:09:05 {
12-Dec-2019 00:09:05     "_links": {
12-Dec-2019 00:09:05         "self": {
12-Dec-2019 00:09:05             "href": "http://localhost:9393/about"
12-Dec-2019 00:09:05         }
12-Dec-2019 00:09:05     },
12-Dec-2019 00:09:05     "featureInfo": {
12-Dec-2019 00:09:05         "analyticsEnabled": true,
12-Dec-2019 00:09:05         "grafanaEnabled": false,
12-Dec-2019 00:09:05         "schedulesEnabled": false,
12-Dec-2019 00:09:05         "streamsEnabled": true,
12-Dec-2019 00:09:05         "tasksEnabled": true
12-Dec-2019 00:09:05     },
12-Dec-2019 00:09:05     "grafanaInfo": {
12-Dec-2019 00:09:05         "refreshInterval": 15,
12-Dec-2019 00:09:05         "url": ""
12-Dec-2019 00:09:05     },
12-Dec-2019 00:09:05     "runtimeEnvironment": {
12-Dec-2019 00:09:05         "appDeployer": {
12-Dec-2019 00:09:05             "deployerImplementationVersion": "2.0.4.BUILD-SNAPSHOT",
12-Dec-2019 00:09:05             "deployerName": "Spring Cloud Skipper Server",
12-Dec-2019 00:09:05             "deployerSpiVersion": "2.0.3.RELEASE",
12-Dec-2019 00:09:05             "javaVersion": "1.8.0_232",
12-Dec-2019 00:09:05             "platformApiVersion": "",
12-Dec-2019 00:09:05             "platformClientVersion": "",
12-Dec-2019 00:09:05             "platformHostVersion": "",
12-Dec-2019 00:09:05             "platformSpecificInfo": {
12-Dec-2019 00:09:05                 "default": "local"
12-Dec-2019 00:09:05             },
12-Dec-2019 00:09:05             "platformType": "Skipper Managed",
12-Dec-2019 00:09:05             "springBootVersion": "2.1.3.RELEASE",
12-Dec-2019 00:09:05             "springVersion": "5.1.5.RELEASE"
12-Dec-2019 00:09:05         },
12-Dec-2019 00:09:05         "taskLaunchers": [
12-Dec-2019 00:09:05             {
12-Dec-2019 00:09:05                 "deployerImplementationVersion": "2.0.3.RELEASE",
12-Dec-2019 00:09:05                 "deployerName": "LocalTaskLauncher",
12-Dec-2019 00:09:05                 "deployerSpiVersion": "2.0.2.RELEASE",
12-Dec-2019 00:09:05                 "javaVersion": "1.8.0_232",
12-Dec-2019 00:09:05                 "platformApiVersion": "Linux 4.15.0-66-generic",
12-Dec-2019 00:09:05                 "platformClientVersion": "4.15.0-66-generic",
12-Dec-2019 00:09:05                 "platformHostVersion": "4.15.0-66-generic",
12-Dec-2019 00:09:05                 "platformSpecificInfo": {},
12-Dec-2019 00:09:05                 "platformType": "Local",
12-Dec-2019 00:09:05                 "springBootVersion": "2.1.3.RELEASE",
12-Dec-2019 00:09:05                 "springVersion": "5.1.5.RELEASE"
12-Dec-2019 00:09:05             }
12-Dec-2019 00:09:05         ]
12-Dec-2019 00:09:05     },
12-Dec-2019 00:09:05     "securityInfo": {
12-Dec-2019 00:09:05         "authenticated": false,
12-Dec-2019 00:09:05         "authenticationEnabled": false,
12-Dec-2019 00:09:05         "roles": [],
12-Dec-2019 00:09:05         "username": null
12-Dec-2019 00:09:05     },
12-Dec-2019 00:09:05     "versionInfo": {
12-Dec-2019 00:09:05         "core": {
12-Dec-2019 00:09:05             "name": "Spring Cloud Data Flow Core",
12-Dec-2019 00:09:05             "version": "2.0.4.BUILD-SNAPSHOT"
12-Dec-2019 00:09:05         },
12-Dec-2019 00:09:05         "dashboard": {
12-Dec-2019 00:09:05             "name": "Spring Cloud Dataflow UI",
12-Dec-2019 00:09:05             "version": "2.0.3.RELEASE"
12-Dec-2019 00:09:05         },
12-Dec-2019 00:09:05         "implementation": {
12-Dec-2019 00:09:05             "name": "spring-cloud-dataflow-server",
12-Dec-2019 00:09:05             "version": "2.0.4.BUILD-SNAPSHOT"
12-Dec-2019 00:09:05         },
12-Dec-2019 00:09:05         "shell": {
12-Dec-2019 00:09:05             "name": "Spring Cloud Data Flow Shell",
12-Dec-2019 00:09:05             "url": "https://repo.spring.io/libs-snapshot/org/springframework/cloud/spring-cloud-dataflow-shell/2.0.4.BUILD-SNAPSHOT/spring-cloud-dataflow-shell-2.0.4.BUILD-SNAPSHOT.jar",
12-Dec-2019 00:09:05             "version": "2.0.4.BUILD-SNAPSHOT"
12-Dec-2019 00:09:05         }
12-Dec-2019 00:09:05     }
12-Dec-2019 00:09:05 }
12-Dec-2019 00:09:05 SKIPPER SERVER ABOUT:
12-Dec-2019 00:09:05 --2019-12-12 00:09:05--  http://localhost:7577/api/about
12-Dec-2019 00:09:05 Resolving localhost (localhost)... ::1, 127.0.0.1
12-Dec-2019 00:09:05 Connecting to localhost (localhost)|::1|:7577... connected.
12-Dec-2019 00:09:05 HTTP request sent, awaiting response... 200
12-Dec-2019 00:09:05 Length: unspecified [application/hal+json]
12-Dec-2019 00:09:05 Saving to: ‘STDOUT’
12-Dec-2019 00:09:05
12-Dec-2019 00:09:05      0K                                                        60.3M=0s
12-Dec-2019 00:09:05
12-Dec-2019 00:09:05 2019-12-12 00:09:05 (60.3 MB/s) - written to stdout [426]
12-Dec-2019 00:09:05
12-Dec-2019 00:09:05 {
12-Dec-2019 00:09:05     "versionInfo": {
12-Dec-2019 00:09:05         "server": {
12-Dec-2019 00:09:05             "name": "Spring Cloud Skipper Server",
12-Dec-2019 00:09:05             "version": "2.0.4.BUILD-SNAPSHOT"
12-Dec-2019 00:09:05         },
12-Dec-2019 00:09:05         "shell": {
12-Dec-2019 00:09:05             "name": "Spring Cloud Skipper Shell",
12-Dec-2019 00:09:05             "url": "https://repo.spring.io/libs-snapshot/org/springframework/cloud/spring-cloud-skipper-shell/2.0.4.BUILD-SNAPSHOT/spring-cloud-skipper-shell-2.0.4.BUILD-SNAPSHOT.jar",
12-Dec-2019 00:09:05             "version": "2.0.4.BUILD-SNAPSHOT"
12-Dec-2019 00:09:05         }
12-Dec-2019 00:09:05     }
12-Dec-2019 00:09:05 }
12-Dec-2019 00:09:06 [INFO] Scanning for projects...
12-Dec-2019 00:09:06 [INFO] Downloading: https://repo.spring.io/libs-milestone-local/org/codehaus/mojo/maven-metadata.xml
12-Dec-2019 00:09:06 [INFO] Downloading: https://repo.spring.io/libs-milestone-local/org/apache/maven/plugins/maven-metadata.xml
12-Dec-2019 00:09:06 [INFO] Downloading: https://repo.spring.io/libs-snapshot-local/org/codehaus/mojo/maven-metadata.xml
12-Dec-2019 00:09:06 [INFO] Downloading: https://repo.spring.io/libs-snapshot-local/org/apache/maven/plugins/maven-metadata.xml
12-Dec-2019 00:09:06 [INFO] Downloading: https://repo.spring.io/libs-snapshot-local/org/apache/maven/plugins/maven-surefire-report-plugin/maven-metadata.xml
12-Dec-2019 00:09:06 [INFO] Downloading: https://repo.spring.io/libs-milestone-local/org/apache/maven/plugins/maven-surefire-report-plugin/maven-metadata.xml
12-Dec-2019 00:09:07 [INFO]                                                                         
12-Dec-2019 00:09:07 [INFO] ------------------------------------------------------------------------
12-Dec-2019 00:09:07 [INFO] Building Data Flow Acceptance Tests 1.1.0.BUILD-SNAPSHOT
12-Dec-2019 00:09:07 [INFO] ------------------------------------------------------------------------
12-Dec-2019 00:09:07 [INFO] Downloading: https://repo.spring.io/libs-snapshot-local/org/springframework/cloud/spring-cloud-dataflow-rest-client/1.7.0.BUILD-SNAPSHOT/maven-metadata.xml
12-Dec-2019 00:09:07 [INFO] Downloaded: https://repo.spring.io/libs-snapshot-local/org/springframework/cloud/spring-cloud-dataflow-rest-client/1.7.0.BUILD-SNAPSHOT/maven-metadata.xml (2 KB at 3.9 KB/sec)
12-Dec-2019 00:09:07 [INFO] Downloading: https://repo.spring.io/libs-snapshot-local/org/springframework/cloud/spring-cloud-dataflow-parent/1.7.0.BUILD-SNAPSHOT/maven-metadata.xml
12-Dec-2019 00:09:08 [INFO] Downloaded: https://repo.spring.io/libs-snapshot-local/org/springframework/cloud/spring-cloud-dataflow-parent/1.7.0.BUILD-SNAPSHOT/maven-metadata.xml (646 B at 2.7 KB/sec)
12-Dec-2019 00:09:08 [INFO] Downloading: https://repo.spring.io/libs-snapshot-local/org/springframework/cloud/spring-cloud-dataflow-dependencies/1.7.0.BUILD-SNAPSHOT/maven-metadata.xml
12-Dec-2019 00:09:08 [INFO] Downloaded: https://repo.spring.io/libs-snapshot-local/org/springframework/cloud/spring-cloud-dataflow-dependencies/1.7.0.BUILD-SNAPSHOT/maven-metadata.xml (652 B at 2.5 KB/sec)
12-Dec-2019 00:09:08 [INFO] Downloading: https://repo.spring.io/libs-snapshot-local/org/springframework/cloud/spring-cloud-dataflow-rest-resource/1.7.0.BUILD-SNAPSHOT/maven-metadata.xml
12-Dec-2019 00:09:08 [INFO] Downloaded: https://repo.spring.io/libs-snapshot-local/org/springframework/cloud/spring-cloud-dataflow-rest-resource/1.7.0.BUILD-SNAPSHOT/maven-metadata.xml (2 KB at 4.7 KB/sec)
12-Dec-2019 00:09:08 [INFO] Downloading: https://repo.spring.io/libs-snapshot-local/org/springframework/cloud/spring-cloud-dataflow-core/1.7.0.BUILD-SNAPSHOT/maven-metadata.xml
12-Dec-2019 00:09:08 [INFO] Downloaded: https://repo.spring.io/libs-snapshot-local/org/springframework/cloud/spring-cloud-dataflow-core/1.7.0.BUILD-SNAPSHOT/maven-metadata.xml (2 KB at 3.5 KB/sec)
12-Dec-2019 00:09:09 [INFO]
12-Dec-2019 00:09:09 [INFO] --- maven-checkstyle-plugin:2.17:check (checkstyle-validation) @ spring-cloud-dataflow-acceptance-tests ---
12-Dec-2019 00:09:09 [INFO]
12-Dec-2019 00:09:09 [INFO] --- maven-resources-plugin:2.6:resources (default-resources) @ spring-cloud-dataflow-acceptance-tests ---
12-Dec-2019 00:09:09 [INFO] Using 'UTF-8' encoding to copy filtered resources.
12-Dec-2019 00:09:09 [INFO] skip non existing resourceDirectory /opt/bamboo-home/xml-data/build-dir/SCDT-LOCAL20XSKIPPER20X-KAFKA/src/main/resources
12-Dec-2019 00:09:09 [INFO] skip non existing resourceDirectory /opt/bamboo-home/xml-data/build-dir/SCDT-LOCAL20XSKIPPER20X-KAFKA/src/main/resources
12-Dec-2019 00:09:09 [INFO]
12-Dec-2019 00:09:09 [INFO] --- maven-compiler-plugin:3.1:compile (default-compile) @ spring-cloud-dataflow-acceptance-tests ---
12-Dec-2019 00:09:09 [INFO] Changes detected - recompiling the module!
12-Dec-2019 00:09:09 [INFO] Compiling 8 source files to /opt/bamboo-home/xml-data/build-dir/SCDT-LOCAL20XSKIPPER20X-KAFKA/target/classes
12-Dec-2019 00:09:10 [INFO]
12-Dec-2019 00:09:10 [INFO] --- maven-resources-plugin:2.6:testResources (default-testResources) @ spring-cloud-dataflow-acceptance-tests ---
12-Dec-2019 00:09:10 [INFO] Using 'UTF-8' encoding to copy filtered resources.
12-Dec-2019 00:09:10 [INFO] Copying 1 resource
12-Dec-2019 00:09:10 [INFO]
12-Dec-2019 00:09:10 [INFO] --- maven-compiler-plugin:3.1:testCompile (default-testCompile) @ spring-cloud-dataflow-acceptance-tests ---
12-Dec-2019 00:09:10 [INFO] Changes detected - recompiling the module!
12-Dec-2019 00:09:10 [INFO] Compiling 16 source files to /opt/bamboo-home/xml-data/build-dir/SCDT-LOCAL20XSKIPPER20X-KAFKA/target/test-classes
12-Dec-2019 00:09:11 [WARNING] /opt/bamboo-home/xml-data/build-dir/SCDT-LOCAL20XSKIPPER20X-KAFKA/src/test/java/org/springframework/cloud/dataflow/acceptance/test/AbstractTaskTests.java: Some input files use unchecked or unsafe operations.
12-Dec-2019 00:09:11 [WARNING] /opt/bamboo-home/xml-data/build-dir/SCDT-LOCAL20XSKIPPER20X-KAFKA/src/test/java/org/springframework/cloud/dataflow/acceptance/test/AbstractTaskTests.java: Recompile with -Xlint:unchecked for details.
12-Dec-2019 00:09:11 [INFO]
12-Dec-2019 00:09:11 [INFO] --- maven-surefire-plugin:2.18.1:test (default-test) @ spring-cloud-dataflow-acceptance-tests ---
12-Dec-2019 00:09:11 [INFO] Surefire report directory: /opt/bamboo-home/xml-data/build-dir/SCDT-LOCAL20XSKIPPER20X-KAFKA/target/surefire-reports
12-Dec-2019 00:09:11
12-Dec-2019 00:09:11 -------------------------------------------------------
12-Dec-2019 00:09:11 T E S T S
12-Dec-2019 00:09:11 -------------------------------------------------------
12-Dec-2019 00:09:11 2019-12-12 00:09:11.597  INFO   --- [           main] .b.t.c.SpringBootTestContextBootstrapper : Neither @ContextConfiguration nor @ContextHierarchy found for test class [org.springframework.cloud.dataflow.acceptance.test.AnalyticsTests], using SpringBootContextLoader
12-Dec-2019 00:09:11 2019-12-12 00:09:11.647  INFO   --- [           main] .b.t.c.SpringBootTestContextBootstrapper : Loaded default TestExecutionListener class names from location [META-INF/spring.factories]: [org.springframework.boot.test.mock.mockito.MockitoTestExecutionListener, org.springframework.boot.test.mock.mockito.ResetMocksTestExecutionListener, org.springframework.boot.test.autoconfigure.restdocs.RestDocsTestExecutionListener, org.springframework.boot.test.autoconfigure.web.client.MockRestServiceServerResetTestExecutionListener, org.springframework.boot.test.autoconfigure.web.servlet.MockMvcPrintOnlyOnFailureTestExecutionListener, org.springframework.boot.test.autoconfigure.web.servlet.WebDriverTestExecutionListener, org.springframework.test.context.web.ServletTestExecutionListener, org.springframework.test.context.support.DirtiesContextBeforeModesTestExecutionListener, org.springframework.test.context.support.DependencyInjectionTestExecutionListener, org.springframework.test.context.support.DirtiesContextTestExecutionListener, org.springframework.test.context.transaction.TransactionalTestExecutionListener, org.springframework.test.context.jdbc.SqlScriptsTestExecutionListener]
12-Dec-2019 00:09:11 2019-12-12 00:09:11.663  INFO   --- [           main] .b.t.c.SpringBootTestContextBootstrapper : Using TestExecutionListeners: [org.springframework.test.context.web.ServletTestExecutionListener@4b5d6a01, org.springframework.test.context.support.DirtiesContextBeforeModesTestExecutionListener@4a22f9e2, org.springframework.boot.test.autoconfigure.SpringBootDependencyInjectionTestExecutionListener@3c419631, org.springframework.test.context.support.DirtiesContextTestExecutionListener@418e7838, org.springframework.test.context.transaction.TransactionalTestExecutionListener@61230f6a, org.springframework.test.context.jdbc.SqlScriptsTestExecutionListener@3c130745, org.springframework.boot.test.mock.mockito.MockitoTestExecutionListener@cd3fee8, org.springframework.boot.test.autoconfigure.web.servlet.MockMvcPrintOnlyOnFailureTestExecutionListener@3e2e18f2, org.springframework.boot.test.autoconfigure.web.client.MockRestServiceServerResetTestExecutionListener@470f1802, org.springframework.boot.test.mock.mockito.ResetMocksTestExecutionListener@63021689, org.springframework.boot.test.autoconfigure.web.servlet.WebDriverTestExecutionListener@703580bf, org.springframework.boot.test.autoconfigure.restdocs.RestDocsTestExecutionListener@3e92efc3]
12-Dec-2019 00:09:11 2019-12-12 00:09:11.664  INFO   --- [           main] .b.t.c.SpringBootTestContextBootstrapper : Neither @ContextConfiguration nor @ContextHierarchy found for test class [org.springframework.cloud.dataflow.acceptance.test.WoodChuckTests], using SpringBootContextLoader
12-Dec-2019 00:09:11 2019-12-12 00:09:11.676  INFO   --- [           main] .b.t.c.SpringBootTestContextBootstrapper : Loaded default TestExecutionListener class names from location [META-INF/spring.factories]: [org.springframework.boot.test.mock.mockito.MockitoTestExecutionListener, org.springframework.boot.test.mock.mockito.ResetMocksTestExecutionListener, org.springframework.boot.test.autoconfigure.restdocs.RestDocsTestExecutionListener, org.springframework.boot.test.autoconfigure.web.client.MockRestServiceServerResetTestExecutionListener, org.springframework.boot.test.autoconfigure.web.servlet.MockMvcPrintOnlyOnFailureTestExecutionListener, org.springframework.boot.test.autoconfigure.web.servlet.WebDriverTestExecutionListener, org.springframework.test.context.web.ServletTestExecutionListener, org.springframework.test.context.support.DirtiesContextBeforeModesTestExecutionListener, org.springframework.test.context.support.DependencyInjectionTestExecutionListener, org.springframework.test.context.support.DirtiesContextTestExecutionListener, org.springframework.test.context.transaction.TransactionalTestExecutionListener, org.springframework.test.context.jdbc.SqlScriptsTestExecutionListener]
12-Dec-2019 00:09:11 2019-12-12 00:09:11.680  INFO   --- [           main] .b.t.c.SpringBootTestContextBootstrapper : Using TestExecutionListeners: [org.springframework.test.context.web.ServletTestExecutionListener@7ec7ffd3, org.springframework.test.context.support.DirtiesContextBeforeModesTestExecutionListener@5b239d7d, org.springframework.boot.test.autoconfigure.SpringBootDependencyInjectionTestExecutionListener@6572421, org.springframework.test.context.support.DirtiesContextTestExecutionListener@6b81ce95, org.springframework.test.context.transaction.TransactionalTestExecutionListener@2a798d51, org.springframework.test.context.jdbc.SqlScriptsTestExecutionListener@6d763516, org.springframework.boot.test.mock.mockito.MockitoTestExecutionListener@52bf72b5, org.springframework.boot.test.autoconfigure.web.servlet.MockMvcPrintOnlyOnFailureTestExecutionListener@37afeb11, org.springframework.boot.test.autoconfigure.web.client.MockRestServiceServerResetTestExecutionListener@515aebb0, org.springframework.boot.test.mock.mockito.ResetMocksTestExecutionListener@dd8ba08, org.springframework.boot.test.autoconfigure.web.servlet.WebDriverTestExecutionListener@245b4bdc, org.springframework.boot.test.autoconfigure.restdocs.RestDocsTestExecutionListener@6c64cb25]
12-Dec-2019 00:09:11 2019-12-12 00:09:11.681  INFO   --- [           main] .b.t.c.SpringBootTestContextBootstrapper : Neither @ContextConfiguration nor @ContextHierarchy found for test class [org.springframework.cloud.dataflow.acceptance.test.HttpSourceTests], using SpringBootContextLoader
12-Dec-2019 00:09:11 2019-12-12 00:09:11.690  INFO   --- [           main] .b.t.c.SpringBootTestContextBootstrapper : Loaded default TestExecutionListener class names from location [META-INF/spring.factories]: [org.springframework.boot.test.mock.mockito.MockitoTestExecutionListener, org.springframework.boot.test.mock.mockito.ResetMocksTestExecutionListener, org.springframework.boot.test.autoconfigure.restdocs.RestDocsTestExecutionListener, org.springframework.boot.test.autoconfigure.web.client.MockRestServiceServerResetTestExecutionListener, org.springframework.boot.test.autoconfigure.web.servlet.MockMvcPrintOnlyOnFailureTestExecutionListener, org.springframework.boot.test.autoconfigure.web.servlet.WebDriverTestExecutionListener, org.springframework.test.context.web.ServletTestExecutionListener, org.springframework.test.context.support.DirtiesContextBeforeModesTestExecutionListener, org.springframework.test.context.support.DependencyInjectionTestExecutionListener, org.springframework.test.context.support.DirtiesContextTestExecutionListener, org.springframework.test.context.transaction.TransactionalTestExecutionListener, org.springframework.test.context.jdbc.SqlScriptsTestExecutionListener]
12-Dec-2019 00:09:11 2019-12-12 00:09:11.693  INFO   --- [           main] .b.t.c.SpringBootTestContextBootstrapper : Using TestExecutionListeners: [org.springframework.test.context.web.ServletTestExecutionListener@40a4337a, org.springframework.test.context.support.DirtiesContextBeforeModesTestExecutionListener@6025e1b6, org.springframework.boot.test.autoconfigure.SpringBootDependencyInjectionTestExecutionListener@22ff4249, org.springframework.test.context.support.DirtiesContextTestExecutionListener@2d1ef81a, org.springframework.test.context.transaction.TransactionalTestExecutionListener@4c402120, org.springframework.test.context.jdbc.SqlScriptsTestExecutionListener@327514f, org.springframework.boot.test.mock.mockito.MockitoTestExecutionListener@5b12b668, org.springframework.boot.test.autoconfigure.web.servlet.MockMvcPrintOnlyOnFailureTestExecutionListener@1165b38, org.springframework.boot.test.autoconfigure.web.client.MockRestServiceServerResetTestExecutionListener@4c12331b, org.springframework.boot.test.mock.mockito.ResetMocksTestExecutionListener@7586beff, org.springframework.boot.test.autoconfigure.web.servlet.WebDriverTestExecutionListener@3b69e7d1, org.springframework.boot.test.autoconfigure.restdocs.RestDocsTestExecutionListener@815b41f]
12-Dec-2019 00:09:11 2019-12-12 00:09:11.709  INFO   --- [           main] .b.t.c.SpringBootTestContextBootstrapper : Neither @ContextConfiguration nor @ContextHierarchy found for test class [org.springframework.cloud.dataflow.acceptance.test.TickTockTests], using SpringBootContextLoader
12-Dec-2019 00:09:11 2019-12-12 00:09:11.717  INFO   --- [           main] .b.t.c.SpringBootTestContextBootstrapper : Loaded default TestExecutionListener class names from location [META-INF/spring.factories]: [org.springframework.boot.test.mock.mockito.MockitoTestExecutionListener, org.springframework.boot.test.mock.mockito.ResetMocksTestExecutionListener, org.springframework.boot.test.autoconfigure.restdocs.RestDocsTestExecutionListener, org.springframework.boot.test.autoconfigure.web.client.MockRestServiceServerResetTestExecutionListener, org.springframework.boot.test.autoconfigure.web.servlet.MockMvcPrintOnlyOnFailureTestExecutionListener, org.springframework.boot.test.autoconfigure.web.servlet.WebDriverTestExecutionListener, org.springframework.test.context.web.ServletTestExecutionListener, org.springframework.test.context.support.DirtiesContextBeforeModesTestExecutionListener, org.springframework.test.context.support.DependencyInjectionTestExecutionListener, org.springframework.test.context.support.DirtiesContextTestExecutionListener, org.springframework.test.context.transaction.TransactionalTestExecutionListener, org.springframework.test.context.jdbc.SqlScriptsTestExecutionListener]
12-Dec-2019 00:09:11 2019-12-12 00:09:11.720  INFO   --- [           main] .b.t.c.SpringBootTestContextBootstrapper : Using TestExecutionListeners: [org.springframework.test.context.web.ServletTestExecutionListener@55b53d44, org.springframework.test.context.support.DirtiesContextBeforeModesTestExecutionListener@482bce4f, org.springframework.boot.test.autoconfigure.SpringBootDependencyInjectionTestExecutionListener@366647c2, org.springframework.test.context.support.DirtiesContextTestExecutionListener@6a6afff2, org.springframework.test.context.transaction.TransactionalTestExecutionListener@1649b0e6, org.springframework.test.context.jdbc.SqlScriptsTestExecutionListener@865dd6, org.springframework.boot.test.mock.mockito.MockitoTestExecutionListener@4da4253, org.springframework.boot.test.autoconfigure.web.servlet.MockMvcPrintOnlyOnFailureTestExecutionListener@3972a855, org.springframework.boot.test.autoconfigure.web.client.MockRestServiceServerResetTestExecutionListener@62e7f11d, org.springframework.boot.test.mock.mockito.ResetMocksTestExecutionListener@503d687a, org.springframework.boot.test.autoconfigure.web.servlet.WebDriverTestExecutionListener@6a370f4, org.springframework.boot.test.autoconfigure.restdocs.RestDocsTestExecutionListener@2abf4075]
12-Dec-2019 00:09:11 2019-12-12 00:09:11.728  INFO   --- [           main] .b.t.c.SpringBootTestContextBootstrapper : Neither @ContextConfiguration nor @ContextHierarchy found for test class [org.springframework.cloud.dataflow.acceptance.test.TransformTests], using SpringBootContextLoader
12-Dec-2019 00:09:11 2019-12-12 00:09:11.736  INFO   --- [           main] .b.t.c.SpringBootTestContextBootstrapper : Loaded default TestExecutionListener class names from location [META-INF/spring.factories]: [org.springframework.boot.test.mock.mockito.MockitoTestExecutionListener, org.springframework.boot.test.mock.mockito.ResetMocksTestExecutionListener, org.springframework.boot.test.autoconfigure.restdocs.RestDocsTestExecutionListener, org.springframework.boot.test.autoconfigure.web.client.MockRestServiceServerResetTestExecutionListener, org.springframework.boot.test.autoconfigure.web.servlet.MockMvcPrintOnlyOnFailureTestExecutionListener, org.springframework.boot.test.autoconfigure.web.servlet.WebDriverTestExecutionListener, org.springframework.test.context.web.ServletTestExecutionListener, org.springframework.test.context.support.DirtiesContextBeforeModesTestExecutionListener, org.springframework.test.context.support.DependencyInjectionTestExecutionListener, org.springframework.test.context.support.DirtiesContextTestExecutionListener, org.springframework.test.context.transaction.TransactionalTestExecutionListener, org.springframework.test.context.jdbc.SqlScriptsTestExecutionListener]
12-Dec-2019 00:09:11 2019-12-12 00:09:11.739  INFO   --- [           main] .b.t.c.SpringBootTestContextBootstrapper : Using TestExecutionListeners: [org.springframework.test.context.web.ServletTestExecutionListener@51e69659, org.springframework.test.context.support.DirtiesContextBeforeModesTestExecutionListener@47e2e487, org.springframework.boot.test.autoconfigure.SpringBootDependencyInjectionTestExecutionListener@201a4587, org.springframework.test.context.support.DirtiesContextTestExecutionListener@61001b64, org.springframework.test.context.transaction.TransactionalTestExecutionListener@4310d43, org.springframework.test.context.jdbc.SqlScriptsTestExecutionListener@54a7079e, org.springframework.boot.test.mock.mockito.MockitoTestExecutionListener@26e356f0, org.springframework.boot.test.autoconfigure.web.servlet.MockMvcPrintOnlyOnFailureTestExecutionListener@47d9a273, org.springframework.boot.test.autoconfigure.web.client.MockRestServiceServerResetTestExecutionListener@4b8ee4de, org.springframework.boot.test.mock.mockito.ResetMocksTestExecutionListener@27f981c6, org.springframework.boot.test.autoconfigure.web.servlet.WebDriverTestExecutionListener@1b11171f, org.springframework.boot.test.autoconfigure.restdocs.RestDocsTestExecutionListener@1151e434]
12-Dec-2019 00:09:11 2019-12-12 00:09:11.752  INFO   --- [           main] .b.t.c.SpringBootTestContextBootstrapper : Neither @ContextConfiguration nor @ContextHierarchy found for test class [org.springframework.cloud.dataflow.acceptance.test.NamedChannelTests], using SpringBootContextLoader
12-Dec-2019 00:09:11 2019-12-12 00:09:11.759  INFO   --- [           main] .b.t.c.SpringBootTestContextBootstrapper : Loaded default TestExecutionListener class names from location [META-INF/spring.factories]: [org.springframework.boot.test.mock.mockito.MockitoTestExecutionListener, org.springframework.boot.test.mock.mockito.ResetMocksTestExecutionListener, org.springframework.boot.test.autoconfigure.restdocs.RestDocsTestExecutionListener, org.springframework.boot.test.autoconfigure.web.client.MockRestServiceServerResetTestExecutionListener, org.springframework.boot.test.autoconfigure.web.servlet.MockMvcPrintOnlyOnFailureTestExecutionListener, org.springframework.boot.test.autoconfigure.web.servlet.WebDriverTestExecutionListener, org.springframework.test.context.web.ServletTestExecutionListener, org.springframework.test.context.support.DirtiesContextBeforeModesTestExecutionListener, org.springframework.test.context.support.DependencyInjectionTestExecutionListener, org.springframework.test.context.support.DirtiesContextTestExecutionListener, org.springframework.test.context.transaction.TransactionalTestExecutionListener, org.springframework.test.context.jdbc.SqlScriptsTestExecutionListener]
12-Dec-2019 00:09:11 2019-12-12 00:09:11.762  INFO   --- [           main] .b.t.c.SpringBootTestContextBootstrapper : Using TestExecutionListeners: [org.springframework.test.context.web.ServletTestExecutionListener@70cf32e3, org.springframework.test.context.support.DirtiesContextBeforeModesTestExecutionListener@5a59ca5e, org.springframework.boot.test.autoconfigure.SpringBootDependencyInjectionTestExecutionListener@4bdeaabb, org.springframework.test.context.support.DirtiesContextTestExecutionListener@6c4906d3, org.springframework.test.context.transaction.TransactionalTestExecutionListener@65987993, org.springframework.test.context.jdbc.SqlScriptsTestExecutionListener@71075444, org.springframework.boot.test.mock.mockito.MockitoTestExecutionListener@4f32a3ad, org.springframework.boot.test.autoconfigure.web.servlet.MockMvcPrintOnlyOnFailureTestExecutionListener@6b695b06, org.springframework.boot.test.autoconfigure.web.client.MockRestServiceServerResetTestExecutionListener@4d1bf319, org.springframework.boot.test.mock.mockito.ResetMocksTestExecutionListener@6f53b8a, org.springframework.boot.test.autoconfigure.web.servlet.WebDriverTestExecutionListener@5c80cf32, org.springframework.boot.test.autoconfigure.restdocs.RestDocsTestExecutionListener@7d900ecf]
12-Dec-2019 00:09:11 Running org.springframework.cloud.dataflow.acceptance.test.AnalyticsTests
12-Dec-2019 00:09:11 2019-12-12 00:09:11.784  INFO   --- [           main] .b.t.c.SpringBootTestContextBootstrapper : Neither @ContextConfiguration nor @ContextHierarchy found for test class [org.springframework.cloud.dataflow.acceptance.test.AnalyticsTests], using SpringBootContextLoader
12-Dec-2019 00:09:11 2019-12-12 00:09:11.801  INFO   --- [           main] .b.t.c.SpringBootTestContextBootstrapper : Loaded default TestExecutionListener class names from location [META-INF/spring.factories]: [org.springframework.boot.test.mock.mockito.MockitoTestExecutionListener, org.springframework.boot.test.mock.mockito.ResetMocksTestExecutionListener, org.springframework.boot.test.autoconfigure.restdocs.RestDocsTestExecutionListener, org.springframework.boot.test.autoconfigure.web.client.MockRestServiceServerResetTestExecutionListener, org.springframework.boot.test.autoconfigure.web.servlet.MockMvcPrintOnlyOnFailureTestExecutionListener, org.springframework.boot.test.autoconfigure.web.servlet.WebDriverTestExecutionListener, org.springframework.test.context.web.ServletTestExecutionListener, org.springframework.test.context.support.DirtiesContextBeforeModesTestExecutionListener, org.springframework.test.context.support.DependencyInjectionTestExecutionListener, org.springframework.test.context.support.DirtiesContextTestExecutionListener, org.springframework.test.context.transaction.TransactionalTestExecutionListener, org.springframework.test.context.jdbc.SqlScriptsTestExecutionListener]
12-Dec-2019 00:09:11 2019-12-12 00:09:11.803  INFO   --- [           main] .b.t.c.SpringBootTestContextBootstrapper : Using TestExecutionListeners: [org.springframework.test.context.web.ServletTestExecutionListener@77659b30, org.springframework.test.context.support.DirtiesContextBeforeModesTestExecutionListener@456d6c1e, org.springframework.boot.test.autoconfigure.SpringBootDependencyInjectionTestExecutionListener@1e13529a, org.springframework.test.context.support.DirtiesContextTestExecutionListener@1ec9bd38, org.springframework.test.context.transaction.TransactionalTestExecutionListener@452e19ca, org.springframework.test.context.jdbc.SqlScriptsTestExecutionListener@6b0d80ed, org.springframework.boot.test.mock.mockito.MockitoTestExecutionListener@6f8e8894, org.springframework.boot.test.autoconfigure.web.servlet.MockMvcPrintOnlyOnFailureTestExecutionListener@3cfdd820, org.springframework.boot.test.autoconfigure.web.client.MockRestServiceServerResetTestExecutionListener@928763c, org.springframework.boot.test.mock.mockito.ResetMocksTestExecutionListener@e25951c, org.springframework.boot.test.autoconfigure.web.servlet.WebDriverTestExecutionListener@15f47664, org.springframework.boot.test.autoconfigure.restdocs.RestDocsTestExecutionListener@471a9022]
12-Dec-2019 00:09:12 2019-12-12 00:09:12.378  INFO 5484 --- [           main] s.c.a.AnnotationConfigApplicationContext : Refreshing org.springframework.context.annotation.AnnotationConfigApplicationContext@2fa7ae9: startup date [Thu Dec 12 00:09:12 UTC 2019]; root of context hierarchy
12-Dec-2019 00:09:12 2019-12-12 00:09:12.616  INFO 5484 --- [           main] trationDelegate$BeanPostProcessorChecker : Bean 'configurationPropertiesRebinderAutoConfiguration' of type [class org.springframework.cloud.autoconfigure.ConfigurationPropertiesRebinderAutoConfiguration$$EnhancerBySpringCGLIB$$219d8b3d] is not eligible for getting processed by all BeanPostProcessors (for example: not eligible for auto-proxying)
12-Dec-2019 00:09:12
12-Dec-2019 00:09:12   .   ____          _            __ _ _
12-Dec-2019 00:09:12 /\\ / ___'_ __ _ _(_)_ __  __ _ \ \ \ \
12-Dec-2019 00:09:12 ( ( )\___ | '_ | '_| | '_ \/ _` | \ \ \ \
12-Dec-2019 00:09:12 \\/  ___)| |_)| | | | | || (_| |  ) ) ) )
12-Dec-2019 00:09:12   '  |____| .__|_| |_|_| |_\__, | / / / /
12-Dec-2019 00:09:12 =========|_|==============|___/=/_/_/_/
12-Dec-2019 00:09:12 :: Spring Boot ::        (v1.4.1.RELEASE)
12-Dec-2019 00:09:12
12-Dec-2019 00:09:12 2019-12-12 00:09:12.914  INFO 5484 --- [           main] c.c.c.ConfigServicePropertySourceLocator : Fetching config from server at: http://localhost:8888
12-Dec-2019 00:09:12 2019-12-12 00:09:12.994  WARN 5484 --- [           main] c.c.c.ConfigServicePropertySourceLocator : Could not locate PropertySource: I/O error on GET request for "http://localhost:8888//blah": Connection refused (Connection refused); nested exception is java.net.ConnectException: Connection refused (Connection refused)
12-Dec-2019 00:09:13 2019-12-12 00:09:13.001  INFO 5484 --- [           main] o.s.c.d.acceptance.test.AnalyticsTests   : The following profiles are active: blah
12-Dec-2019 00:09:13 2019-12-12 00:09:13.207  INFO 5484 --- [           main] o.s.c.d.acceptance.test.AnalyticsTests   : Started AnalyticsTests in 1.341 seconds (JVM running for 2.044)
12-Dec-2019 00:09:13 2019-12-12 00:09:13.517  INFO 5484 --- [           main] junit.logTestName                        : Starting Test analyticsTest(org.springframework.cloud.dataflow.acceptance.test.AnalyticsTests)
12-Dec-2019 00:09:13 2019-12-12 00:09:13.531  INFO 5484 --- [           main] o.s.c.d.acceptance.test.AnalyticsTests   : Importing stream apps from uri resource: https://dataflow.spring.io/kafka-maven-latest
12-Dec-2019 00:09:15 2019-12-12 00:09:15.766  INFO 5484 --- [           main] junit.logTestName                        : Finished Test analyticsTest(org.springframework.cloud.dataflow.acceptance.test.AnalyticsTests)
12-Dec-2019 00:09:15 2019-12-12 00:09:15.766  INFO 5484 --- [           main] o.s.c.d.acceptance.test.AnalyticsTests   : Destroy all streams
12-Dec-2019 00:09:15 Tests run: 1, Failures: 0, Errors: 0, Skipped: 1, Time elapsed: 4.006 sec - in org.springframework.cloud.dataflow.acceptance.test.AnalyticsTests
12-Dec-2019 00:09:15 Running org.springframework.cloud.dataflow.acceptance.test.WoodChuckTests
12-Dec-2019 00:09:15 2019-12-12 00:09:15.790  INFO 5484 --- [           main] .b.t.c.SpringBootTestContextBootstrapper : Neither @ContextConfiguration nor @ContextHierarchy found for test class [org.springframework.cloud.dataflow.acceptance.test.WoodChuckTests], using SpringBootContextLoader
12-Dec-2019 00:09:15 2019-12-12 00:09:15.806  INFO 5484 --- [           main] .b.t.c.SpringBootTestContextBootstrapper : Loaded default TestExecutionListener class names from location [META-INF/spring.factories]: [org.springframework.boot.test.mock.mockito.MockitoTestExecutionListener, org.springframework.boot.test.mock.mockito.ResetMocksTestExecutionListener, org.springframework.boot.test.autoconfigure.restdocs.RestDocsTestExecutionListener, org.springframework.boot.test.autoconfigure.web.client.MockRestServiceServerResetTestExecutionListener, org.springframework.boot.test.autoconfigure.web.servlet.MockMvcPrintOnlyOnFailureTestExecutionListener, org.springframework.boot.test.autoconfigure.web.servlet.WebDriverTestExecutionListener, org.springframework.test.context.web.ServletTestExecutionListener, org.springframework.test.context.support.DirtiesContextBeforeModesTestExecutionListener, org.springframework.test.context.support.DependencyInjectionTestExecutionListener, org.springframework.test.context.support.DirtiesContextTestExecutionListener, org.springframework.test.context.transaction.TransactionalTestExecutionListener, org.springframework.test.context.jdbc.SqlScriptsTestExecutionListener]
12-Dec-2019 00:09:15 2019-12-12 00:09:15.812  INFO 5484 --- [           main] .b.t.c.SpringBootTestContextBootstrapper : Using TestExecutionListeners: [org.springframework.test.context.web.ServletTestExecutionListener@54e3658c, org.springframework.test.context.support.DirtiesContextBeforeModesTestExecutionListener@43e9089, org.springframework.boot.test.autoconfigure.SpringBootDependencyInjectionTestExecutionListener@3c5dbdf8, org.springframework.test.context.support.DirtiesContextTestExecutionListener@352c44a8, org.springframework.test.context.transaction.TransactionalTestExecutionListener@7aac8884, org.springframework.test.context.jdbc.SqlScriptsTestExecutionListener@a66e580, org.springframework.boot.test.mock.mockito.MockitoTestExecutionListener@5b852b49, org.springframework.boot.test.autoconfigure.web.servlet.MockMvcPrintOnlyOnFailureTestExecutionListener@cdb2d95, org.springframework.boot.test.autoconfigure.web.client.MockRestServiceServerResetTestExecutionListener@122d6c22, org.springframework.boot.test.mock.mockito.ResetMocksTestExecutionListener@2f5ac102, org.springframework.boot.test.autoconfigure.web.servlet.WebDriverTestExecutionListener@5df778c3, org.springframework.boot.test.autoconfigure.restdocs.RestDocsTestExecutionListener@895416d]
12-Dec-2019 00:09:15 2019-12-12 00:09:15.925  INFO 5484 --- [           main] junit.logTestName                        : Starting Test testPartitioning(org.springframework.cloud.dataflow.acceptance.test.WoodChuckTests)
12-Dec-2019 00:09:15 2019-12-12 00:09:15.945  INFO 5484 --- [           main] o.s.c.d.acceptance.test.WoodChuckTests   : Creating stream 'WOODCHUCK-TEST'
12-Dec-2019 00:09:16 2019-12-12 00:09:16.091  INFO 5484 --- [           main] o.s.c.d.acceptance.test.WoodChuckTests   : Deploying stream 'WOODCHUCK-TEST' with properties: {app.*.spring.cloud.streamapp.security.enabled=false, app.log.logging.pattern.level=WOODCHUCK-${INSTANCE_INDEX:${CF_INSTANCE_INDEX:${spring.cloud.stream.instanceIndex:0}}} %5p, app.*.logging.file=${PID}-test.log, app.splitter.producer.partitionKeyExpression=payload, app.*.endpoints.logfile.sensitive=false, app.log.spring.cloud.stream.kafka.bindings.input.consumer.autoRebalanceEnabled=false, app.*.management.endpoints.web.exposure.include=*, deployer.log.count=2}
12-Dec-2019 00:09:23 2019-12-12 00:09:23.120  INFO 5484 --- [           main] o.s.c.d.acceptance.test.WoodChuckTests   : Checking: Stream=WOODCHUCK-TEST, status = deploying, status description = The stream is being deployed.
12-Dec-2019 00:09:23 2019-12-12 00:09:23.120  INFO 5484 --- [           main] o.s.c.d.acceptance.test.WoodChuckTests   : Sleeping to check status of Stream=WOODCHUCK-TEST
12-Dec-2019 00:09:33 2019-12-12 00:09:33.264  INFO 5484 --- [           main] o.s.c.d.acceptance.test.WoodChuckTests   : Checking: Stream=WOODCHUCK-TEST, status = deploying, status description = The stream is being deployed.
12-Dec-2019 00:09:33 2019-12-12 00:09:33.265  INFO 5484 --- [           main] o.s.c.d.acceptance.test.WoodChuckTests   : Sleeping to check status of Stream=WOODCHUCK-TEST
12-Dec-2019 00:09:43 2019-12-12 00:09:43.375  INFO 5484 --- [           main] o.s.c.d.acceptance.test.WoodChuckTests   : Checking: Stream=WOODCHUCK-TEST, status = deploying, status description = The stream is being deployed.
12-Dec-2019 00:09:43 2019-12-12 00:09:43.375  INFO 5484 --- [           main] o.s.c.d.acceptance.test.WoodChuckTests   : Sleeping to check status of Stream=WOODCHUCK-TEST
12-Dec-2019 00:09:53 2019-12-12 00:09:53.414  INFO 5484 --- [           main] o.s.c.d.acceptance.test.WoodChuckTests   : Checking: Stream=WOODCHUCK-TEST, status = deployed, status description = The stream has been successfully deployed
12-Dec-2019 00:09:53 2019-12-12 00:09:53.481  INFO 5484 --- [           main] o.s.c.d.acceptance.test.WoodChuckTests   : Sleeping to check status of Stream=WOODCHUCK-TEST
12-Dec-2019 00:10:03 2019-12-12 00:10:03.481  INFO 5484 --- [           main] o.s.c.d.acceptance.test.WoodChuckTests   : Stream 'WOODCHUCK-TEST' started with status: deployed
12-Dec-2019 00:10:03 2019-12-12 00:10:03.481  INFO 5484 --- [           main] o.s.c.d.acceptance.test.WoodChuckTests   : App 'log' has instances: {WOODCHUCK-TEST.log-v1-0=http://10.194.6.131:56046, WOODCHUCK-TEST.log-v1-1=http://10.194.6.131:56568}
12-Dec-2019 00:10:03 2019-12-12 00:10:03.482  INFO 5484 --- [           main] o.s.c.d.acceptance.test.WoodChuckTests   : App 'http' has instances: {WOODCHUCK-TEST.http-v1-0=http://10.194.6.131:54186}
12-Dec-2019 00:10:03 2019-12-12 00:10:03.482  INFO 5484 --- [           main] o.s.c.d.acceptance.test.WoodChuckTests   : App 'splitter' has instances: {WOODCHUCK-TEST.splitter-v1-0=http://10.194.6.131:56044}
12-Dec-2019 00:10:03 2019-12-12 00:10:03.482  INFO 5484 --- [           main] o.s.c.d.acceptance.test.WoodChuckTests   : Looking for 'Started HttpSource' in logfile for http
12-Dec-2019 00:10:13 2019-12-12 00:10:13.482  INFO 5484 --- [           main] o.s.c.d.acceptance.test.WoodChuckTests   : Requesting log for app WOODCHUCK-TEST.http-v1-0
12-Dec-2019 00:10:13 2019-12-12 00:10:13.802  INFO 5484 --- [           main] o.s.c.d.acceptance.test.WoodChuckTests   : Retrieved logfile from 'http://10.194.6.131:54186/actuator/logfile
12-Dec-2019 00:10:13 2019-12-12 00:10:13.809  INFO 5484 --- [           main] o.s.c.d.acceptance.test.WoodChuckTests   : Matched all 'Started HttpSource' in logfile for app http (source WOODCHUCK-TEST.http-v1-0)
12-Dec-2019 00:10:13 2019-12-12 00:10:13.810  INFO 5484 --- [           main] o.s.c.d.acceptance.test.WoodChuckTests   : Looking for 'Started SplitterProcessor' in logfile for splitter
12-Dec-2019 00:10:23 2019-12-12 00:10:23.810  INFO 5484 --- [           main] o.s.c.d.acceptance.test.WoodChuckTests   : Requesting log for app WOODCHUCK-TEST.splitter-v1-0
12-Dec-2019 00:10:23 2019-12-12 00:10:23.934  INFO 5484 --- [           main] o.s.c.d.acceptance.test.WoodChuckTests   : Retrieved logfile from 'http://10.194.6.131:56044/actuator/logfile
12-Dec-2019 00:10:23 2019-12-12 00:10:23.934  INFO 5484 --- [           main] o.s.c.d.acceptance.test.WoodChuckTests   : Matched all 'Started SplitterProcessor' in logfile for app splitter (source WOODCHUCK-TEST.splitter-v1-0)
12-Dec-2019 00:10:23 2019-12-12 00:10:23.934  INFO 5484 --- [           main] o.s.c.d.acceptance.test.WoodChuckTests   : Looking for 'Started LogSink' in logfile for log
12-Dec-2019 00:10:33 2019-12-12 00:10:33.934  INFO 5484 --- [           main] o.s.c.d.acceptance.test.WoodChuckTests   : Requesting log for app WOODCHUCK-TEST.log-v1-0
12-Dec-2019 00:10:34 2019-12-12 00:10:34.228  INFO 5484 --- [           main] o.s.c.d.acceptance.test.WoodChuckTests   : Retrieved logfile from 'http://10.194.6.131:56046/actuator/logfile
12-Dec-2019 00:10:34 2019-12-12 00:10:34.228  INFO 5484 --- [           main] o.s.c.d.acceptance.test.WoodChuckTests   : Requesting log for app WOODCHUCK-TEST.log-v1-1
12-Dec-2019 00:10:34 2019-12-12 00:10:34.548  INFO 5484 --- [           main] o.s.c.d.acceptance.test.WoodChuckTests   : Retrieved logfile from 'http://10.194.6.131:56568/actuator/logfile
12-Dec-2019 00:10:34 2019-12-12 00:10:34.549  INFO 5484 --- [           main] o.s.c.d.acceptance.test.WoodChuckTests   : Matched all 'Started LogSink' in logfile for app log (source WOODCHUCK-TEST.log-v1-0)
12-Dec-2019 00:10:34 2019-12-12 00:10:34.741  INFO 5484 --- [           main] o.s.c.d.acceptance.test.WoodChuckTests   : Looking for 'WOODCHUCK-0,How,chuck' in logfile for log
12-Dec-2019 00:10:44 2019-12-12 00:10:44.742  INFO 5484 --- [           main] o.s.c.d.acceptance.test.WoodChuckTests   : Requesting log for app WOODCHUCK-TEST.log-v1-0
12-Dec-2019 00:10:44 2019-12-12 00:10:44.752  INFO 5484 --- [           main] o.s.c.d.acceptance.test.WoodChuckTests   : Retrieved logfile from 'http://10.194.6.131:56046/actuator/logfile
12-Dec-2019 00:10:44 2019-12-12 00:10:44.752  INFO 5484 --- [           main] o.s.c.d.acceptance.test.WoodChuckTests   : Requesting log for app WOODCHUCK-TEST.log-v1-1
12-Dec-2019 00:10:44 2019-12-12 00:10:44.764  INFO 5484 --- [           main] o.s.c.d.acceptance.test.WoodChuckTests   : Retrieved logfile from 'http://10.194.6.131:56568/actuator/logfile
12-Dec-2019 00:10:44 2019-12-12 00:10:44.764  INFO 5484 --- [           main] o.s.c.d.acceptance.test.WoodChuckTests   : Matched all 'WOODCHUCK-0,How,chuck' in logfile for app log (source WOODCHUCK-TEST.log-v1-0)
12-Dec-2019 00:10:44 2019-12-12 00:10:44.764  INFO 5484 --- [           main] o.s.c.d.acceptance.test.WoodChuckTests   : Looking for 'WOODCHUCK-1,much,wood,would,if,a,woodchuck,could' in logfile for log
12-Dec-2019 00:10:54 2019-12-12 00:10:54.765  INFO 5484 --- [           main] o.s.c.d.acceptance.test.WoodChuckTests   : Requesting log for app WOODCHUCK-TEST.log-v1-0
12-Dec-2019 00:10:54 2019-12-12 00:10:54.773  INFO 5484 --- [           main] o.s.c.d.acceptance.test.WoodChuckTests   : Retrieved logfile from 'http://10.194.6.131:56046/actuator/logfile
12-Dec-2019 00:10:54 2019-12-12 00:10:54.773  INFO 5484 --- [           main] o.s.c.d.acceptance.test.WoodChuckTests   : Requesting log for app WOODCHUCK-TEST.log-v1-1
12-Dec-2019 00:10:54 2019-12-12 00:10:54.782  INFO 5484 --- [           main] o.s.c.d.acceptance.test.WoodChuckTests   : Retrieved logfile from 'http://10.194.6.131:56568/actuator/logfile
12-Dec-2019 00:10:54 2019-12-12 00:10:54.783  INFO 5484 --- [           main] o.s.c.d.acceptance.test.WoodChuckTests   : Matched all 'WOODCHUCK-1,much,wood,would,if,a,woodchuck,could' in logfile for app log (source WOODCHUCK-TEST.log-v1-1)
12-Dec-2019 00:10:54 2019-12-12 00:10:54.784  INFO 5484 --- [           main] junit.logTestName                        : Test testPartitioning(org.springframework.cloud.dataflow.acceptance.test.WoodChuckTests) Succeeded
12-Dec-2019 00:10:54 2019-12-12 00:10:54.784  INFO 5484 --- [           main] junit.logTestName                        : Finished Test testPartitioning(org.springframework.cloud.dataflow.acceptance.test.WoodChuckTests)
12-Dec-2019 00:10:54 2019-12-12 00:10:54.784  INFO 5484 --- [           main] o.s.c.d.acceptance.test.WoodChuckTests   : Destroy all streams
12-Dec-2019 00:10:55 Tests run: 1, Failures: 0, Errors: 0, Skipped: 0, Time elapsed: 99.322 sec - in org.springframework.cloud.dataflow.acceptance.test.WoodChuckTests
12-Dec-2019 00:10:55 Running org.springframework.cloud.dataflow.acceptance.test.HttpSourceTests
12-Dec-2019 00:10:55 2019-12-12 00:10:55.176  INFO 5484 --- [           main] .b.t.c.SpringBootTestContextBootstrapper : Neither @ContextConfiguration nor @ContextHierarchy found for test class [org.springframework.cloud.dataflow.acceptance.test.HttpSourceTests], using SpringBootContextLoader
12-Dec-2019 00:10:55 2019-12-12 00:10:55.184  INFO 5484 --- [           main] .b.t.c.SpringBootTestContextBootstrapper : Loaded default TestExecutionListener class names from location [META-INF/spring.factories]: [org.springframework.boot.test.mock.mockito.MockitoTestExecutionListener, org.springframework.boot.test.mock.mockito.ResetMocksTestExecutionListener, org.springframework.boot.test.autoconfigure.restdocs.RestDocsTestExecutionListener, org.springframework.boot.test.autoconfigure.web.client.MockRestServiceServerResetTestExecutionListener, org.springframework.boot.test.autoconfigure.web.servlet.MockMvcPrintOnlyOnFailureTestExecutionListener, org.springframework.boot.test.autoconfigure.web.servlet.WebDriverTestExecutionListener, org.springframework.test.context.web.ServletTestExecutionListener, org.springframework.test.context.support.DirtiesContextBeforeModesTestExecutionListener, org.springframework.test.context.support.DependencyInjectionTestExecutionListener, org.springframework.test.context.support.DirtiesContextTestExecutionListener, org.springframework.test.context.transaction.TransactionalTestExecutionListener, org.springframework.test.context.jdbc.SqlScriptsTestExecutionListener]
12-Dec-2019 00:10:55 2019-12-12 00:10:55.186  INFO 5484 --- [           main] .b.t.c.SpringBootTestContextBootstrapper : Using TestExecutionListeners: [org.springframework.test.context.web.ServletTestExecutionListener@3a66e67e, org.springframework.test.context.support.DirtiesContextBeforeModesTestExecutionListener@75d4a80f, org.springframework.boot.test.autoconfigure.SpringBootDependencyInjectionTestExecutionListener@4596f8f3, org.springframework.test.context.support.DirtiesContextTestExecutionListener@ccf91df, org.springframework.test.context.transaction.TransactionalTestExecutionListener@117d32e, org.springframework.test.context.jdbc.SqlScriptsTestExecutionListener@51d387d3, org.springframework.boot.test.mock.mockito.MockitoTestExecutionListener@2370ac7a, org.springframework.boot.test.autoconfigure.web.servlet.MockMvcPrintOnlyOnFailureTestExecutionListener@534180a2, org.springframework.boot.test.autoconfigure.web.client.MockRestServiceServerResetTestExecutionListener@6cf0a747, org.springframework.boot.test.mock.mockito.ResetMocksTestExecutionListener@21505815, org.springframework.boot.test.autoconfigure.web.servlet.WebDriverTestExecutionListener@7e53339, org.springframework.boot.test.autoconfigure.restdocs.RestDocsTestExecutionListener@58fef7f7]
12-Dec-2019 00:10:55 2019-12-12 00:10:55.293  INFO 5484 --- [           main] junit.logTestName                        : Starting Test httpSourceTests(org.springframework.cloud.dataflow.acceptance.test.HttpSourceTests)
12-Dec-2019 00:10:55 2019-12-12 00:10:55.294  INFO 5484 --- [           main] o.s.c.d.acceptance.test.HttpSourceTests  : Creating stream 'HTTP-TEST'
12-Dec-2019 00:10:55 2019-12-12 00:10:55.327  INFO 5484 --- [           main] o.s.c.d.acceptance.test.HttpSourceTests  : Deploying stream 'HTTP-TEST' with properties: {app.*.spring.cloud.streamapp.security.enabled=false, app.*.logging.file=${PID}-test.log, app.*.endpoints.logfile.sensitive=false, app.*.management.endpoints.web.exposure.include=*}
12-Dec-2019 00:10:56 2019-12-12 00:10:56.004  INFO 5484 --- [           main] o.s.c.d.acceptance.test.HttpSourceTests  : Checking: Stream=HTTP-TEST, status = deploying, status description = The stream is being deployed.
12-Dec-2019 00:10:56 2019-12-12 00:10:56.005  INFO 5484 --- [           main] o.s.c.d.acceptance.test.HttpSourceTests  : Sleeping to check status of Stream=HTTP-TEST
12-Dec-2019 00:11:06 2019-12-12 00:11:06.067  INFO 5484 --- [           main] o.s.c.d.acceptance.test.HttpSourceTests  : Checking: Stream=HTTP-TEST, status = deploying, status description = The stream is being deployed.
12-Dec-2019 00:11:06 2019-12-12 00:11:06.067  INFO 5484 --- [           main] o.s.c.d.acceptance.test.HttpSourceTests  : Sleeping to check status of Stream=HTTP-TEST
12-Dec-2019 00:11:16 2019-12-12 00:11:16.099  INFO 5484 --- [           main] o.s.c.d.acceptance.test.HttpSourceTests  : Checking: Stream=HTTP-TEST, status = deployed, status description = The stream has been successfully deployed
12-Dec-2019 00:11:16 2019-12-12 00:11:16.139  INFO 5484 --- [           main] o.s.c.d.acceptance.test.HttpSourceTests  : Sleeping to check status of Stream=HTTP-TEST
12-Dec-2019 00:11:26 2019-12-12 00:11:26.140  INFO 5484 --- [           main] o.s.c.d.acceptance.test.HttpSourceTests  : Stream 'HTTP-TEST' started with status: deployed
12-Dec-2019 00:11:26 2019-12-12 00:11:26.140  INFO 5484 --- [           main] o.s.c.d.acceptance.test.HttpSourceTests  : App 'log' has instances: {HTTP-TEST.log-v1-0=http://10.194.6.131:60826}
12-Dec-2019 00:11:26 2019-12-12 00:11:26.141  INFO 5484 --- [           main] o.s.c.d.acceptance.test.HttpSourceTests  : App 'http' has instances: {HTTP-TEST.http-v1-0=http://10.194.6.131:22711}
12-Dec-2019 00:11:26 2019-12-12 00:11:26.146  INFO 5484 --- [           main] o.s.c.d.acceptance.test.HttpSourceTests  : Looking for 'Started HttpSource' in logfile for http
12-Dec-2019 00:11:36 2019-12-12 00:11:36.147  INFO 5484 --- [           main] o.s.c.d.acceptance.test.HttpSourceTests  : Requesting log for app HTTP-TEST.http-v1-0
12-Dec-2019 00:11:36 2019-12-12 00:11:36.447  INFO 5484 --- [           main] o.s.c.d.acceptance.test.HttpSourceTests  : Retrieved logfile from 'http://10.194.6.131:22711/actuator/logfile
12-Dec-2019 00:11:36 2019-12-12 00:11:36.447  INFO 5484 --- [           main] o.s.c.d.acceptance.test.HttpSourceTests  : Matched all 'Started HttpSource' in logfile for app http (source HTTP-TEST.http-v1-0)
12-Dec-2019 00:11:36 2019-12-12 00:11:36.447  INFO 5484 --- [           main] o.s.c.d.acceptance.test.HttpSourceTests  : Looking for 'Started LogSink' in logfile for log
12-Dec-2019 00:11:46 2019-12-12 00:11:46.447  INFO 5484 --- [           main] o.s.c.d.acceptance.test.HttpSourceTests  : Requesting log for app HTTP-TEST.log-v1-0
12-Dec-2019 00:11:46 2019-12-12 00:11:46.580  INFO 5484 --- [           main] o.s.c.d.acceptance.test.HttpSourceTests  : Retrieved logfile from 'http://10.194.6.131:60826/actuator/logfile
12-Dec-2019 00:11:46 2019-12-12 00:11:46.580  INFO 5484 --- [           main] o.s.c.d.acceptance.test.HttpSourceTests  : Matched all 'Started LogSink' in logfile for app log (source HTTP-TEST.log-v1-0)
12-Dec-2019 00:11:46 2019-12-12 00:11:46.756  INFO 5484 --- [           main] o.s.c.d.acceptance.test.HttpSourceTests  : Looking for '72788183-b4f5-4814-9abd-9d580df2c551' in logfile for log
12-Dec-2019 00:11:56 2019-12-12 00:11:56.756  INFO 5484 --- [           main] o.s.c.d.acceptance.test.HttpSourceTests  : Requesting log for app HTTP-TEST.log-v1-0
12-Dec-2019 00:11:56 2019-12-12 00:11:56.765  INFO 5484 --- [           main] o.s.c.d.acceptance.test.HttpSourceTests  : Retrieved logfile from 'http://10.194.6.131:60826/actuator/logfile
12-Dec-2019 00:11:56 2019-12-12 00:11:56.765  INFO 5484 --- [           main] o.s.c.d.acceptance.test.HttpSourceTests  : Matched all '72788183-b4f5-4814-9abd-9d580df2c551' in logfile for app log (source HTTP-TEST.log-v1-0)
12-Dec-2019 00:11:56 2019-12-12 00:11:56.766  INFO 5484 --- [           main] junit.logTestName                        : Test httpSourceTests(org.springframework.cloud.dataflow.acceptance.test.HttpSourceTests) Succeeded
12-Dec-2019 00:11:56 2019-12-12 00:11:56.767  INFO 5484 --- [           main] junit.logTestName                        : Finished Test httpSourceTests(org.springframework.cloud.dataflow.acceptance.test.HttpSourceTests)
12-Dec-2019 00:11:56 2019-12-12 00:11:56.767  INFO 5484 --- [           main] o.s.c.d.acceptance.test.HttpSourceTests  : Destroy all streams
12-Dec-2019 00:11:57 Tests run: 1, Failures: 0, Errors: 0, Skipped: 0, Time elapsed: 61.85 sec - in org.springframework.cloud.dataflow.acceptance.test.HttpSourceTests
12-Dec-2019 00:11:57 Running org.springframework.cloud.dataflow.acceptance.test.TimestampTaskTests
12-Dec-2019 00:11:57 2019-12-12 00:11:57.048  INFO 5484 --- [           main] o.s.c.support.GenericApplicationContext  : Refreshing org.springframework.context.support.GenericApplicationContext@6e7c351d: startup date [Thu Dec 12 00:11:57 UTC 2019]; root of context hierarchy
12-Dec-2019 00:11:57 2019-12-12 00:11:57.182  INFO 5484 --- [           main] junit.logTestName                        : Starting Test timeStampTests(org.springframework.cloud.dataflow.acceptance.test.TimestampTaskTests)
12-Dec-2019 00:11:57 2019-12-12 00:11:57.183  INFO 5484 --- [           main] o.s.c.d.a.test.AbstractTaskTests         : Importing task apps from uri resource: https://dataflow.spring.io/task-maven-latest
12-Dec-2019 00:11:57 2019-12-12 00:11:57.804  INFO 5484 --- [           main] o.s.c.d.a.test.AbstractTaskTests         : Done importing task apps.
12-Dec-2019 00:12:08 2019-12-12 00:12:08.201  INFO 5484 --- [           main] junit.logTestName                        : Test timeStampTests(org.springframework.cloud.dataflow.acceptance.test.TimestampTaskTests) Succeeded
12-Dec-2019 00:12:08 2019-12-12 00:12:08.201  INFO 5484 --- [           main] junit.logTestName                        : Finished Test timeStampTests(org.springframework.cloud.dataflow.acceptance.test.TimestampTaskTests)
12-Dec-2019 00:12:08 2019-12-12 00:12:08.273  INFO 5484 --- [           main] junit.logTestName                        : Starting Test timeStampTestsMultipleLaunch(org.springframework.cloud.dataflow.acceptance.test.TimestampTaskTests)
12-Dec-2019 00:12:28 2019-12-12 00:12:28.745  INFO 5484 --- [           main] junit.logTestName                        : Test timeStampTestsMultipleLaunch(org.springframework.cloud.dataflow.acceptance.test.TimestampTaskTests) Succeeded
12-Dec-2019 00:12:28 2019-12-12 00:12:28.746  INFO 5484 --- [           main] junit.logTestName                        : Finished Test timeStampTestsMultipleLaunch(org.springframework.cloud.dataflow.acceptance.test.TimestampTaskTests)
12-Dec-2019 00:12:28 Tests run: 2, Failures: 0, Errors: 0, Skipped: 0, Time elapsed: 31.72 sec - in org.springframework.cloud.dataflow.acceptance.test.TimestampTaskTests
12-Dec-2019 00:12:28 Running org.springframework.cloud.dataflow.acceptance.test.TickTockTests
12-Dec-2019 00:12:28 2019-12-12 00:12:28.748  INFO 5484 --- [           main] .b.t.c.SpringBootTestContextBootstrapper : Neither @ContextConfiguration nor @ContextHierarchy found for test class [org.springframework.cloud.dataflow.acceptance.test.TickTockTests], using SpringBootContextLoader
12-Dec-2019 00:12:28 2019-12-12 00:12:28.753  INFO 5484 --- [           main] .b.t.c.SpringBootTestContextBootstrapper : Loaded default TestExecutionListener class names from location [META-INF/spring.factories]: [org.springframework.boot.test.mock.mockito.MockitoTestExecutionListener, org.springframework.boot.test.mock.mockito.ResetMocksTestExecutionListener, org.springframework.boot.test.autoconfigure.restdocs.RestDocsTestExecutionListener, org.springframework.boot.test.autoconfigure.web.client.MockRestServiceServerResetTestExecutionListener, org.springframework.boot.test.autoconfigure.web.servlet.MockMvcPrintOnlyOnFailureTestExecutionListener, org.springframework.boot.test.autoconfigure.web.servlet.WebDriverTestExecutionListener, org.springframework.test.context.web.ServletTestExecutionListener, org.springframework.test.context.support.DirtiesContextBeforeModesTestExecutionListener, org.springframework.test.context.support.DependencyInjectionTestExecutionListener, org.springframework.test.context.support.DirtiesContextTestExecutionListener, org.springframework.test.context.transaction.TransactionalTestExecutionListener, org.springframework.test.context.jdbc.SqlScriptsTestExecutionListener]
12-Dec-2019 00:12:28 2019-12-12 00:12:28.755  INFO 5484 --- [           main] .b.t.c.SpringBootTestContextBootstrapper : Using TestExecutionListeners: [org.springframework.test.context.web.ServletTestExecutionListener@3b48e183, org.springframework.test.context.support.DirtiesContextBeforeModesTestExecutionListener@514de325, org.springframework.boot.test.autoconfigure.SpringBootDependencyInjectionTestExecutionListener@30c1da48, org.springframework.test.context.support.DirtiesContextTestExecutionListener@43a65cd8, org.springframework.test.context.transaction.TransactionalTestExecutionListener@3f1ef9d6, org.springframework.test.context.jdbc.SqlScriptsTestExecutionListener@17461db, org.springframework.boot.test.mock.mockito.MockitoTestExecutionListener@3fd9e827, org.springframework.boot.test.autoconfigure.web.servlet.MockMvcPrintOnlyOnFailureTestExecutionListener@4e682398, org.springframework.boot.test.autoconfigure.web.client.MockRestServiceServerResetTestExecutionListener@670b3ca, org.springframework.boot.test.mock.mockito.ResetMocksTestExecutionListener@24a86066, org.springframework.boot.test.autoconfigure.web.servlet.WebDriverTestExecutionListener@54402c04, org.springframework.boot.test.autoconfigure.restdocs.RestDocsTestExecutionListener@5b3bb1f7]
12-Dec-2019 00:12:28 2019-12-12 00:12:28.824  INFO 5484 --- [           main] junit.logTestName                        : Starting Test tickTockUpdateRollbackTests(org.springframework.cloud.dataflow.acceptance.test.TickTockTests)
12-Dec-2019 00:12:28 2019-12-12 00:12:28.847  INFO 5484 --- [           main] o.s.c.d.acceptance.test.TickTockTests    : Creating stream 'TICKTOCK'
12-Dec-2019 00:12:28 2019-12-12 00:12:28.877  INFO 5484 --- [           main] o.s.c.d.acceptance.test.TickTockTests    : Deploying stream 'TICKTOCK' with properties: {app.*.spring.cloud.streamapp.security.enabled=false, app.*.logging.file=${PID}-test.log, app.*.endpoints.logfile.sensitive=false, app.log.log.expression='TICKTOCK - TIMESTAMP: '.concat(payload), app.*.management.endpoints.web.exposure.include=*}
12-Dec-2019 00:12:29 2019-12-12 00:12:29.474  INFO 5484 --- [           main] o.s.c.d.acceptance.test.TickTockTests    : Checking: Stream=TICKTOCK, status = deploying, status description = The stream is being deployed.
12-Dec-2019 00:12:29 2019-12-12 00:12:29.474  INFO 5484 --- [           main] o.s.c.d.acceptance.test.TickTockTests    : Sleeping to check status of Stream=TICKTOCK
12-Dec-2019 00:12:39 2019-12-12 00:12:39.522  INFO 5484 --- [           main] o.s.c.d.acceptance.test.TickTockTests    : Checking: Stream=TICKTOCK, status = deploying, status description = The stream is being deployed.
12-Dec-2019 00:12:39 2019-12-12 00:12:39.522  INFO 5484 --- [           main] o.s.c.d.acceptance.test.TickTockTests    : Sleeping to check status of Stream=TICKTOCK
12-Dec-2019 00:12:49 2019-12-12 00:12:49.579  INFO 5484 --- [           main] o.s.c.d.acceptance.test.TickTockTests    : Checking: Stream=TICKTOCK, status = deployed, status description = The stream has been successfully deployed
12-Dec-2019 00:12:49 2019-12-12 00:12:49.613  INFO 5484 --- [           main] o.s.c.d.acceptance.test.TickTockTests    : Sleeping to check status of Stream=TICKTOCK
12-Dec-2019 00:12:59 2019-12-12 00:12:59.614  INFO 5484 --- [           main] o.s.c.d.acceptance.test.TickTockTests    : Stream 'TICKTOCK' started with status: deployed
12-Dec-2019 00:12:59 2019-12-12 00:12:59.614  INFO 5484 --- [           main] o.s.c.d.acceptance.test.TickTockTests    : App 'log' has instances: {TICKTOCK.log-v1-0=http://10.194.6.131:39513}
12-Dec-2019 00:12:59 2019-12-12 00:12:59.614  INFO 5484 --- [           main] o.s.c.d.acceptance.test.TickTockTests    : App 'time' has instances: {TICKTOCK.time-v1-0=http://10.194.6.131:42528}
12-Dec-2019 00:12:59 2019-12-12 00:12:59.614  INFO 5484 --- [           main] o.s.c.d.acceptance.test.TickTockTests    : Looking for 'Started TimeSource' in logfile for time
12-Dec-2019 00:13:09 2019-12-12 00:13:09.614  INFO 5484 --- [           main] o.s.c.d.acceptance.test.TickTockTests    : Requesting log for app TICKTOCK.time-v1-0
12-Dec-2019 00:13:09 2019-12-12 00:13:09.883  INFO 5484 --- [           main] o.s.c.d.acceptance.test.TickTockTests    : Retrieved logfile from 'http://10.194.6.131:42528/actuator/logfile
12-Dec-2019 00:13:09 2019-12-12 00:13:09.883  INFO 5484 --- [           main] o.s.c.d.acceptance.test.TickTockTests    : Matched all 'Started TimeSource' in logfile for app time (source TICKTOCK.time-v1-0)
12-Dec-2019 00:13:09 2019-12-12 00:13:09.883  INFO 5484 --- [           main] o.s.c.d.acceptance.test.TickTockTests    : Looking for 'Started LogSink' in logfile for log
12-Dec-2019 00:13:19 2019-12-12 00:13:19.884  INFO 5484 --- [           main] o.s.c.d.acceptance.test.TickTockTests    : Requesting log for app TICKTOCK.log-v1-0
12-Dec-2019 00:13:20 2019-12-12 00:13:20.017  INFO 5484 --- [           main] o.s.c.d.acceptance.test.TickTockTests    : Retrieved logfile from 'http://10.194.6.131:39513/actuator/logfile
12-Dec-2019 00:13:20 2019-12-12 00:13:20.017  INFO 5484 --- [           main] o.s.c.d.acceptance.test.TickTockTests    : Matched all 'Started LogSink' in logfile for app log (source TICKTOCK.log-v1-0)
12-Dec-2019 00:13:20 2019-12-12 00:13:20.017  INFO 5484 --- [           main] o.s.c.d.acceptance.test.TickTockTests    : Looking for 'TICKTOCK - TIMESTAMP:' in logfile for log
12-Dec-2019 00:13:30 2019-12-12 00:13:30.017  INFO 5484 --- [           main] o.s.c.d.acceptance.test.TickTockTests    : Requesting log for app TICKTOCK.log-v1-0
12-Dec-2019 00:13:30 2019-12-12 00:13:30.025  INFO 5484 --- [           main] o.s.c.d.acceptance.test.TickTockTests    : Retrieved logfile from 'http://10.194.6.131:39513/actuator/logfile
12-Dec-2019 00:13:30 2019-12-12 00:13:30.025  INFO 5484 --- [           main] o.s.c.d.acceptance.test.TickTockTests    : Matched all 'TICKTOCK - TIMESTAMP:' in logfile for app log (source TICKTOCK.log-v1-0)
12-Dec-2019 00:13:30 2019-12-12 00:13:30.026  INFO 5484 --- [           main] o.s.c.d.acceptance.test.TickTockTests    : Updating stream 'TICKTOCK'
12-Dec-2019 00:13:30 2019-12-12 00:13:30.628  INFO 5484 --- [           main] o.s.c.d.acceptance.test.TickTockTests    : Checking: Stream=TICKTOCK, status = deploying, status description = The stream is being deployed.
12-Dec-2019 00:13:30 2019-12-12 00:13:30.628  INFO 5484 --- [           main] o.s.c.d.acceptance.test.TickTockTests    : Sleeping to check status of Stream=TICKTOCK
12-Dec-2019 00:13:40 2019-12-12 00:13:40.665  INFO 5484 --- [           main] o.s.c.d.acceptance.test.TickTockTests    : Checking: Stream=TICKTOCK, status = deployed, status description = The stream has been successfully deployed
12-Dec-2019 00:13:40 2019-12-12 00:13:40.712  INFO 5484 --- [           main] o.s.c.d.acceptance.test.TickTockTests    : Sleeping to check status of Stream=TICKTOCK
12-Dec-2019 00:13:50 2019-12-12 00:13:50.713  INFO 5484 --- [           main] o.s.c.d.acceptance.test.TickTockTests    : Stream 'TICKTOCK' started with status: deployed
12-Dec-2019 00:13:50 2019-12-12 00:13:50.713  INFO 5484 --- [           main] o.s.c.d.acceptance.test.TickTockTests    : App 'log' has instances: {TICKTOCK.log-v1-0=http://10.194.6.131:39513, TICKTOCK.log-v2-0=http://10.194.6.131:34845}
12-Dec-2019 00:13:50 2019-12-12 00:13:50.713  INFO 5484 --- [           main] o.s.c.d.acceptance.test.TickTockTests    : App 'time' has instances: {TICKTOCK.time-v1-0=http://10.194.6.131:42528}
12-Dec-2019 00:13:50 2019-12-12 00:13:50.713  INFO 5484 --- [           main] o.s.c.d.acceptance.test.TickTockTests    : Looking for 'Started LogSink' in logfile for log
12-Dec-2019 00:14:00 2019-12-12 00:14:00.713  INFO 5484 --- [           main] o.s.c.d.acceptance.test.TickTockTests    : Requesting log for app TICKTOCK.log-v1-0
12-Dec-2019 00:14:00 2019-12-12 00:14:00.716  WARN 5484 --- [           main] o.s.c.d.acceptance.test.TickTockTests    : Error while trying to access logfile from 'http://10.194.6.131:39513/logfile' due to : org.springframework.web.client.ResourceAccessException: I/O error on GET request for "http://10.194.6.131:39513/logfile": Connection refused (Connection refused); nested exception is java.net.ConnectException: Connection refused (Connection refused)
12-Dec-2019 00:14:00 2019-12-12 00:14:00.716  INFO 5484 --- [           main] o.s.c.d.acceptance.test.TickTockTests    : Requesting log for app TICKTOCK.log-v2-0
12-Dec-2019 00:14:00 2019-12-12 00:14:00.859  INFO 5484 --- [           main] o.s.c.d.acceptance.test.TickTockTests    : Retrieved logfile from 'http://10.194.6.131:34845/actuator/logfile
12-Dec-2019 00:14:00 2019-12-12 00:14:00.860  INFO 5484 --- [           main] o.s.c.d.acceptance.test.TickTockTests    : Matched all 'Started LogSink' in logfile for app log (source TICKTOCK.log-v2-0)
12-Dec-2019 00:14:00 2019-12-12 00:14:00.860  INFO 5484 --- [           main] o.s.c.d.acceptance.test.TickTockTests    : Looking for 'TICKTOCK Updated - TIMESTAMP:' in logfile for log
12-Dec-2019 00:14:10 2019-12-12 00:14:10.860  INFO 5484 --- [           main] o.s.c.d.acceptance.test.TickTockTests    : Requesting log for app TICKTOCK.log-v1-0
12-Dec-2019 00:14:10 2019-12-12 00:14:10.861  WARN 5484 --- [           main] o.s.c.d.acceptance.test.TickTockTests    : Error while trying to access logfile from 'http://10.194.6.131:39513/logfile' due to : org.springframework.web.client.ResourceAccessException: I/O error on GET request for "http://10.194.6.131:39513/logfile": Connection refused (Connection refused); nested exception is java.net.ConnectException: Connection refused (Connection refused)
12-Dec-2019 00:14:10 2019-12-12 00:14:10.861  INFO 5484 --- [           main] o.s.c.d.acceptance.test.TickTockTests    : Requesting log for app TICKTOCK.log-v2-0
12-Dec-2019 00:14:10 2019-12-12 00:14:10.868  INFO 5484 --- [           main] o.s.c.d.acceptance.test.TickTockTests    : Retrieved logfile from 'http://10.194.6.131:34845/actuator/logfile
12-Dec-2019 00:14:10 2019-12-12 00:14:10.869  INFO 5484 --- [           main] o.s.c.d.acceptance.test.TickTockTests    : Matched all 'TICKTOCK Updated - TIMESTAMP:' in logfile for app log (source TICKTOCK.log-v2-0)
12-Dec-2019 00:14:10 2019-12-12 00:14:10.869  INFO 5484 --- [           main] o.s.c.d.acceptance.test.TickTockTests    : Rolling back the stream 'TICKTOCK' to the version 0
12-Dec-2019 00:14:11 2019-12-12 00:14:11.292  INFO 5484 --- [           main] o.s.c.d.acceptance.test.TickTockTests    : Checking: Stream=TICKTOCK, status = deploying, status description = The stream is being deployed.
12-Dec-2019 00:14:11 2019-12-12 00:14:11.292  INFO 5484 --- [           main] o.s.c.d.acceptance.test.TickTockTests    : Sleeping to check status of Stream=TICKTOCK
12-Dec-2019 00:14:21 2019-12-12 00:14:21.317  INFO 5484 --- [           main] o.s.c.d.acceptance.test.TickTockTests    : Checking: Stream=TICKTOCK, status = deployed, status description = The stream has been successfully deployed
12-Dec-2019 00:14:21 2019-12-12 00:14:21.347  INFO 5484 --- [           main] o.s.c.d.acceptance.test.TickTockTests    : Sleeping to check status of Stream=TICKTOCK
12-Dec-2019 00:14:31 2019-12-12 00:14:31.347  INFO 5484 --- [           main] o.s.c.d.acceptance.test.TickTockTests    : Stream 'TICKTOCK' started with status: deployed
12-Dec-2019 00:14:31 2019-12-12 00:14:31.348  INFO 5484 --- [           main] o.s.c.d.acceptance.test.TickTockTests    : App 'log' has instances: {TICKTOCK.log-v1-0=http://10.194.6.131:39513, TICKTOCK.log-v3-0=http://10.194.6.131:55737, TICKTOCK.log-v2-0=http://10.194.6.131:34845}
12-Dec-2019 00:14:31 2019-12-12 00:14:31.348  INFO 5484 --- [           main] o.s.c.d.acceptance.test.TickTockTests    : App 'time' has instances: {TICKTOCK.time-v1-0=http://10.194.6.131:42528}
12-Dec-2019 00:14:31 2019-12-12 00:14:31.348  INFO 5484 --- [           main] o.s.c.d.acceptance.test.TickTockTests    : Looking for 'TICKTOCK - TIMESTAMP:' in logfile for log
12-Dec-2019 00:14:41 2019-12-12 00:14:41.348  INFO 5484 --- [           main] o.s.c.d.acceptance.test.TickTockTests    : Requesting log for app TICKTOCK.log-v1-0
12-Dec-2019 00:14:41 2019-12-12 00:14:41.349  WARN 5484 --- [           main] o.s.c.d.acceptance.test.TickTockTests    : Error while trying to access logfile from 'http://10.194.6.131:39513/logfile' due to : org.springframework.web.client.ResourceAccessException: I/O error on GET request for "http://10.194.6.131:39513/logfile": Connection refused (Connection refused); nested exception is java.net.ConnectException: Connection refused (Connection refused)
12-Dec-2019 00:14:41 2019-12-12 00:14:41.349  INFO 5484 --- [           main] o.s.c.d.acceptance.test.TickTockTests    : Requesting log for app TICKTOCK.log-v3-0
12-Dec-2019 00:14:41 2019-12-12 00:14:41.482  INFO 5484 --- [           main] o.s.c.d.acceptance.test.TickTockTests    : Retrieved logfile from 'http://10.194.6.131:55737/actuator/logfile
12-Dec-2019 00:14:41 2019-12-12 00:14:41.482  INFO 5484 --- [           main] o.s.c.d.acceptance.test.TickTockTests    : Requesting log for app TICKTOCK.log-v2-0
12-Dec-2019 00:14:41 2019-12-12 00:14:41.483  WARN 5484 --- [           main] o.s.c.d.acceptance.test.TickTockTests    : Error while trying to access logfile from 'http://10.194.6.131:34845/logfile' due to : org.springframework.web.client.ResourceAccessException: I/O error on GET request for "http://10.194.6.131:34845/logfile": Connection refused (Connection refused); nested exception is java.net.ConnectException: Connection refused (Connection refused)
12-Dec-2019 00:14:41 2019-12-12 00:14:41.483  INFO 5484 --- [           main] o.s.c.d.acceptance.test.TickTockTests    : Matched all 'TICKTOCK - TIMESTAMP:' in logfile for app log (source TICKTOCK.log-v3-0)
12-Dec-2019 00:14:41 2019-12-12 00:14:41.484  INFO 5484 --- [           main] junit.logTestName                        : Test tickTockUpdateRollbackTests(org.springframework.cloud.dataflow.acceptance.test.TickTockTests) Succeeded
12-Dec-2019 00:14:41 2019-12-12 00:14:41.485  INFO 5484 --- [           main] junit.logTestName                        : Finished Test tickTockUpdateRollbackTests(org.springframework.cloud.dataflow.acceptance.test.TickTockTests)
12-Dec-2019 00:14:41 2019-12-12 00:14:41.485  INFO 5484 --- [           main] o.s.c.d.acceptance.test.TickTockTests    : Destroy all streams
12-Dec-2019 00:14:41 2019-12-12 00:14:41.872  INFO 5484 --- [           main] junit.logTestName                        : Starting Test tickTockTests(org.springframework.cloud.dataflow.acceptance.test.TickTockTests)
12-Dec-2019 00:14:41 2019-12-12 00:14:41.874  INFO 5484 --- [           main] o.s.c.d.acceptance.test.TickTockTests    : Creating stream 'TICKTOCK'
12-Dec-2019 00:14:41 2019-12-12 00:14:41.914  INFO 5484 --- [           main] o.s.c.d.acceptance.test.TickTockTests    : Deploying stream 'TICKTOCK' with properties: {app.*.spring.cloud.streamapp.security.enabled=false, app.*.logging.file=${PID}-test.log, app.*.endpoints.logfile.sensitive=false, app.log.log.expression='TICKTOCK - TIMESTAMP: '.concat(payload), app.*.management.endpoints.web.exposure.include=*}
12-Dec-2019 00:14:42 2019-12-12 00:14:42.452  INFO 5484 --- [           main] o.s.c.d.acceptance.test.TickTockTests    : Checking: Stream=TICKTOCK, status = deploying, status description = The stream is being deployed.
12-Dec-2019 00:14:42 2019-12-12 00:14:42.452  INFO 5484 --- [           main] o.s.c.d.acceptance.test.TickTockTests    : Sleeping to check status of Stream=TICKTOCK
12-Dec-2019 00:14:52 2019-12-12 00:14:52.492  INFO 5484 --- [           main] o.s.c.d.acceptance.test.TickTockTests    : Checking: Stream=TICKTOCK, status = deploying, status description = The stream is being deployed.
12-Dec-2019 00:14:52 2019-12-12 00:14:52.492  INFO 5484 --- [           main] o.s.c.d.acceptance.test.TickTockTests    : Sleeping to check status of Stream=TICKTOCK
12-Dec-2019 00:15:02 2019-12-12 00:15:02.519  INFO 5484 --- [           main] o.s.c.d.acceptance.test.TickTockTests    : Checking: Stream=TICKTOCK, status = deployed, status description = The stream has been successfully deployed
12-Dec-2019 00:15:02 2019-12-12 00:15:02.550  INFO 5484 --- [           main] o.s.c.d.acceptance.test.TickTockTests    : Sleeping to check status of Stream=TICKTOCK
12-Dec-2019 00:15:12 2019-12-12 00:15:12.551  INFO 5484 --- [           main] o.s.c.d.acceptance.test.TickTockTests    : Stream 'TICKTOCK' started with status: deployed
12-Dec-2019 00:15:12 2019-12-12 00:15:12.551  INFO 5484 --- [           main] o.s.c.d.acceptance.test.TickTockTests    : App 'log' has instances: {TICKTOCK.log-v4-0=http://10.194.6.131:37208}
12-Dec-2019 00:15:12 2019-12-12 00:15:12.551  INFO 5484 --- [           main] o.s.c.d.acceptance.test.TickTockTests    : App 'time' has instances: {TICKTOCK.time-v4-0=http://10.194.6.131:21262}
12-Dec-2019 00:15:12 2019-12-12 00:15:12.551  INFO 5484 --- [           main] o.s.c.d.acceptance.test.TickTockTests    : Looking for 'Started TimeSource' in logfile for time
12-Dec-2019 00:15:22 2019-12-12 00:15:22.551  INFO 5484 --- [           main] o.s.c.d.acceptance.test.TickTockTests    : Requesting log for app TICKTOCK.time-v4-0
12-Dec-2019 00:15:22 2019-12-12 00:15:22.815  INFO 5484 --- [           main] o.s.c.d.acceptance.test.TickTockTests    : Retrieved logfile from 'http://10.194.6.131:21262/actuator/logfile
12-Dec-2019 00:15:22 2019-12-12 00:15:22.816  INFO 5484 --- [           main] o.s.c.d.acceptance.test.TickTockTests    : Matched all 'Started TimeSource' in logfile for app time (source TICKTOCK.time-v4-0)
12-Dec-2019 00:15:22 2019-12-12 00:15:22.816  INFO 5484 --- [           main] o.s.c.d.acceptance.test.TickTockTests    : Looking for 'Started LogSink' in logfile for log
12-Dec-2019 00:15:32 2019-12-12 00:15:32.816  INFO 5484 --- [           main] o.s.c.d.acceptance.test.TickTockTests    : Requesting log for app TICKTOCK.log-v4-0
12-Dec-2019 00:15:32 2019-12-12 00:15:32.943  INFO 5484 --- [           main] o.s.c.d.acceptance.test.TickTockTests    : Retrieved logfile from 'http://10.194.6.131:37208/actuator/logfile
12-Dec-2019 00:15:32 2019-12-12 00:15:32.944  INFO 5484 --- [           main] o.s.c.d.acceptance.test.TickTockTests    : Matched all 'Started LogSink' in logfile for app log (source TICKTOCK.log-v4-0)
12-Dec-2019 00:15:32 2019-12-12 00:15:32.944  INFO 5484 --- [           main] o.s.c.d.acceptance.test.TickTockTests    : Looking for 'TICKTOCK - TIMESTAMP:' in logfile for log
12-Dec-2019 00:15:42 2019-12-12 00:15:42.944  INFO 5484 --- [           main] o.s.c.d.acceptance.test.TickTockTests    : Requesting log for app TICKTOCK.log-v4-0
12-Dec-2019 00:15:42 2019-12-12 00:15:42.951  INFO 5484 --- [           main] o.s.c.d.acceptance.test.TickTockTests    : Retrieved logfile from 'http://10.194.6.131:37208/actuator/logfile
12-Dec-2019 00:15:42 2019-12-12 00:15:42.952  INFO 5484 --- [           main] o.s.c.d.acceptance.test.TickTockTests    : Matched all 'TICKTOCK - TIMESTAMP:' in logfile for app log (source TICKTOCK.log-v4-0)
12-Dec-2019 00:15:42 2019-12-12 00:15:42.953  INFO 5484 --- [           main] junit.logTestName                        : Test tickTockTests(org.springframework.cloud.dataflow.acceptance.test.TickTockTests) Succeeded
12-Dec-2019 00:15:42 2019-12-12 00:15:42.953  INFO 5484 --- [           main] junit.logTestName                        : Finished Test tickTockTests(org.springframework.cloud.dataflow.acceptance.test.TickTockTests)
12-Dec-2019 00:15:42 2019-12-12 00:15:42.953  INFO 5484 --- [           main] o.s.c.d.acceptance.test.TickTockTests    : Destroy all streams
12-Dec-2019 00:15:43 2019-12-12 00:15:43.212  INFO 5484 --- [           main] junit.logTestName                        : Starting Test tickTockTestsFromConfigServer(org.springframework.cloud.dataflow.acceptance.test.TickTockTests)
12-Dec-2019 00:15:43 2019-12-12 00:15:43.216  INFO 5484 --- [           main] junit.logTestName                        : Finished Test tickTockTestsFromConfigServer(org.springframework.cloud.dataflow.acceptance.test.TickTockTests)
12-Dec-2019 00:15:43 2019-12-12 00:15:43.217  INFO 5484 --- [           main] o.s.c.d.acceptance.test.TickTockTests    : Destroy all streams
12-Dec-2019 00:15:43 Tests run: 3, Failures: 0, Errors: 0, Skipped: 1, Time elapsed: 194.474 sec - in org.springframework.cloud.dataflow.acceptance.test.TickTockTests
12-Dec-2019 00:15:43 Running org.springframework.cloud.dataflow.acceptance.test.ComposedTaskTests
12-Dec-2019 00:15:43 2019-12-12 00:15:43.293  INFO 5484 --- [           main] junit.logTestName                        : Starting Test ctrMultipleLaunchWithArguments(org.springframework.cloud.dataflow.acceptance.test.ComposedTaskTests)
12-Dec-2019 00:18:49 2019-12-12 00:18:49.844 ERROR 5484 --- [           main] junit.logTestName                        : !!! Test ctrMultipleLaunchWithArguments(org.springframework.cloud.dataflow.acceptance.test.ComposedTaskTests) Failed !!!
12-Dec-2019 00:18:49
12-Dec-2019 00:18:49 java.lang.AssertionError: null
12-Dec-2019 00:18:49         at org.junit.Assert.fail(Assert.java:86)
12-Dec-2019 00:18:49         at org.junit.Assert.assertTrue(Assert.java:41)
12-Dec-2019 00:18:49         at org.junit.Assert.assertTrue(Assert.java:52)
12-Dec-2019 00:18:49         at org.springframework.cloud.dataflow.acceptance.test.ComposedTaskTests.assertTaskExecutions(ComposedTaskTests.java:65)
12-Dec-2019 00:18:49         at org.springframework.cloud.dataflow.acceptance.test.ComposedTaskTests.ctrMultipleLaunchWithArguments(ComposedTaskTests.java:57)
12-Dec-2019 00:18:49         at sun.reflect.NativeMethodAccessorImpl.invoke0(Native Method)
12-Dec-2019 00:18:49         at sun.reflect.NativeMethodAccessorImpl.invoke(NativeMethodAccessorImpl.java:62)
12-Dec-2019 00:18:49         at sun.reflect.DelegatingMethodAccessorImpl.invoke(DelegatingMethodAccessorImpl.java:43)
12-Dec-2019 00:18:49         at java.lang.reflect.Method.invoke(Method.java:498)
12-Dec-2019 00:18:49         at org.junit.runners.model.FrameworkMethod$1.runReflectiveCall(FrameworkMethod.java:50)
12-Dec-2019 00:18:49         at org.junit.internal.runners.model.ReflectiveCallable.run(ReflectiveCallable.java:12)
12-Dec-2019 00:18:49         at org.junit.runners.model.FrameworkMethod.invokeExplosively(FrameworkMethod.java:47)
12-Dec-2019 00:18:49         at org.junit.internal.runners.statements.InvokeMethod.evaluate(InvokeMethod.java:17)
12-Dec-2019 00:18:49         at org.junit.internal.runners.statements.RunBefores.evaluate(RunBefores.java:26)
12-Dec-2019 00:18:49         at org.springframework.test.context.junit4.statements.RunBeforeTestMethodCallbacks.evaluate(RunBeforeTestMethodCallbacks.java:75)
12-Dec-2019 00:18:49         at org.junit.internal.runners.statements.RunAfters.evaluate(RunAfters.java:27)
12-Dec-2019 00:18:49         at org.springframework.test.context.junit4.statements.RunAfterTestMethodCallbacks.evaluate(RunAfterTestMethodCallbacks.java:86)
12-Dec-2019 00:18:49         at org.junit.rules.TestWatcher$1.evaluate(TestWatcher.java:55)
12-Dec-2019 00:18:49         at org.junit.rules.RunRules.evaluate(RunRules.java:20)
12-Dec-2019 00:18:49         at org.springframework.test.context.junit4.statements.SpringRepeat.evaluate(SpringRepeat.java:84)
12-Dec-2019 00:18:49         at org.junit.runners.ParentRunner.runLeaf(ParentRunner.java:325)
12-Dec-2019 00:18:49         at org.springframework.test.context.junit4.SpringJUnit4ClassRunner.runChild(SpringJUnit4ClassRunner.java:252)
12-Dec-2019 00:18:49         at org.springframework.test.context.junit4.SpringJUnit4ClassRunner.runChild(SpringJUnit4ClassRunner.java:94)
12-Dec-2019 00:18:49         at org.junit.runners.ParentRunner$3.run(ParentRunner.java:290)
12-Dec-2019 00:18:49         at org.junit.runners.ParentRunner$1.schedule(ParentRunner.java:71)
12-Dec-2019 00:18:49         at org.junit.runners.ParentRunner.runChildren(ParentRunner.java:288)
12-Dec-2019 00:18:49         at org.junit.runners.ParentRunner.access$000(ParentRunner.java:58)
12-Dec-2019 00:18:49         at org.junit.runners.ParentRunner$2.evaluate(ParentRunner.java:268)
12-Dec-2019 00:18:49         at org.springframework.test.context.junit4.statements.RunBeforeTestClassCallbacks.evaluate(RunBeforeTestClassCallbacks.java:61)
12-Dec-2019 00:18:49         at org.springframework.test.context.junit4.statements.RunAfterTestClassCallbacks.evaluate(RunAfterTestClassCallbacks.java:70)
12-Dec-2019 00:18:49         at org.junit.runners.ParentRunner.run(ParentRunner.java:363)
12-Dec-2019 00:18:49         at org.springframework.test.context.junit4.SpringJUnit4ClassRunner.run(SpringJUnit4ClassRunner.java:191)
12-Dec-2019 00:18:49         at org.apache.maven.surefire.junit4.JUnit4Provider.execute(JUnit4Provider.java:283)
12-Dec-2019 00:18:49         at org.apache.maven.surefire.junit4.JUnit4Provider.executeWithRerun(JUnit4Provider.java:173)
12-Dec-2019 00:18:49         at org.apache.maven.surefire.junit4.JUnit4Provider.executeTestSet(JUnit4Provider.java:153)
12-Dec-2019 00:18:49         at org.apache.maven.surefire.junit4.JUnit4Provider.invoke(JUnit4Provider.java:128)
12-Dec-2019 00:18:49         at org.apache.maven.surefire.booter.ForkedBooter.invokeProviderInSameClassLoader(ForkedBooter.java:203)
12-Dec-2019 00:18:49         at org.apache.maven.surefire.booter.ForkedBooter.runSuitesInProcess(ForkedBooter.java:155)
12-Dec-2019 00:18:49         at org.apache.maven.surefire.booter.ForkedBooter.main(ForkedBooter.java:103)
12-Dec-2019 00:18:49
12-Dec-2019 00:18:49 2019-12-12 00:18:49.845  INFO 5484 --- [           main] junit.logTestName                        : Finished Test ctrMultipleLaunchWithArguments(org.springframework.cloud.dataflow.acceptance.test.ComposedTaskTests)
12-Dec-2019 00:18:49 2019-12-12 00:18:49.907  INFO 5484 --- [           main] junit.logTestName                        : Starting Test ctrMultipleLaunch(org.springframework.cloud.dataflow.acceptance.test.ComposedTaskTests)
12-Dec-2019 00:21:50 2019-12-12 00:21:50.374 ERROR 5484 --- [           main] junit.logTestName                        : !!! Test ctrMultipleLaunch(org.springframework.cloud.dataflow.acceptance.test.ComposedTaskTests) Failed !!!
12-Dec-2019 00:21:50
12-Dec-2019 00:21:50 java.lang.AssertionError: null
12-Dec-2019 00:21:50         at org.junit.Assert.fail(Assert.java:86)
12-Dec-2019 00:21:50         at org.junit.Assert.assertTrue(Assert.java:41)
12-Dec-2019 00:21:50         at org.junit.Assert.assertTrue(Assert.java:52)
12-Dec-2019 00:21:50         at org.springframework.cloud.dataflow.acceptance.test.ComposedTaskTests.assertTaskExecutions(ComposedTaskTests.java:65)
12-Dec-2019 00:21:50         at org.springframework.cloud.dataflow.acceptance.test.ComposedTaskTests.ctrMultipleLaunch(ComposedTaskTests.java:47)
12-Dec-2019 00:21:50         at sun.reflect.NativeMethodAccessorImpl.invoke0(Native Method)
12-Dec-2019 00:21:50         at sun.reflect.NativeMethodAccessorImpl.invoke(NativeMethodAccessorImpl.java:62)
12-Dec-2019 00:21:50         at sun.reflect.DelegatingMethodAccessorImpl.invoke(DelegatingMethodAccessorImpl.java:43)
12-Dec-2019 00:21:50         at java.lang.reflect.Method.invoke(Method.java:498)
12-Dec-2019 00:21:50         at org.junit.runners.model.FrameworkMethod$1.runReflectiveCall(FrameworkMethod.java:50)
12-Dec-2019 00:21:50         at org.junit.internal.runners.model.ReflectiveCallable.run(ReflectiveCallable.java:12)
12-Dec-2019 00:21:50         at org.junit.runners.model.FrameworkMethod.invokeExplosively(FrameworkMethod.java:47)
12-Dec-2019 00:21:50         at org.junit.internal.runners.statements.InvokeMethod.evaluate(InvokeMethod.java:17)
12-Dec-2019 00:21:50         at org.junit.internal.runners.statements.RunBefores.evaluate(RunBefores.java:26)
12-Dec-2019 00:21:50         at org.springframework.test.context.junit4.statements.RunBeforeTestMethodCallbacks.evaluate(RunBeforeTestMethodCallbacks.java:75)
12-Dec-2019 00:21:50         at org.junit.internal.runners.statements.RunAfters.evaluate(RunAfters.java:27)
12-Dec-2019 00:21:50         at org.springframework.test.context.junit4.statements.RunAfterTestMethodCallbacks.evaluate(RunAfterTestMethodCallbacks.java:86)
12-Dec-2019 00:21:50         at org.junit.rules.TestWatcher$1.evaluate(TestWatcher.java:55)
12-Dec-2019 00:21:50         at org.junit.rules.RunRules.evaluate(RunRules.java:20)
12-Dec-2019 00:21:50         at org.springframework.test.context.junit4.statements.SpringRepeat.evaluate(SpringRepeat.java:84)
12-Dec-2019 00:21:50         at org.junit.runners.ParentRunner.runLeaf(ParentRunner.java:325)
12-Dec-2019 00:21:50         at org.springframework.test.context.junit4.SpringJUnit4ClassRunner.runChild(SpringJUnit4ClassRunner.java:252)
12-Dec-2019 00:21:50         at org.springframework.test.context.junit4.SpringJUnit4ClassRunner.runChild(SpringJUnit4ClassRunner.java:94)
12-Dec-2019 00:21:50         at org.junit.runners.ParentRunner$3.run(ParentRunner.java:290)
12-Dec-2019 00:21:50         at org.junit.runners.ParentRunner$1.schedule(ParentRunner.java:71)
12-Dec-2019 00:21:50         at org.junit.runners.ParentRunner.runChildren(ParentRunner.java:288)
12-Dec-2019 00:21:50         at org.junit.runners.ParentRunner.access$000(ParentRunner.java:58)
12-Dec-2019 00:21:50         at org.junit.runners.ParentRunner$2.evaluate(ParentRunner.java:268)
12-Dec-2019 00:21:50         at org.springframework.test.context.junit4.statements.RunBeforeTestClassCallbacks.evaluate(RunBeforeTestClassCallbacks.java:61)
12-Dec-2019 00:21:50         at org.springframework.test.context.junit4.statements.RunAfterTestClassCallbacks.evaluate(RunAfterTestClassCallbacks.java:70)
12-Dec-2019 00:21:50         at org.junit.runners.ParentRunner.run(ParentRunner.java:363)
12-Dec-2019 00:21:50         at org.springframework.test.context.junit4.SpringJUnit4ClassRunner.run(SpringJUnit4ClassRunner.java:191)
12-Dec-2019 00:21:50         at org.apache.maven.surefire.junit4.JUnit4Provider.execute(JUnit4Provider.java:283)
12-Dec-2019 00:21:50         at org.apache.maven.surefire.junit4.JUnit4Provider.executeWithRerun(JUnit4Provider.java:173)
12-Dec-2019 00:21:50         at org.apache.maven.surefire.junit4.JUnit4Provider.executeTestSet(JUnit4Provider.java:153)
12-Dec-2019 00:21:50         at org.apache.maven.surefire.junit4.JUnit4Provider.invoke(JUnit4Provider.java:128)
12-Dec-2019 00:21:50         at org.apache.maven.surefire.booter.ForkedBooter.invokeProviderInSameClassLoader(ForkedBooter.java:203)
12-Dec-2019 00:21:50         at org.apache.maven.surefire.booter.ForkedBooter.runSuitesInProcess(ForkedBooter.java:155)
12-Dec-2019 00:21:50         at org.apache.maven.surefire.booter.ForkedBooter.main(ForkedBooter.java:103)
12-Dec-2019 00:21:50
12-Dec-2019 00:21:50 2019-12-12 00:21:50.375  INFO 5484 --- [           main] junit.logTestName                        : Finished Test ctrMultipleLaunch(org.springframework.cloud.dataflow.acceptance.test.ComposedTaskTests)
12-Dec-2019 00:21:50 2019-12-12 00:21:50.434  INFO 5484 --- [           main] junit.logTestName                        : Starting Test ctrLaunch(org.springframework.cloud.dataflow.acceptance.test.ComposedTaskTests)
12-Dec-2019 00:24:50 2019-12-12 00:24:50.928 ERROR 5484 --- [           main] junit.logTestName                        : !!! Test ctrLaunch(org.springframework.cloud.dataflow.acceptance.test.ComposedTaskTests) Failed !!!
12-Dec-2019 00:24:50
12-Dec-2019 00:24:50 java.lang.AssertionError: null
12-Dec-2019 00:24:50         at org.junit.Assert.fail(Assert.java:86)
12-Dec-2019 00:24:50         at org.junit.Assert.assertTrue(Assert.java:41)
12-Dec-2019 00:24:50         at org.junit.Assert.assertTrue(Assert.java:52)
12-Dec-2019 00:24:50         at org.springframework.cloud.dataflow.acceptance.test.ComposedTaskTests.assertTaskExecutions(ComposedTaskTests.java:65)
12-Dec-2019 00:24:50         at org.springframework.cloud.dataflow.acceptance.test.ComposedTaskTests.ctrLaunch(ComposedTaskTests.java:41)
12-Dec-2019 00:24:50         at sun.reflect.NativeMethodAccessorImpl.invoke0(Native Method)
12-Dec-2019 00:24:50         at sun.reflect.NativeMethodAccessorImpl.invoke(NativeMethodAccessorImpl.java:62)
12-Dec-2019 00:24:50         at sun.reflect.DelegatingMethodAccessorImpl.invoke(DelegatingMethodAccessorImpl.java:43)
12-Dec-2019 00:24:50         at java.lang.reflect.Method.invoke(Method.java:498)
12-Dec-2019 00:24:50         at org.junit.runners.model.FrameworkMethod$1.runReflectiveCall(FrameworkMethod.java:50)
12-Dec-2019 00:24:50         at org.junit.internal.runners.model.ReflectiveCallable.run(ReflectiveCallable.java:12)
12-Dec-2019 00:24:50         at org.junit.runners.model.FrameworkMethod.invokeExplosively(FrameworkMethod.java:47)
12-Dec-2019 00:24:50         at org.junit.internal.runners.statements.InvokeMethod.evaluate(InvokeMethod.java:17)
12-Dec-2019 00:24:50         at org.junit.internal.runners.statements.RunBefores.evaluate(RunBefores.java:26)
12-Dec-2019 00:24:50         at org.springframework.test.context.junit4.statements.RunBeforeTestMethodCallbacks.evaluate(RunBeforeTestMethodCallbacks.java:75)
12-Dec-2019 00:24:50         at org.junit.internal.runners.statements.RunAfters.evaluate(RunAfters.java:27)
12-Dec-2019 00:24:50         at org.springframework.test.context.junit4.statements.RunAfterTestMethodCallbacks.evaluate(RunAfterTestMethodCallbacks.java:86)
12-Dec-2019 00:24:50         at org.junit.rules.TestWatcher$1.evaluate(TestWatcher.java:55)
12-Dec-2019 00:24:50         at org.junit.rules.RunRules.evaluate(RunRules.java:20)
12-Dec-2019 00:24:50         at org.springframework.test.context.junit4.statements.SpringRepeat.evaluate(SpringRepeat.java:84)
12-Dec-2019 00:24:50         at org.junit.runners.ParentRunner.runLeaf(ParentRunner.java:325)
12-Dec-2019 00:24:50         at org.springframework.test.context.junit4.SpringJUnit4ClassRunner.runChild(SpringJUnit4ClassRunner.java:252)
12-Dec-2019 00:24:50         at org.springframework.test.context.junit4.SpringJUnit4ClassRunner.runChild(SpringJUnit4ClassRunner.java:94)
12-Dec-2019 00:24:50         at org.junit.runners.ParentRunner$3.run(ParentRunner.java:290)
12-Dec-2019 00:24:50         at org.junit.runners.ParentRunner$1.schedule(ParentRunner.java:71)
12-Dec-2019 00:24:50         at org.junit.runners.ParentRunner.runChildren(ParentRunner.java:288)
12-Dec-2019 00:24:50         at org.junit.runners.ParentRunner.access$000(ParentRunner.java:58)
12-Dec-2019 00:24:50         at org.junit.runners.ParentRunner$2.evaluate(ParentRunner.java:268)
12-Dec-2019 00:24:50         at org.springframework.test.context.junit4.statements.RunBeforeTestClassCallbacks.evaluate(RunBeforeTestClassCallbacks.java:61)
12-Dec-2019 00:24:50         at org.springframework.test.context.junit4.statements.RunAfterTestClassCallbacks.evaluate(RunAfterTestClassCallbacks.java:70)
12-Dec-2019 00:24:50         at org.junit.runners.ParentRunner.run(ParentRunner.java:363)
12-Dec-2019 00:24:50         at org.springframework.test.context.junit4.SpringJUnit4ClassRunner.run(SpringJUnit4ClassRunner.java:191)
12-Dec-2019 00:24:50         at org.apache.maven.surefire.junit4.JUnit4Provider.execute(JUnit4Provider.java:283)
12-Dec-2019 00:24:50         at org.apache.maven.surefire.junit4.JUnit4Provider.executeWithRerun(JUnit4Provider.java:173)
12-Dec-2019 00:24:50         at org.apache.maven.surefire.junit4.JUnit4Provider.executeTestSet(JUnit4Provider.java:153)
12-Dec-2019 00:24:50         at org.apache.maven.surefire.junit4.JUnit4Provider.invoke(JUnit4Provider.java:128)
12-Dec-2019 00:24:50         at org.apache.maven.surefire.booter.ForkedBooter.invokeProviderInSameClassLoader(ForkedBooter.java:203)
12-Dec-2019 00:24:50         at org.apache.maven.surefire.booter.ForkedBooter.runSuitesInProcess(ForkedBooter.java:155)
12-Dec-2019 00:24:50         at org.apache.maven.surefire.booter.ForkedBooter.main(ForkedBooter.java:103)
12-Dec-2019 00:24:50
12-Dec-2019 00:24:50 2019-12-12 00:24:50.929  INFO 5484 --- [           main] junit.logTestName                        : Finished Test ctrLaunch(org.springframework.cloud.dataflow.acceptance.test.ComposedTaskTests)
12-Dec-2019 00:24:50 Tests run: 3, Failures: 3, Errors: 0, Skipped: 0, Time elapsed: 547.707 sec <<< FAILURE! - in org.springframework.cloud.dataflow.acceptance.test.ComposedTaskTests
12-Dec-2019 00:24:50 ctrMultipleLaunchWithArguments(org.springframework.cloud.dataflow.acceptance.test.ComposedTaskTests)  Time elapsed: 186.554 sec  <<< FAILURE!
12-Dec-2019 00:24:50 java.lang.AssertionError: null
12-Dec-2019 00:24:50         at org.junit.Assert.fail(Assert.java:86)
12-Dec-2019 00:24:50         at org.junit.Assert.assertTrue(Assert.java:41)
12-Dec-2019 00:24:50         at org.junit.Assert.assertTrue(Assert.java:52)
12-Dec-2019 00:24:50         at org.springframework.cloud.dataflow.acceptance.test.ComposedTaskTests.assertTaskExecutions(ComposedTaskTests.java:65)
12-Dec-2019 00:24:50         at org.springframework.cloud.dataflow.acceptance.test.ComposedTaskTests.ctrMultipleLaunchWithArguments(ComposedTaskTests.java:57)
12-Dec-2019 00:24:50
12-Dec-2019 00:24:50 ctrMultipleLaunch(org.springframework.cloud.dataflow.acceptance.test.ComposedTaskTests)  Time elapsed: 180.468 sec  <<< FAILURE!
12-Dec-2019 00:24:50 java.lang.AssertionError: null
12-Dec-2019 00:24:50         at org.junit.Assert.fail(Assert.java:86)
12-Dec-2019 00:24:50         at org.junit.Assert.assertTrue(Assert.java:41)
12-Dec-2019 00:24:50         at org.junit.Assert.assertTrue(Assert.java:52)
12-Dec-2019 00:24:50         at org.springframework.cloud.dataflow.acceptance.test.ComposedTaskTests.assertTaskExecutions(ComposedTaskTests.java:65)
12-Dec-2019 00:24:50         at org.springframework.cloud.dataflow.acceptance.test.ComposedTaskTests.ctrMultipleLaunch(ComposedTaskTests.java:47)
12-Dec-2019 00:24:50
12-Dec-2019 00:24:50 ctrLaunch(org.springframework.cloud.dataflow.acceptance.test.ComposedTaskTests)  Time elapsed: 180.495 sec  <<< FAILURE!
12-Dec-2019 00:24:50 java.lang.AssertionError: null
12-Dec-2019 00:24:50         at org.junit.Assert.fail(Assert.java:86)
12-Dec-2019 00:24:50         at org.junit.Assert.assertTrue(Assert.java:41)
12-Dec-2019 00:24:50         at org.junit.Assert.assertTrue(Assert.java:52)
12-Dec-2019 00:24:50         at org.springframework.cloud.dataflow.acceptance.test.ComposedTaskTests.assertTaskExecutions(ComposedTaskTests.java:65)
12-Dec-2019 00:24:50         at org.springframework.cloud.dataflow.acceptance.test.ComposedTaskTests.ctrLaunch(ComposedTaskTests.java:41)
12-Dec-2019 00:24:50
12-Dec-2019 00:24:50 Running org.springframework.cloud.dataflow.acceptance.test.TransformTests
12-Dec-2019 00:24:50 2019-12-12 00:24:50.931  INFO 5484 --- [           main] .b.t.c.SpringBootTestContextBootstrapper : Neither @ContextConfiguration nor @ContextHierarchy found for test class [org.springframework.cloud.dataflow.acceptance.test.TransformTests], using SpringBootContextLoader
12-Dec-2019 00:24:50 2019-12-12 00:24:50.937  INFO 5484 --- [           main] .b.t.c.SpringBootTestContextBootstrapper : Loaded default TestExecutionListener class names from location [META-INF/spring.factories]: [org.springframework.boot.test.mock.mockito.MockitoTestExecutionListener, org.springframework.boot.test.mock.mockito.ResetMocksTestExecutionListener, org.springframework.boot.test.autoconfigure.restdocs.RestDocsTestExecutionListener, org.springframework.boot.test.autoconfigure.web.client.MockRestServiceServerResetTestExecutionListener, org.springframework.boot.test.autoconfigure.web.servlet.MockMvcPrintOnlyOnFailureTestExecutionListener, org.springframework.boot.test.autoconfigure.web.servlet.WebDriverTestExecutionListener, org.springframework.test.context.web.ServletTestExecutionListener, org.springframework.test.context.support.DirtiesContextBeforeModesTestExecutionListener, org.springframework.test.context.support.DependencyInjectionTestExecutionListener, org.springframework.test.context.support.DirtiesContextTestExecutionListener, org.springframework.test.context.transaction.TransactionalTestExecutionListener, org.springframework.test.context.jdbc.SqlScriptsTestExecutionListener]
12-Dec-2019 00:24:50 2019-12-12 00:24:50.941  INFO 5484 --- [           main] .b.t.c.SpringBootTestContextBootstrapper : Using TestExecutionListeners: [org.springframework.test.context.web.ServletTestExecutionListener@3a790e40, org.springframework.test.context.support.DirtiesContextBeforeModesTestExecutionListener@43acd79e, org.springframework.boot.test.autoconfigure.SpringBootDependencyInjectionTestExecutionListener@1e1b061, org.springframework.test.context.support.DirtiesContextTestExecutionListener@38f77cd9, org.springframework.test.context.transaction.TransactionalTestExecutionListener@4a8e6e89, org.springframework.test.context.jdbc.SqlScriptsTestExecutionListener@6fbb4061, org.springframework.boot.test.mock.mockito.MockitoTestExecutionListener@63d5874f, org.springframework.boot.test.autoconfigure.web.servlet.MockMvcPrintOnlyOnFailureTestExecutionListener@60c73e58, org.springframework.boot.test.autoconfigure.web.client.MockRestServiceServerResetTestExecutionListener@5984feef, org.springframework.boot.test.mock.mockito.ResetMocksTestExecutionListener@6c0905f6, org.springframework.boot.test.autoconfigure.web.servlet.WebDriverTestExecutionListener@23a918c7, org.springframework.boot.test.autoconfigure.restdocs.RestDocsTestExecutionListener@7a45d714]
12-Dec-2019 00:24:51 2019-12-12 00:24:51.019  INFO 5484 --- [           main] junit.logTestName                        : Starting Test transformTests(org.springframework.cloud.dataflow.acceptance.test.TransformTests)
12-Dec-2019 00:24:51 2019-12-12 00:24:51.021  INFO 5484 --- [           main] o.s.c.d.acceptance.test.TransformTests   : Creating stream 'TRANSFORM-TEST'
12-Dec-2019 00:24:51 2019-12-12 00:24:51.052  INFO 5484 --- [           main] o.s.c.d.acceptance.test.TransformTests   : Deploying stream 'TRANSFORM-TEST' with properties: {app.*.spring.cloud.streamapp.security.enabled=false, app.*.logging.file=${PID}-test.log, app.*.endpoints.logfile.sensitive=false, app.*.management.endpoints.web.exposure.include=*}
12-Dec-2019 00:24:51 2019-12-12 00:24:51.891  INFO 5484 --- [           main] o.s.c.d.acceptance.test.TransformTests   : Checking: Stream=TRANSFORM-TEST, status = deploying, status description = The stream is being deployed.
12-Dec-2019 00:24:51 2019-12-12 00:24:51.891  INFO 5484 --- [           main] o.s.c.d.acceptance.test.TransformTests   : Sleeping to check status of Stream=TRANSFORM-TEST
12-Dec-2019 00:25:01 2019-12-12 00:25:01.933  INFO 5484 --- [           main] o.s.c.d.acceptance.test.TransformTests   : Checking: Stream=TRANSFORM-TEST, status = deploying, status description = The stream is being deployed.
12-Dec-2019 00:25:01 2019-12-12 00:25:01.933  INFO 5484 --- [           main] o.s.c.d.acceptance.test.TransformTests   : Sleeping to check status of Stream=TRANSFORM-TEST
12-Dec-2019 00:25:11 2019-12-12 00:25:11.958  INFO 5484 --- [           main] o.s.c.d.acceptance.test.TransformTests   : Checking: Stream=TRANSFORM-TEST, status = deployed, status description = The stream has been successfully deployed
12-Dec-2019 00:25:11 2019-12-12 00:25:11.991  INFO 5484 --- [           main] o.s.c.d.acceptance.test.TransformTests   : Sleeping to check status of Stream=TRANSFORM-TEST
12-Dec-2019 00:25:21 2019-12-12 00:25:21.994  INFO 5484 --- [           main] o.s.c.d.acceptance.test.TransformTests   : Stream 'TRANSFORM-TEST' started with status: deployed
12-Dec-2019 00:25:21 2019-12-12 00:25:21.994  INFO 5484 --- [           main] o.s.c.d.acceptance.test.TransformTests   : App 'transform' has instances: {TRANSFORM-TEST.transform-v1-0=http://10.194.6.131:52063}
12-Dec-2019 00:25:21 2019-12-12 00:25:21.994  INFO 5484 --- [           main] o.s.c.d.acceptance.test.TransformTests   : App 'log' has instances: {TRANSFORM-TEST.log-v1-0=http://10.194.6.131:22649}
12-Dec-2019 00:25:21 2019-12-12 00:25:21.994  INFO 5484 --- [           main] o.s.c.d.acceptance.test.TransformTests   : App 'http' has instances: {TRANSFORM-TEST.http-v1-0=http://10.194.6.131:26383}
12-Dec-2019 00:25:21 2019-12-12 00:25:21.994  INFO 5484 --- [           main] o.s.c.d.acceptance.test.TransformTests   : Looking for 'Started HttpSource' in logfile for http
12-Dec-2019 00:25:31 2019-12-12 00:25:31.994  INFO 5484 --- [           main] o.s.c.d.acceptance.test.TransformTests   : Requesting log for app TRANSFORM-TEST.http-v1-0
12-Dec-2019 00:25:32 2019-12-12 00:25:32.260  INFO 5484 --- [           main] o.s.c.d.acceptance.test.TransformTests   : Retrieved logfile from 'http://10.194.6.131:26383/actuator/logfile
12-Dec-2019 00:25:32 2019-12-12 00:25:32.260  INFO 5484 --- [           main] o.s.c.d.acceptance.test.TransformTests   : Matched all 'Started HttpSource' in logfile for app http (source TRANSFORM-TEST.http-v1-0)
12-Dec-2019 00:25:32 2019-12-12 00:25:32.389  INFO 5484 --- [           main] o.s.c.d.acceptance.test.TransformTests   : Looking for 'Started LogSink' in logfile for log
12-Dec-2019 00:25:42 2019-12-12 00:25:42.389  INFO 5484 --- [           main] o.s.c.d.acceptance.test.TransformTests   : Requesting log for app TRANSFORM-TEST.log-v1-0
12-Dec-2019 00:25:42 2019-12-12 00:25:42.511  INFO 5484 --- [           main] o.s.c.d.acceptance.test.TransformTests   : Retrieved logfile from 'http://10.194.6.131:22649/actuator/logfile
12-Dec-2019 00:25:42 2019-12-12 00:25:42.511  INFO 5484 --- [           main] o.s.c.d.acceptance.test.TransformTests   : Matched all 'Started LogSink' in logfile for app log (source TRANSFORM-TEST.log-v1-0)
12-Dec-2019 00:25:42 2019-12-12 00:25:42.511  INFO 5484 --- [           main] o.s.c.d.acceptance.test.TransformTests   : Looking for 'ABCDEFG' in logfile for log
12-Dec-2019 00:25:52 2019-12-12 00:25:52.511  INFO 5484 --- [           main] o.s.c.d.acceptance.test.TransformTests   : Requesting log for app TRANSFORM-TEST.log-v1-0
12-Dec-2019 00:25:52 2019-12-12 00:25:52.522  INFO 5484 --- [           main] o.s.c.d.acceptance.test.TransformTests   : Retrieved logfile from 'http://10.194.6.131:22649/actuator/logfile
12-Dec-2019 00:25:52 2019-12-12 00:25:52.522  INFO 5484 --- [           main] o.s.c.d.acceptance.test.TransformTests   : Matched all 'ABCDEFG' in logfile for app log (source TRANSFORM-TEST.log-v1-0)
12-Dec-2019 00:25:52 2019-12-12 00:25:52.524  INFO 5484 --- [           main] junit.logTestName                        : Test transformTests(org.springframework.cloud.dataflow.acceptance.test.TransformTests) Succeeded
12-Dec-2019 00:25:52 2019-12-12 00:25:52.524  INFO 5484 --- [           main] junit.logTestName                        : Finished Test transformTests(org.springframework.cloud.dataflow.acceptance.test.TransformTests)
12-Dec-2019 00:25:52 2019-12-12 00:25:52.524  INFO 5484 --- [           main] o.s.c.d.acceptance.test.TransformTests   : Destroy all streams
12-Dec-2019 00:25:52 Tests run: 1, Failures: 0, Errors: 0, Skipped: 0, Time elapsed: 61.901 sec - in org.springframework.cloud.dataflow.acceptance.test.TransformTests
12-Dec-2019 00:25:52 Running org.springframework.cloud.dataflow.acceptance.test.SchedulerTests
12-Dec-2019 00:25:52 2019-12-12 00:25:52.969  INFO 5484 --- [           main] s.c.a.AnnotationConfigApplicationContext : Refreshing org.springframework.context.annotation.AnnotationConfigApplicationContext@45adc393: startup date [Thu Dec 12 00:25:52 UTC 2019]; root of context hierarchy
12-Dec-2019 00:25:53 2019-12-12 00:25:53.001  INFO 5484 --- [           main] trationDelegate$BeanPostProcessorChecker : Bean 'configurationPropertiesRebinderAutoConfiguration' of type [class org.springframework.cloud.autoconfigure.ConfigurationPropertiesRebinderAutoConfiguration$$EnhancerBySpringCGLIB$$219d8b3d] is not eligible for getting processed by all BeanPostProcessors (for example: not eligible for auto-proxying)
12-Dec-2019 00:25:53
12-Dec-2019 00:25:53   .   ____          _            __ _ _
12-Dec-2019 00:25:53 /\\ / ___'_ __ _ _(_)_ __  __ _ \ \ \ \
12-Dec-2019 00:25:53 ( ( )\___ | '_ | '_| | '_ \/ _` | \ \ \ \
12-Dec-2019 00:25:53 \\/  ___)| |_)| | | | | || (_| |  ) ) ) )
12-Dec-2019 00:25:53   '  |____| .__|_| |_|_| |_\__, | / / / /
12-Dec-2019 00:25:53 =========|_|==============|___/=/_/_/_/
12-Dec-2019 00:25:53 :: Spring Boot ::        (v1.4.1.RELEASE)
12-Dec-2019 00:25:53
12-Dec-2019 00:25:53 2019-12-12 00:25:53.097  INFO 5484 --- [           main] c.c.c.ConfigServicePropertySourceLocator : Fetching config from server at: http://localhost:8888
12-Dec-2019 00:25:53 2019-12-12 00:25:53.099  WARN 5484 --- [           main] c.c.c.ConfigServicePropertySourceLocator : Could not locate PropertySource: I/O error on GET request for "http://localhost:8888//blah": Connection refused (Connection refused); nested exception is java.net.ConnectException: Connection refused (Connection refused)
12-Dec-2019 00:25:53 2019-12-12 00:25:53.100  INFO 5484 --- [           main] o.a.maven.surefire.booter.ForkedBooter   : The following profiles are active: blah
12-Dec-2019 00:25:53 2019-12-12 00:25:53.102  INFO 5484 --- [           main] s.c.a.AnnotationConfigApplicationContext : Refreshing org.springframework.context.annotation.AnnotationConfigApplicationContext@71cea1b8: startup date [Thu Dec 12 00:25:53 UTC 2019]; parent: org.springframework.context.annotation.AnnotationConfigApplicationContext@45adc393
12-Dec-2019 00:25:53 2019-12-12 00:25:53.193  INFO 5484 --- [           main] o.a.maven.surefire.booter.ForkedBooter   : Started ForkedBooter in 0.326 seconds (JVM running for 1002.031)
12-Dec-2019 00:25:53 2019-12-12 00:25:53.194  INFO 5484 --- [           main] s.c.a.AnnotationConfigApplicationContext : Closing org.springframework.context.annotation.AnnotationConfigApplicationContext@71cea1b8: startup date [Thu Dec 12 00:25:53 UTC 2019]; parent: org.springframework.context.annotation.AnnotationConfigApplicationContext@45adc393
12-Dec-2019 00:25:53 2019-12-12 00:25:53.194 ERROR 5484 --- [           main] o.s.c.d.a.test.util.SchedulerRule        : SCHEDULER IS NOT AVAILABLE, SKIPPING TESTS
12-Dec-2019 00:25:53
12-Dec-2019 00:25:53 java.lang.IllegalArgumentException: no SchedulerOperations bean is available.  Skipping test.
12-Dec-2019 00:25:53         at org.springframework.util.Assert.notNull(Assert.java:115)
12-Dec-2019 00:25:53         at org.springframework.cloud.dataflow.acceptance.test.util.SchedulerRule.obtainResource(SchedulerRule.java:57)
12-Dec-2019 00:25:53         at org.springframework.cloud.scheduler.spi.junit.AbstractExternalResourceTestSupport.apply(AbstractExternalResourceTestSupport.java:58)
12-Dec-2019 00:25:53         at org.junit.rules.RunRules.applyAll(RunRules.java:26)
12-Dec-2019 00:25:53         at org.junit.rules.RunRules.<init>(RunRules.java:15)
12-Dec-2019 00:25:53         at org.junit.runners.ParentRunner.withClassRules(ParentRunner.java:245)
12-Dec-2019 00:25:53         at org.junit.runners.ParentRunner.classBlock(ParentRunner.java:194)
12-Dec-2019 00:25:53         at org.junit.runners.ParentRunner.run(ParentRunner.java:362)
12-Dec-2019 00:25:53         at org.springframework.test.context.junit4.SpringJUnit4ClassRunner.run(SpringJUnit4ClassRunner.java:191)
12-Dec-2019 00:25:53         at org.apache.maven.surefire.junit4.JUnit4Provider.execute(JUnit4Provider.java:283)
12-Dec-2019 00:25:53         at org.apache.maven.surefire.junit4.JUnit4Provider.executeWithRerun(JUnit4Provider.java:173)
12-Dec-2019 00:25:53         at org.apache.maven.surefire.junit4.JUnit4Provider.executeTestSet(JUnit4Provider.java:153)
12-Dec-2019 00:25:53         at org.apache.maven.surefire.junit4.JUnit4Provider.invoke(JUnit4Provider.java:128)
12-Dec-2019 00:25:53         at org.apache.maven.surefire.booter.ForkedBooter.invokeProviderInSameClassLoader(ForkedBooter.java:203)
12-Dec-2019 00:25:53         at org.apache.maven.surefire.booter.ForkedBooter.runSuitesInProcess(ForkedBooter.java:155)
12-Dec-2019 00:25:53         at org.apache.maven.surefire.booter.ForkedBooter.main(ForkedBooter.java:103)
12-Dec-2019 00:25:53
12-Dec-2019 00:25:53 Tests run: 1, Failures: 0, Errors: 0, Skipped: 1, Time elapsed: 0.347 sec - in org.springframework.cloud.dataflow.acceptance.test.SchedulerTests
12-Dec-2019 00:25:53 Running org.springframework.cloud.dataflow.acceptance.test.NamedChannelTests
12-Dec-2019 00:25:53 2019-12-12 00:25:53.195  INFO 5484 --- [           main] .b.t.c.SpringBootTestContextBootstrapper : Neither @ContextConfiguration nor @ContextHierarchy found for test class [org.springframework.cloud.dataflow.acceptance.test.NamedChannelTests], using SpringBootContextLoader
12-Dec-2019 00:25:53 2019-12-12 00:25:53.208  INFO 5484 --- [           main] .b.t.c.SpringBootTestContextBootstrapper : Loaded default TestExecutionListener class names from location [META-INF/spring.factories]: [org.springframework.boot.test.mock.mockito.MockitoTestExecutionListener, org.springframework.boot.test.mock.mockito.ResetMocksTestExecutionListener, org.springframework.boot.test.autoconfigure.restdocs.RestDocsTestExecutionListener, org.springframework.boot.test.autoconfigure.web.client.MockRestServiceServerResetTestExecutionListener, org.springframework.boot.test.autoconfigure.web.servlet.MockMvcPrintOnlyOnFailureTestExecutionListener, org.springframework.boot.test.autoconfigure.web.servlet.WebDriverTestExecutionListener, org.springframework.test.context.web.ServletTestExecutionListener, org.springframework.test.context.support.DirtiesContextBeforeModesTestExecutionListener, org.springframework.test.context.support.DependencyInjectionTestExecutionListener, org.springframework.test.context.support.DirtiesContextTestExecutionListener, org.springframework.test.context.transaction.TransactionalTestExecutionListener, org.springframework.test.context.jdbc.SqlScriptsTestExecutionListener]
12-Dec-2019 00:25:53 2019-12-12 00:25:53.211  INFO 5484 --- [           main] .b.t.c.SpringBootTestContextBootstrapper : Using TestExecutionListeners: [org.springframework.test.context.web.ServletTestExecutionListener@54b2fc58, org.springframework.test.context.support.DirtiesContextBeforeModesTestExecutionListener@daf22f0, org.springframework.boot.test.autoconfigure.SpringBootDependencyInjectionTestExecutionListener@6cbbb9c4, org.springframework.test.context.support.DirtiesContextTestExecutionListener@63f9b562, org.springframework.test.context.transaction.TransactionalTestExecutionListener@20ead579, org.springframework.test.context.jdbc.SqlScriptsTestExecutionListener@5426cb36, org.springframework.boot.test.mock.mockito.MockitoTestExecutionListener@65e22def, org.springframework.boot.test.autoconfigure.web.servlet.MockMvcPrintOnlyOnFailureTestExecutionListener@4b1ec694, org.springframework.boot.test.autoconfigure.web.client.MockRestServiceServerResetTestExecutionListener@3d299393, org.springframework.boot.test.mock.mockito.ResetMocksTestExecutionListener@5f34907b, org.springframework.boot.test.autoconfigure.web.servlet.WebDriverTestExecutionListener@2b4d4327, org.springframework.boot.test.autoconfigure.restdocs.RestDocsTestExecutionListener@16da1abc]
12-Dec-2019 00:25:53 2019-12-12 00:25:53.268  INFO 5484 --- [           main] junit.logTestName                        : Starting Test testDestination(org.springframework.cloud.dataflow.acceptance.test.NamedChannelTests)
12-Dec-2019 00:25:53 2019-12-12 00:25:53.270  INFO 5484 --- [           main] o.s.c.d.a.test.NamedChannelTests         : Creating stream 'LOG-DESTINATION-SINK'
12-Dec-2019 00:25:53 2019-12-12 00:25:53.297  INFO 5484 --- [           main] o.s.c.d.a.test.NamedChannelTests         : Deploying stream 'LOG-DESTINATION-SINK' with properties: {app.*.spring.cloud.streamapp.security.enabled=false, app.*.logging.file=${PID}-test.log, app.*.endpoints.logfile.sensitive=false, app.*.management.endpoints.web.exposure.include=*}
12-Dec-2019 00:25:53 2019-12-12 00:25:53.728  INFO 5484 --- [           main] o.s.c.d.a.test.NamedChannelTests         : Checking: Stream=LOG-DESTINATION-SINK, status = deploying, status description = The stream is being deployed.
12-Dec-2019 00:25:53 2019-12-12 00:25:53.728  INFO 5484 --- [           main] o.s.c.d.a.test.NamedChannelTests         : Sleeping to check status of Stream=LOG-DESTINATION-SINK
12-Dec-2019 00:26:03 2019-12-12 00:26:03.752  INFO 5484 --- [           main] o.s.c.d.a.test.NamedChannelTests         : Checking: Stream=LOG-DESTINATION-SINK, status = deployed, status description = The stream has been successfully deployed
12-Dec-2019 00:26:03 2019-12-12 00:26:03.781  INFO 5484 --- [           main] o.s.c.d.a.test.NamedChannelTests         : Sleeping to check status of Stream=LOG-DESTINATION-SINK
12-Dec-2019 00:26:13 2019-12-12 00:26:13.782  INFO 5484 --- [           main] o.s.c.d.a.test.NamedChannelTests         : Stream 'LOG-DESTINATION-SINK' started with status: deployed
12-Dec-2019 00:26:13 2019-12-12 00:26:13.782  INFO 5484 --- [           main] o.s.c.d.a.test.NamedChannelTests         : App 'log' has instances: {LOG-DESTINATION-SINK.log-v1-0=http://10.194.6.131:39883}
12-Dec-2019 00:26:13 2019-12-12 00:26:13.782  INFO 5484 --- [           main] o.s.c.d.a.test.NamedChannelTests         : Looking for 'Started LogSink' in logfile for log
12-Dec-2019 00:26:23 2019-12-12 00:26:23.782  INFO 5484 --- [           main] o.s.c.d.a.test.NamedChannelTests         : Requesting log for app LOG-DESTINATION-SINK.log-v1-0
12-Dec-2019 00:26:24 2019-12-12 00:26:24.084  INFO 5484 --- [           main] o.s.c.d.a.test.NamedChannelTests         : Retrieved logfile from 'http://10.194.6.131:39883/actuator/logfile
12-Dec-2019 00:26:24 2019-12-12 00:26:24.084  INFO 5484 --- [           main] o.s.c.d.a.test.NamedChannelTests         : Matched all 'Started LogSink' in logfile for app log (source LOG-DESTINATION-SINK.log-v1-0)
12-Dec-2019 00:26:24 2019-12-12 00:26:24.085  INFO 5484 --- [           main] o.s.c.d.a.test.NamedChannelTests         : Creating stream 'HTTP-DESTINATION-SOURCE'
12-Dec-2019 00:26:24 2019-12-12 00:26:24.127  INFO 5484 --- [           main] o.s.c.d.a.test.NamedChannelTests         : Deploying stream 'HTTP-DESTINATION-SOURCE' with properties: {app.*.spring.cloud.streamapp.security.enabled=false, app.*.logging.file=${PID}-test.log, app.*.endpoints.logfile.sensitive=false, app.*.management.endpoints.web.exposure.include=*}
12-Dec-2019 00:26:24 2019-12-12 00:26:24.569  INFO 5484 --- [           main] o.s.c.d.a.test.NamedChannelTests         : Checking: Stream=HTTP-DESTINATION-SOURCE, status = deploying, status description = The stream is being deployed.
12-Dec-2019 00:26:24 2019-12-12 00:26:24.570  INFO 5484 --- [           main] o.s.c.d.a.test.NamedChannelTests         : Sleeping to check status of Stream=HTTP-DESTINATION-SOURCE
12-Dec-2019 00:26:34 2019-12-12 00:26:34.615  INFO 5484 --- [           main] o.s.c.d.a.test.NamedChannelTests         : Checking: Stream=HTTP-DESTINATION-SOURCE, status = deployed, status description = The stream has been successfully deployed
12-Dec-2019 00:26:34 2019-12-12 00:26:34.640  INFO 5484 --- [           main] o.s.c.d.a.test.NamedChannelTests         : Sleeping to check status of Stream=HTTP-DESTINATION-SOURCE
12-Dec-2019 00:26:44 2019-12-12 00:26:44.643  INFO 5484 --- [           main] o.s.c.d.a.test.NamedChannelTests         : Stream 'HTTP-DESTINATION-SOURCE' started with status: deployed
12-Dec-2019 00:26:44 2019-12-12 00:26:44.643  INFO 5484 --- [           main] o.s.c.d.a.test.NamedChannelTests         : App 'http' has instances: {HTTP-DESTINATION-SOURCE.http-v1-0=http://10.194.6.131:43195}
12-Dec-2019 00:26:44 2019-12-12 00:26:44.643  INFO 5484 --- [           main] o.s.c.d.a.test.NamedChannelTests         : Looking for 'Started HttpSource' in logfile for http
12-Dec-2019 00:26:54 2019-12-12 00:26:54.643  INFO 5484 --- [           main] o.s.c.d.a.test.NamedChannelTests         : Requesting log for app HTTP-DESTINATION-SOURCE.http-v1-0
12-Dec-2019 00:26:54 2019-12-12 00:26:54.920  INFO 5484 --- [           main] o.s.c.d.a.test.NamedChannelTests         : Retrieved logfile from 'http://10.194.6.131:43195/actuator/logfile
12-Dec-2019 00:26:54 2019-12-12 00:26:54.920  INFO 5484 --- [           main] o.s.c.d.a.test.NamedChannelTests         : Matched all 'Started HttpSource' in logfile for app http (source HTTP-DESTINATION-SOURCE.http-v1-0)
12-Dec-2019 00:26:55 2019-12-12 00:26:55.056  INFO 5484 --- [           main] o.s.c.d.a.test.NamedChannelTests         : Looking for 'abcdefg' in logfile for log
12-Dec-2019 00:27:05 2019-12-12 00:27:05.056  INFO 5484 --- [           main] o.s.c.d.a.test.NamedChannelTests         : Requesting log for app LOG-DESTINATION-SINK.log-v1-0
12-Dec-2019 00:27:05 2019-12-12 00:27:05.066  INFO 5484 --- [           main] o.s.c.d.a.test.NamedChannelTests         : Retrieved logfile from 'http://10.194.6.131:39883/actuator/logfile
12-Dec-2019 00:27:05 2019-12-12 00:27:05.066  INFO 5484 --- [           main] o.s.c.d.a.test.NamedChannelTests         : Matched all 'abcdefg' in logfile for app log (source LOG-DESTINATION-SINK.log-v1-0)
12-Dec-2019 00:27:05 2019-12-12 00:27:05.067  INFO 5484 --- [           main] junit.logTestName                        : Test testDestination(org.springframework.cloud.dataflow.acceptance.test.NamedChannelTests) Succeeded
12-Dec-2019 00:27:05 2019-12-12 00:27:05.067  INFO 5484 --- [           main] junit.logTestName                        : Finished Test testDestination(org.springframework.cloud.dataflow.acceptance.test.NamedChannelTests)
12-Dec-2019 00:27:05 2019-12-12 00:27:05.067  INFO 5484 --- [           main] o.s.c.d.a.test.NamedChannelTests         : Destroy all streams
12-Dec-2019 00:27:05 2019-12-12 00:27:05.393  INFO 5484 --- [           main] junit.logTestName                        : Starting Test testTap(org.springframework.cloud.dataflow.acceptance.test.NamedChannelTests)
12-Dec-2019 00:27:05 2019-12-12 00:27:05.397  INFO 5484 --- [           main] o.s.c.d.a.test.NamedChannelTests         : Creating stream 'TAPHTTP'
12-Dec-2019 00:27:05 2019-12-12 00:27:05.426  INFO 5484 --- [           main] o.s.c.d.a.test.NamedChannelTests         : Deploying stream 'TAPHTTP' with properties: {app.*.spring.cloud.streamapp.security.enabled=false, app.*.logging.file=${PID}-test.log, app.*.endpoints.logfile.sensitive=false, app.*.management.endpoints.web.exposure.include=*}
12-Dec-2019 00:27:05 2019-12-12 00:27:05.941  INFO 5484 --- [           main] o.s.c.d.a.test.NamedChannelTests         : Checking: Stream=TAPHTTP, status = deploying, status description = The stream is being deployed.
12-Dec-2019 00:27:05 2019-12-12 00:27:05.941  INFO 5484 --- [           main] o.s.c.d.a.test.NamedChannelTests         : Sleeping to check status of Stream=TAPHTTP
12-Dec-2019 00:27:15 2019-12-12 00:27:15.978  INFO 5484 --- [           main] o.s.c.d.a.test.NamedChannelTests         : Checking: Stream=TAPHTTP, status = deploying, status description = The stream is being deployed.
12-Dec-2019 00:27:15 2019-12-12 00:27:15.978  INFO 5484 --- [           main] o.s.c.d.a.test.NamedChannelTests         : Sleeping to check status of Stream=TAPHTTP
12-Dec-2019 00:27:26 2019-12-12 00:27:26.007  INFO 5484 --- [           main] o.s.c.d.a.test.NamedChannelTests         : Checking: Stream=TAPHTTP, status = deployed, status description = The stream has been successfully deployed
12-Dec-2019 00:27:26 2019-12-12 00:27:26.031  INFO 5484 --- [           main] o.s.c.d.a.test.NamedChannelTests         : Sleeping to check status of Stream=TAPHTTP
12-Dec-2019 00:27:36 2019-12-12 00:27:36.031  INFO 5484 --- [           main] o.s.c.d.a.test.NamedChannelTests         : Stream 'TAPHTTP' started with status: deployed
12-Dec-2019 00:27:36 2019-12-12 00:27:36.032  INFO 5484 --- [           main] o.s.c.d.a.test.NamedChannelTests         : App 'log' has instances: {TAPHTTP.log-v1-0=http://10.194.6.131:20198}
12-Dec-2019 00:27:36 2019-12-12 00:27:36.032  INFO 5484 --- [           main] o.s.c.d.a.test.NamedChannelTests         : App 'http' has instances: {TAPHTTP.http-v1-0=http://10.194.6.131:47564}
12-Dec-2019 00:27:36 2019-12-12 00:27:36.032  INFO 5484 --- [           main] o.s.c.d.a.test.NamedChannelTests         : Looking for 'Started HttpSource' in logfile for http
12-Dec-2019 00:27:46 2019-12-12 00:27:46.032  INFO 5484 --- [           main] o.s.c.d.a.test.NamedChannelTests         : Requesting log for app TAPHTTP.http-v1-0
12-Dec-2019 00:27:46 2019-12-12 00:27:46.315  INFO 5484 --- [           main] o.s.c.d.a.test.NamedChannelTests         : Retrieved logfile from 'http://10.194.6.131:47564/actuator/logfile
12-Dec-2019 00:27:46 2019-12-12 00:27:46.316  INFO 5484 --- [           main] o.s.c.d.a.test.NamedChannelTests         : Matched all 'Started HttpSource' in logfile for app http (source TAPHTTP.http-v1-0)
12-Dec-2019 00:27:46 2019-12-12 00:27:46.316  INFO 5484 --- [           main] o.s.c.d.a.test.NamedChannelTests         : Looking for 'Started LogSink' in logfile for log
12-Dec-2019 00:27:56 2019-12-12 00:27:56.316  INFO 5484 --- [           main] o.s.c.d.a.test.NamedChannelTests         : Requesting log for app TAPHTTP.log-v1-0
12-Dec-2019 00:27:56 2019-12-12 00:27:56.449  INFO 5484 --- [           main] o.s.c.d.a.test.NamedChannelTests         : Retrieved logfile from 'http://10.194.6.131:20198/actuator/logfile
12-Dec-2019 00:27:56 2019-12-12 00:27:56.449  INFO 5484 --- [           main] o.s.c.d.a.test.NamedChannelTests         : Matched all 'Started LogSink' in logfile for app log (source TAPHTTP.log-v1-0)
12-Dec-2019 00:27:56 2019-12-12 00:27:56.449  INFO 5484 --- [           main] o.s.c.d.a.test.NamedChannelTests         : Creating stream 'TAPSTREAM'
12-Dec-2019 00:27:56 2019-12-12 00:27:56.476  INFO 5484 --- [           main] o.s.c.d.a.test.NamedChannelTests         : Deploying stream 'TAPSTREAM' with properties: {app.*.spring.cloud.streamapp.security.enabled=false, app.*.logging.file=${PID}-test.log, app.*.endpoints.logfile.sensitive=false, app.*.management.endpoints.web.exposure.include=*}
12-Dec-2019 00:27:56 2019-12-12 00:27:56.902  INFO 5484 --- [           main] o.s.c.d.a.test.NamedChannelTests         : Checking: Stream=TAPSTREAM, status = deploying, status description = The stream is being deployed.
12-Dec-2019 00:27:56 2019-12-12 00:27:56.902  INFO 5484 --- [           main] o.s.c.d.a.test.NamedChannelTests         : Sleeping to check status of Stream=TAPSTREAM
12-Dec-2019 00:28:06 2019-12-12 00:28:06.954  INFO 5484 --- [           main] o.s.c.d.a.test.NamedChannelTests         : Checking: Stream=TAPSTREAM, status = deployed, status description = The stream has been successfully deployed
12-Dec-2019 00:28:07 2019-12-12 00:28:07.000  INFO 5484 --- [           main] o.s.c.d.a.test.NamedChannelTests         : Sleeping to check status of Stream=TAPSTREAM
12-Dec-2019 00:28:17 2019-12-12 00:28:17.000  INFO 5484 --- [           main] o.s.c.d.a.test.NamedChannelTests         : Stream 'TAPSTREAM' started with status: deployed
12-Dec-2019 00:28:17 2019-12-12 00:28:17.001  INFO 5484 --- [           main] o.s.c.d.a.test.NamedChannelTests         : App 'log' has instances: {TAPSTREAM.log-v1-0=http://10.194.6.131:47390}
12-Dec-2019 00:28:17 2019-12-12 00:28:17.001  INFO 5484 --- [           main] o.s.c.d.a.test.NamedChannelTests         : Looking for 'Started LogSink' in logfile for log
12-Dec-2019 00:28:27 2019-12-12 00:28:27.001  INFO 5484 --- [           main] o.s.c.d.a.test.NamedChannelTests         : Requesting log for app TAPSTREAM.log-v1-0
12-Dec-2019 00:28:27 2019-12-12 00:28:27.276  INFO 5484 --- [           main] o.s.c.d.a.test.NamedChannelTests         : Retrieved logfile from 'http://10.194.6.131:47390/actuator/logfile
12-Dec-2019 00:28:27 2019-12-12 00:28:27.276  INFO 5484 --- [           main] o.s.c.d.a.test.NamedChannelTests         : Matched all 'Started LogSink' in logfile for app log (source TAPSTREAM.log-v1-0)
12-Dec-2019 00:28:27 2019-12-12 00:28:27.426  INFO 5484 --- [           main] o.s.c.d.a.test.NamedChannelTests         : Looking for 'abcdefg' in logfile for log
12-Dec-2019 00:28:37 2019-12-12 00:28:37.426  INFO 5484 --- [           main] o.s.c.d.a.test.NamedChannelTests         : Requesting log for app TAPSTREAM.log-v1-0
12-Dec-2019 00:28:37 2019-12-12 00:28:37.434  INFO 5484 --- [           main] o.s.c.d.a.test.NamedChannelTests         : Retrieved logfile from 'http://10.194.6.131:47390/actuator/logfile
12-Dec-2019 00:28:37 2019-12-12 00:28:37.434  INFO 5484 --- [           main] o.s.c.d.a.test.NamedChannelTests         : Matched all 'abcdefg' in logfile for app log (source TAPSTREAM.log-v1-0)
12-Dec-2019 00:28:37 2019-12-12 00:28:37.437  INFO 5484 --- [           main] junit.logTestName                        : Test testTap(org.springframework.cloud.dataflow.acceptance.test.NamedChannelTests) Succeeded
12-Dec-2019 00:28:37 2019-12-12 00:28:37.437  INFO 5484 --- [           main] junit.logTestName                        : Finished Test testTap(org.springframework.cloud.dataflow.acceptance.test.NamedChannelTests)
12-Dec-2019 00:28:37 2019-12-12 00:28:37.437  INFO 5484 --- [           main] o.s.c.d.a.test.NamedChannelTests         : Destroy all streams
12-Dec-2019 00:28:37 2019-12-12 00:28:37.822  INFO 5484 --- [           main] junit.logTestName                        : Starting Test manyToOneTest(org.springframework.cloud.dataflow.acceptance.test.NamedChannelTests)
12-Dec-2019 00:28:37 2019-12-12 00:28:37.823  INFO 5484 --- [           main] o.s.c.d.a.test.NamedChannelTests         : Creating stream 'MANY-TO-ONE'
12-Dec-2019 00:28:37 2019-12-12 00:28:37.848  INFO 5484 --- [           main] o.s.c.d.a.test.NamedChannelTests         : Deploying stream 'MANY-TO-ONE' with properties: {app.*.spring.cloud.streamapp.security.enabled=false, app.*.logging.file=${PID}-test.log, app.*.endpoints.logfile.sensitive=false, app.*.management.endpoints.web.exposure.include=*}
12-Dec-2019 00:28:38 2019-12-12 00:28:38.227  INFO 5484 --- [           main] o.s.c.d.a.test.NamedChannelTests         : Checking: Stream=MANY-TO-ONE, status = deploying, status description = The stream is being deployed.
12-Dec-2019 00:28:38 2019-12-12 00:28:38.228  INFO 5484 --- [           main] o.s.c.d.a.test.NamedChannelTests         : Sleeping to check status of Stream=MANY-TO-ONE
12-Dec-2019 00:28:48 2019-12-12 00:28:48.252  INFO 5484 --- [           main] o.s.c.d.a.test.NamedChannelTests         : Checking: Stream=MANY-TO-ONE, status = deployed, status description = The stream has been successfully deployed
12-Dec-2019 00:28:48 2019-12-12 00:28:48.272  INFO 5484 --- [           main] o.s.c.d.a.test.NamedChannelTests         : Sleeping to check status of Stream=MANY-TO-ONE
12-Dec-2019 00:28:58 2019-12-12 00:28:58.273  INFO 5484 --- [           main] o.s.c.d.a.test.NamedChannelTests         : Stream 'MANY-TO-ONE' started with status: deployed
12-Dec-2019 00:28:58 2019-12-12 00:28:58.273  INFO 5484 --- [           main] o.s.c.d.a.test.NamedChannelTests         : App 'log' has instances: {MANY-TO-ONE.log-v1-0=http://10.194.6.131:55591}
12-Dec-2019 00:28:58 2019-12-12 00:28:58.273  INFO 5484 --- [           main] o.s.c.d.a.test.NamedChannelTests         : Looking for 'Started LogSink' in logfile for log
12-Dec-2019 00:29:08 2019-12-12 00:29:08.273  INFO 5484 --- [           main] o.s.c.d.a.test.NamedChannelTests         : Requesting log for app MANY-TO-ONE.log-v1-0
12-Dec-2019 00:29:08 2019-12-12 00:29:08.552  INFO 5484 --- [           main] o.s.c.d.a.test.NamedChannelTests         : Retrieved logfile from 'http://10.194.6.131:55591/actuator/logfile
12-Dec-2019 00:29:08 2019-12-12 00:29:08.553  INFO 5484 --- [           main] o.s.c.d.a.test.NamedChannelTests         : Matched all 'Started LogSink' in logfile for app log (source MANY-TO-ONE.log-v1-0)
12-Dec-2019 00:29:08 2019-12-12 00:29:08.553  INFO 5484 --- [           main] o.s.c.d.a.test.NamedChannelTests         : Creating stream 'HTTP-SOURCE-1'
12-Dec-2019 00:29:08 2019-12-12 00:29:08.580  INFO 5484 --- [           main] o.s.c.d.a.test.NamedChannelTests         : Deploying stream 'HTTP-SOURCE-1' with properties: {app.*.spring.cloud.streamapp.security.enabled=false, app.*.logging.file=${PID}-test.log, app.*.endpoints.logfile.sensitive=false, app.*.management.endpoints.web.exposure.include=*}
12-Dec-2019 00:29:08 2019-12-12 00:29:08.969  INFO 5484 --- [           main] o.s.c.d.a.test.NamedChannelTests         : Checking: Stream=HTTP-SOURCE-1, status = deploying, status description = The stream is being deployed.
12-Dec-2019 00:29:08 2019-12-12 00:29:08.969  INFO 5484 --- [           main] o.s.c.d.a.test.NamedChannelTests         : Sleeping to check status of Stream=HTTP-SOURCE-1
12-Dec-2019 00:29:19 2019-12-12 00:29:19.033  INFO 5484 --- [           main] o.s.c.d.a.test.NamedChannelTests         : Checking: Stream=HTTP-SOURCE-1, status = deployed, status description = The stream has been successfully deployed
12-Dec-2019 00:29:19 2019-12-12 00:29:19.060  INFO 5484 --- [           main] o.s.c.d.a.test.NamedChannelTests         : Sleeping to check status of Stream=HTTP-SOURCE-1
12-Dec-2019 00:29:29 2019-12-12 00:29:29.060  INFO 5484 --- [           main] o.s.c.d.a.test.NamedChannelTests         : Stream 'HTTP-SOURCE-1' started with status: deployed
12-Dec-2019 00:29:29 2019-12-12 00:29:29.061  INFO 5484 --- [           main] o.s.c.d.a.test.NamedChannelTests         : App 'http' has instances: {HTTP-SOURCE-1.http-v1-0=http://10.194.6.131:48440}
12-Dec-2019 00:29:29 2019-12-12 00:29:29.061  INFO 5484 --- [           main] o.s.c.d.a.test.NamedChannelTests         : Looking for 'Started HttpSource' in logfile for http
12-Dec-2019 00:29:39 2019-12-12 00:29:39.061  INFO 5484 --- [           main] o.s.c.d.a.test.NamedChannelTests         : Requesting log for app HTTP-SOURCE-1.http-v1-0
12-Dec-2019 00:29:39 2019-12-12 00:29:39.344  INFO 5484 --- [           main] o.s.c.d.a.test.NamedChannelTests         : Retrieved logfile from 'http://10.194.6.131:48440/actuator/logfile
12-Dec-2019 00:29:39 2019-12-12 00:29:39.344  INFO 5484 --- [           main] o.s.c.d.a.test.NamedChannelTests         : Matched all 'Started HttpSource' in logfile for app http (source HTTP-SOURCE-1.http-v1-0)
12-Dec-2019 00:29:39 2019-12-12 00:29:39.344  INFO 5484 --- [           main] o.s.c.d.a.test.NamedChannelTests         : Creating stream 'HTTP-SOURCE-2'
12-Dec-2019 00:29:39 2019-12-12 00:29:39.372  INFO 5484 --- [           main] o.s.c.d.a.test.NamedChannelTests         : Deploying stream 'HTTP-SOURCE-2' with properties: {app.*.spring.cloud.streamapp.security.enabled=false, app.*.logging.file=${PID}-test.log, app.*.endpoints.logfile.sensitive=false, app.*.management.endpoints.web.exposure.include=*}
12-Dec-2019 00:29:39 2019-12-12 00:29:39.776  INFO 5484 --- [           main] o.s.c.d.a.test.NamedChannelTests         : Checking: Stream=HTTP-SOURCE-2, status = deploying, status description = The stream is being deployed.
12-Dec-2019 00:29:39 2019-12-12 00:29:39.776  INFO 5484 --- [           main] o.s.c.d.a.test.NamedChannelTests         : Sleeping to check status of Stream=HTTP-SOURCE-2
12-Dec-2019 00:29:49 2019-12-12 00:29:49.846  INFO 5484 --- [           main] o.s.c.d.a.test.NamedChannelTests         : Checking: Stream=HTTP-SOURCE-2, status = deployed, status description = The stream has been successfully deployed
12-Dec-2019 00:29:49 2019-12-12 00:29:49.886  INFO 5484 --- [           main] o.s.c.d.a.test.NamedChannelTests         : Sleeping to check status of Stream=HTTP-SOURCE-2
12-Dec-2019 00:29:59 2019-12-12 00:29:59.887  INFO 5484 --- [           main] o.s.c.d.a.test.NamedChannelTests         : Stream 'HTTP-SOURCE-2' started with status: deployed
12-Dec-2019 00:29:59 2019-12-12 00:29:59.887  INFO 5484 --- [           main] o.s.c.d.a.test.NamedChannelTests         : App 'http' has instances: {HTTP-SOURCE-2.http-v1-0=http://10.194.6.131:41949}
12-Dec-2019 00:29:59 2019-12-12 00:29:59.887  INFO 5484 --- [           main] o.s.c.d.a.test.NamedChannelTests         : Looking for 'Started HttpSource' in logfile for http
12-Dec-2019 00:30:09 2019-12-12 00:30:09.887  INFO 5484 --- [           main] o.s.c.d.a.test.NamedChannelTests         : Requesting log for app HTTP-SOURCE-2.http-v1-0
12-Dec-2019 00:30:10 2019-12-12 00:30:10.144  INFO 5484 --- [           main] o.s.c.d.a.test.NamedChannelTests         : Retrieved logfile from 'http://10.194.6.131:41949/actuator/logfile
12-Dec-2019 00:30:10 2019-12-12 00:30:10.144  INFO 5484 --- [           main] o.s.c.d.a.test.NamedChannelTests         : Matched all 'Started HttpSource' in logfile for app http (source HTTP-SOURCE-2.http-v1-0)
12-Dec-2019 00:30:10 2019-12-12 00:30:10.277  INFO 5484 --- [           main] o.s.c.d.a.test.NamedChannelTests         : Looking for 'abcdefg' in logfile for log
12-Dec-2019 00:30:20 2019-12-12 00:30:20.278  INFO 5484 --- [           main] o.s.c.d.a.test.NamedChannelTests         : Requesting log for app MANY-TO-ONE.log-v1-0
12-Dec-2019 00:30:20 2019-12-12 00:30:20.289  INFO 5484 --- [           main] o.s.c.d.a.test.NamedChannelTests         : Retrieved logfile from 'http://10.194.6.131:55591/actuator/logfile
12-Dec-2019 00:30:20 2019-12-12 00:30:20.289  INFO 5484 --- [           main] o.s.c.d.a.test.NamedChannelTests         : Matched all 'abcdefg' in logfile for app log (source MANY-TO-ONE.log-v1-0)
12-Dec-2019 00:30:20 2019-12-12 00:30:20.454  INFO 5484 --- [           main] o.s.c.d.a.test.NamedChannelTests         : Looking for 'hijklmn' in logfile for log
12-Dec-2019 00:30:30 2019-12-12 00:30:30.455  INFO 5484 --- [           main] o.s.c.d.a.test.NamedChannelTests         : Requesting log for app MANY-TO-ONE.log-v1-0
12-Dec-2019 00:30:30 2019-12-12 00:30:30.464  INFO 5484 --- [           main] o.s.c.d.a.test.NamedChannelTests         : Retrieved logfile from 'http://10.194.6.131:55591/actuator/logfile
12-Dec-2019 00:30:30 2019-12-12 00:30:30.465  INFO 5484 --- [           main] o.s.c.d.a.test.NamedChannelTests         : Matched all 'hijklmn' in logfile for app log (source MANY-TO-ONE.log-v1-0)
12-Dec-2019 00:30:30 2019-12-12 00:30:30.466  INFO 5484 --- [           main] junit.logTestName                        : Test manyToOneTest(org.springframework.cloud.dataflow.acceptance.test.NamedChannelTests) Succeeded
12-Dec-2019 00:30:30 2019-12-12 00:30:30.466  INFO 5484 --- [           main] junit.logTestName                        : Finished Test manyToOneTest(org.springframework.cloud.dataflow.acceptance.test.NamedChannelTests)
12-Dec-2019 00:30:30 2019-12-12 00:30:30.466  INFO 5484 --- [           main] o.s.c.d.a.test.NamedChannelTests         : Destroy all streams
12-Dec-2019 00:30:30 Tests run: 4, Failures: 0, Errors: 0, Skipped: 1, Time elapsed: 277.656 sec - in org.springframework.cloud.dataflow.acceptance.test.NamedChannelTests
12-Dec-2019 00:30:30 Running org.springframework.cloud.dataflow.acceptance.test.util.PlatformHelperTests
12-Dec-2019 00:30:30 Tests run: 3, Failures: 0, Errors: 0, Skipped: 0, Time elapsed: 0.096 sec - in org.springframework.cloud.dataflow.acceptance.test.util.PlatformHelperTests
12-Dec-2019 00:30:30 Running org.springframework.cloud.dataflow.acceptance.test.util.ApplicationTests
12-Dec-2019 00:30:30 Tests run: 2, Failures: 0, Errors: 0, Skipped: 0, Time elapsed: 0 sec - in org.springframework.cloud.dataflow.acceptance.test.util.ApplicationTests
12-Dec-2019 00:30:30 2019-12-12 00:30:30.958  INFO 5484 --- [       Thread-6] o.s.c.support.GenericApplicationContext  : Closing org.springframework.context.support.GenericApplicationContext@6e7c351d: startup date [Thu Dec 12 00:11:57 UTC 2019]; root of context hierarchy
12-Dec-2019 00:30:31
12-Dec-2019 00:30:31 Results :
12-Dec-2019 00:30:31
12-Dec-2019 00:30:31 Failed tests:
12-Dec-2019 00:30:31   ComposedTaskTests.ctrLaunch:41->assertTaskExecutions:65 null
12-Dec-2019 00:30:31   ComposedTaskTests.ctrMultipleLaunch:47->assertTaskExecutions:65 null
12-Dec-2019 00:30:31   ComposedTaskTests.ctrMultipleLaunchWithArguments:57->assertTaskExecutions:65 null
12-Dec-2019 00:30:31
12-Dec-2019 00:30:31 Tests run: 22, Failures: 3, Errors: 0, Skipped: 4
12-Dec-2019 00:30:31
12-Dec-2019 00:30:31 [INFO] ------------------------------------------------------------------------
12-Dec-2019 00:30:31 [INFO] BUILD FAILURE
12-Dec-2019 00:30:31 [INFO] ------------------------------------------------------------------------
12-Dec-2019 00:30:31 [INFO] Total time: 21:24 min
12-Dec-2019 00:30:31 [INFO] Finished at: 2019-12-12T00:30:31+00:00
12-Dec-2019 00:30:31 [INFO] Final Memory: 51M/449M
12-Dec-2019 00:30:31 [INFO] ------------------------------------------------------------------------
12-Dec-2019 00:30:31 [ERROR] Failed to execute goal org.apache.maven.plugins:maven-surefire-plugin:2.18.1:test (default-test) on project spring-cloud-dataflow-acceptance-tests: There are test failures.
12-Dec-2019 00:30:31 [ERROR]
12-Dec-2019 00:30:31 [ERROR] Please refer to /opt/bamboo-home/xml-data/build-dir/SCDT-LOCAL20XSKIPPER20X-KAFKA/target/surefire-reports for the individual test results.
12-Dec-2019 00:30:31 [ERROR] -> [Help 1]
12-Dec-2019 00:30:31 [ERROR]
12-Dec-2019 00:30:31 [ERROR] To see the full stack trace of the errors, re-run Maven with the -e switch.
12-Dec-2019 00:30:31 [ERROR] Re-run Maven using the -X switch to enable full debug logging.
12-Dec-2019 00:30:31 [ERROR]
12-Dec-2019 00:30:31 [ERROR] For more information about the errors and possible solutions, please read the following articles:
12-Dec-2019 00:30:31 [ERROR] [Help 1] http://cwiki.apache.org/confluence/display/MAVEN/MojoFailureException
12-Dec-2019 00:30:31 Clean up, clean up, everybody everywhere; clean up clean up, everybody do your share!
12-Dec-2019 00:30:31 Clean up servers
12-Dec-2019 00:30:31 Killing process PID [5307]
12-Dec-2019 00:30:31 Killing process PID [5196]
12-Dec-2019 00:30:32 No stopped containers
12-Dec-2019 00:30:32 Stopping mysql_mysql_1 ...
12-Dec-2019 00:30:34
12-Dec-2019 00:30:34 Stopping mysql_mysql_1 ... done
12-Dec-2019 00:30:34 Removing mysql_mysql_1 ...
12-Dec-2019 00:30:34
12-Dec-2019 00:30:34 Removing mysql_mysql_1 ... done
12-Dec-2019 00:30:34 Going to remove mysql_mysql_1
12-Dec-2019 00:30:34 Stopping kafka_zookeeper_1 ...
12-Dec-2019 00:30:34 Stopping kafka_kafka_1     ...
12-Dec-2019 00:30:38
12-Dec-2019 00:30:38 Stopping kafka_kafka_1     ... done
12-Dec-2019 00:30:45
12-Dec-2019 00:30:45 Stopping kafka_zookeeper_1 ... done
12-Dec-2019 00:30:45 Removing kafka_zookeeper_1 ...
12-Dec-2019 00:30:45 Removing kafka_kafka_1     ...
12-Dec-2019 00:30:45
12-Dec-2019 00:30:45 Removing kafka_zookeeper_1 ... done
12-Dec-2019 00:30:45
12-Dec-2019 00:30:45 Removing kafka_kafka_1     ... done
12-Dec-2019 00:30:45 Going to remove kafka_zookeeper_1, kafka_kafka_1
12-Dec-2019 00:30:45
12-Dec-2019 00:30:45 Finished task 'Execute Acceptance Tests' with result: Success
12-Dec-2019 00:30:45 Starting task 'JUnit Parser' of type 'com.atlassian.bamboo.plugins.testresultparser:task.testresultparser.junit'
12-Dec-2019 00:30:45 Parsing test results under /opt/bamboo-home/xml-data/build-dir/SCDT-LOCAL20XSKIPPER20X-KAFKA...
12-Dec-2019 00:30:45 Failing task since 3 failing test cases were found.
12-Dec-2019 00:30:45 Finished task 'JUnit Parser' with result: Failed
12-Dec-2019 00:30:45 Starting task 'clean up' of type 'com.atlassian.bamboo.plugins.scripttask:task.builder.script'
12-Dec-2019 00:30:45
Beginning to execute external process for build 'Spring Cloud Data Flow Acceptance Tests - Local + SCDF-2.0.4.BS + Skipper 2.0.4.BS (12 am) - Run Data Flow Acceptance Tests for Kafka #194 (SCDT-LOCAL20XSKIPPER20X-KAFKA-194)'
... running command line:
/opt/bamboo-home/temp/SCDT-LOCAL20XSKIPPER20X-KAFKA-194-ScriptBuildTask-1304485466600076637.sh
... in: /opt/bamboo-home/xml-data/build-dir/SCDT-LOCAL20XSKIPPER20X-KAFKA
... using extra environment variables:
bamboo_planRepository_1_branch=master
bamboo_********_username_password=********
bamboo_signing_store_password=********
bamboo_capability_system_builder_ant_Ant_1_9=/opt/ant-1.9
bamboo_capability_system_builder_ant_Ant_1_8=/opt/ant-1.8
bamboo_planRepository_1_branchDisplayName=master
bamboo_repository_274694331_git_username=spring-buildmaster
bamboo_artifactory_override_resolve_repo=libs-milestone
bamboo_capability_system_builder_node_Node_js_10_16=/opt/node-10.16/bin/node
bamboo_repository_revision_number=ccc77f664d11e18a3b7f2fa17f012d09d08432a9
bamboo_RIAK_BIN=/usr/sbin/riak
bamboo_buildKey=SCDT-LOCAL20XSKIPPER20X-KAFKA
bamboo_repository_274694331_branch_name=master
bamboo_ge_cache_username=ci
bamboo_bintray_password=********
bamboo_sonar_token_password=********
bamboo_shortJobName=Run Data Flow Acceptance Tests for Kafka
bamboo_artifactory_override_resolver_password=********
bamboo_sonatype_token=RSJChaox
bamboo_capability_system_builder_gradle___gradlew=./gradlew
bamboo_buildResultsUrl=https://build.spring.io/browse/SCDT-LOCAL20XSKIPPER20X-KAFKA-194
bamboo_capability_system_builder_mvn3_Maven_3_3=/opt/maven-3.3
bamboo_capability_system_builder_mvn3_Maven_3_2=/opt/maven-3.2
bamboo_capability_system_builder_mvn3_Maven_3_1=/opt/maven-3.1
bamboo_planRepository_repositoryUrl=https://github.com/spring-cloud/spring-cloud-dataflow-acceptance-tests.git
bamboo_capability_system_builder_mvn3_Maven_3_6=/opt/maven-3.6
bamboo_agentId=286195722
bamboo_capability_system_builder_mvn3_Maven_3_5=/opt/maven-3.5
bamboo_capability_system_builder_mvn3_Maven_3_0=/opt/maven-3.0
bamboo_planRepository_revision=ccc77f664d11e18a3b7f2fa17f012d09d08432a9
bamboo_planRepository_previousRevision=ccc77f664d11e18a3b7f2fa17f012d09d08432a9
bamboo_capability_remote_build=true
bamboo_repository_branch_name=master
bamboo_sonatype_token_password=********
bamboo_sonatype_user=springsource
bamboo_repository_274694331_name=Git
bamboo_scdf_acceptance_tests_password=********
bamboo_APPLE_AC_PASSWORD=********
bamboo_repository_274694331_git_branch=master
bamboo_planRepository_branch=master
bamboo_capability_system_jdk_JDK_13=/opt/jdk-13
bamboo_planRepository_1_type=gitv2
bamboo_planRepository_branchName=master
bamboo_capability_system_jdk_JDK_12=/opt/jdk-12
bamboo_capability_system_builder_gradlew_gradlew=./
bamboo_capability_system_builder_ant_Ant_1_10=/opt/ant-1.10
bamboo_sonar_password=********
bamboo_hg_cache_directory=/opt/bamboo-home/xml-data/build-dir/_hg-repositories-cache
bamboo_planRepository_1_username=spring-buildmaster
bamboo_repository_274694331_git_repositoryUrl=https://github.com/spring-cloud/spring-cloud-dataflow-acceptance-tests.git
bamboo_planRepository_type=gitv2
bamboo_git_cache_directory=/opt/bamboo-home/xml-data/build-dir/_git-repositories-cache
bamboo_artifactory_username=buildmaster
bamboo_tmp_directory=/opt/bamboo-home/temp
bamboo_planKey=SCDT-LOCAL20XSKIPPER20X
bamboo_planRepository_username=spring-buildmaster
bamboo_JDK8_HOME=/opt/jdk-8
bamboo_repository_274694331_previous_revision_number=ccc77f664d11e18a3b7f2fa17f012d09d08432a9
bamboo_planRepository_1_branchName=master
bamboo_sonar_version=6.7.7
bamboo_sonar_jdbc_password=********
bamboo_bintray_api_key_password=********
bamboo_capability_system_jdk_JDK_1_11=/opt/jdk-11
bamboo_resultsUrl=https://build.spring.io/browse/SCDT-LOCAL20XSKIPPER20X-KAFKA-194
bamboo_APPLE_AC_USERNAME_PASSWORD=********
bamboo_capability_system_jdk_JDK_1_10=/opt/jdk-10
bamboo_build_working_directory=/opt/bamboo-home/xml-data/build-dir/SCDT-LOCAL20XSKIPPER20X-KAFKA
bamboo_planRepository_1_name=Git
bamboo_capability_system_os=ubuntu1804
bamboo_nexusPush_stagingProfile=buildmaster
bamboo_shortPlanName=Local + SCDF-2.0.4.BS + Skipper 2.0.4.BS (12 am)
bamboo_planRepository_name=Git
bamboo_buildNumber=194
bamboo_planName=Spring Cloud Data Flow Acceptance Tests - Local + SCDF-2.0.4.BS + Skipper 2.0.4.BS (12 am)
bamboo_JDK7_HOME=/opt/jdk-7
bamboo_build_commandline_com_atlassian_bamboo_plugins_scripttask_task_builder_script_7=/opt/bamboo-home/temp/SCDT-LOCAL20XSKIPPER20X-KAFKA-194-ScriptBuildTask-5340752339533466428.sh
bamboo_shortPlanKey=LOCAL20XSKIPPER20X
bamboo_shortJobKey=KAFKA
bamboo_artifactory_password=********
bamboo_buildTimeStamp=2019-12-12T00:00:04.925Z
bamboo_repository_previous_revision_number=ccc77f664d11e18a3b7f2fa17f012d09d08432a9
bamboo_sonar_username=buildmaster
bamboo_********_password=********
bamboo_repository_git_branch=master
bamboo_buildResultKey=SCDT-LOCAL20XSKIPPER20X-KAFKA-194
bamboo_nexusPush_close=true
bamboo_artifactory_override_resolver_username=buildmaster
bamboo_buildPlanName=Spring Cloud Data Flow Acceptance Tests - Local + SCDF-2.0.4.BS + Skipper 2.0.4.BS (12 am) - Run Data Flow Acceptance Tests for Kafka
bamboo_repository_274694331_revision_number=ccc77f664d11e18a3b7f2fa17f012d09d08432a9
bamboo_planRepository_1_revision=ccc77f664d11e18a3b7f2fa17f012d09d08432a9
bamboo_repository_name=Git
bamboo_signing_key_password=********
bamboo_capability_system_builder_groovy_Groovy_2_5=/opt/groovy-2.5
bamboo_buildFailed=true
bamboo_capability_system_docker_executable=/usr/bin/docker
bamboo_capability_system_jdk_OpenJDK_7=/opt/jdk-7
bamboo_capability_system_builder_groovy_Groovy_2_4=/opt/groovy-2.4
bamboo_artifactory_override_deployer_username=buildmaster
bamboo_capability_system_builder_command_Bash=/bin/bash
bamboo_jobFailed=true
bamboo_agentWorkingDirectory=/opt/bamboo-home/xml-data/build-dir
bamboo_capability_system_git_executable=/usr/bin/git
bamboo_repository_git_username=spring-buildmaster
bamboo_planRepository_1_previousRevision=ccc77f664d11e18a3b7f2fa17f012d09d08432a9
bamboo_capability_os_family=unix
bamboo_planRepository_branchDisplayName=master
bamboo_capability_system_builder_maven_Artifactory_Maven_3_6=/opt/maven-3.6
bamboo_capability_system_builder_maven_Artifactory_Maven_3_5=/opt/maven-3.5
bamboo_capability_system_builder_maven_Artifactory_Maven_3_3=/opt/maven-3.3
bamboo_capability_system_builder_maven_Artifactory_Maven_3_2=/opt/maven-3.2
bamboo_s3_properties=/home/bamboo/tools/s3.properties
bamboo_capability_system_builder_maven_Artifactory_Maven_3_1=/opt/maven-3.1
bamboo_artifactory_override_deploy_repo=libs-snapshot-local
bamboo_capability_system_builder_maven_Artifactory_Maven_3_0=/opt/maven-3.0
bamboo_plan_storageTag=plan-274497908
bamboo_bintray_username_password=********
bamboo_repository_git_repositoryUrl=https://github.com/spring-cloud/spring-cloud-dataflow-acceptance-tests.git
bamboo_working_directory=/opt/bamboo-home/xml-data/build-dir/SCDT-LOCAL20XSKIPPER20X-KAFKA
bamboo_planRepository_1_repositoryUrl=https://github.com/spring-cloud/spring-cloud-dataflow-acceptance-tests.git
bamboo_capability_system_jdk_JDK_1_8=/opt/jdk-8
bamboo_artifactory_override_deployer_password=********
bamboo_capability_system_jdk_JDK_1_9=/opt/jdk-9
bamboo_capability_system_jdk_JDK_1_6=/opt/jdk-6
bamboo_sonatype_password=********
bamboo_capability_system_jdk_JDK_1_7=/opt/jdk-7
bamboo_sonar_ip=10.194.6.9
bamboo_ge_cache_password=********
12-Dec-2019 00:30:45 CLEANING UP RESOURCES AFTER RUNNING TESTS
12-Dec-2019 00:30:45 Environment variable JAVA_HOME must be set
12-Dec-2019 00:30:45 FINISHED CLEANING UP RESOURCES
12-Dec-2019 00:30:45 Finished task 'clean up' with result: Success
12-Dec-2019 00:30:45 Running post build plugin 'Docker Container Cleanup'
12-Dec-2019 00:30:45 Running post build plugin 'NCover Results Collector'
12-Dec-2019 00:30:45 Running post build plugin 'Artifactory Release Management Staging'
12-Dec-2019 00:30:45 Running post build plugin 'Artifactory Build Info Copier'
12-Dec-2019 00:30:45 Running post build plugin 'Artifactory Gradle Properties Info Copier'
12-Dec-2019 00:30:45 Running post build plugin 'Clover Results Collector'
12-Dec-2019 00:30:45 Running post build plugin 'npm Cache Cleanup'
12-Dec-2019 00:30:45 Running post build plugin 'Artifact Copier'
12-Dec-2019 00:30:45 Publishing an artifact: App and Server Logs
12-Dec-2019 00:30:45 Finished publishing of artifact Non required job artifact: [App and Server Logs], pattern: [**/*.log] anchored at: [local] in 38.97 ms
12-Dec-2019 00:30:45 Publishing an artifact: Test Results
12-Dec-2019 00:30:45 Finished publishing of artifact Non required job artifact: [Test Results], pattern: [**/target/surefire-reports/**/*.*] in 36.44 ms
12-Dec-2019 00:30:46 Successfully removed working directory at '/opt/bamboo-home/xml-data/build-dir/SCDT-LOCAL20XSKIPPER20X-KAFKA'
12-Dec-2019 00:30:46 Finalising the build...
12-Dec-2019 00:30:46 Stopping timer.
12-Dec-2019 00:30:46 Build SCDT-LOCAL20XSKIPPER20X-KAFKA-194 completed.
12-Dec-2019 00:30:46 Running on server: post build plugin 'NCover Results Collector'
12-Dec-2019 00:30:46 Running on server: post build plugin 'Build Hanging Detection Configuration'
12-Dec-2019 00:30:46 Running on server: post build plugin 'Bamboo project link creator'
12-Dec-2019 00:30:46 Running on server: post build plugin 'Clover Delta Calculator'
12-Dec-2019 00:30:46 Running on server: post build plugin 'Maven Dependencies Postprocessor'
12-Dec-2019 00:30:46 All post build plugins have finished
12-Dec-2019 00:30:46 Generating build results summary...
12-Dec-2019 00:30:46 Saving build results to disk...
12-Dec-2019 00:30:46 Logging substituted variables...
12-Dec-2019 00:30:46 Indexing build results...
12-Dec-2019 00:30:46 Finished building SCDT-LOCAL20XSKIPPER20X-KAFKA-194.